{"text_format":"1","workbook":"xlsx","n_sheets":13,"sheets":["Readme","Data Example","Library Info Input","Library Pool #1","Library Pool #2","Library Pool #3","Library Pool #4","Library Pool #5","Library Pool #6","Summary sheet","csv for Connect","WorksheetWillHide","Sheet3"],"not_rendered":{"charts":0,"images":6,"macros":1,"external_links":1,"defined_names":33,"comments":0,"pivot_tables":0},"unopened":[],"bounds":{"document_bytes":16777216,"sheet_cells":100000,"rows_first":2000,"rows_last":500,"rows_between":2000,"halvings":0,"cell_chars":16384,"cell_head_chars":4096},"cells_cut":0,"cells_raw":0,"read":"whole","date_system":"1900"}

{"sheet":"Readme","index":0,"n_rows":35,"n_cols":11,"rows_kept":35,"cut":false,"hidden":false,"merged":[[34,1,34,11],[35,0,35,12],[1,3,1,8],[2,3,2,8],[0,0,3,2],[0,3,0,8],[3,3,3,8],[0,9,0,11],[3,9,3,11],[0,12,3,12],[1,10,1,11],[2,10,2,11],[15,2,15,11],[30,1,30,11],[31,1,31,11],[32,1,32,11],[33,0,33,12],[10,2,10,11],[12,2,12,11],[13,2,13,11],[14,2,14,11],[24,2,24,11],[28,0,28,12],[29,1,29,11],[27,0,27,12],[20,2,20,11],[22,2,22,11],[23,2,23,11],[26,2,26,11],[21,2,21,11],[25,2,25,11],[19,2,19,11],[5,1,5,11],[6,1,6,11],[9,0,9,12],[18,0,18,12],[17,0,17,12],[8,0,8,12],[7,0,7,12]]}
[]
[null,null,null,"Chromium Connect",null,null,null,null,null,"Doc","CG000466"]
[null,null,null,"32 Library Pooling Workbook",null,null,null,null,null,"Rev","A"]
[]
["Scope"]
[null,"Use this workbook to calculate the library dilutions and volumes required to assemble up to six library pools for sequencing using up to 32 component libraries generated from the Chromium Connect Instrument."]
[null,"For complete protocols, consult the Chromium Connect Instrument User Guide (CG000180), Chromium Next GEM Automated Single Cell 3' Reagent Kits v3.1 User Guide (CG000286), or Chromium Next GEM Automated Single Cell 5' Reagent Kits v2 User Guide (CG000384)."]
[]
[]
["Required Information"]
{"$rows_left_out":26}
{"sheet":"Data Example","index":1,"n_rows":24,"n_cols":11,"rows_kept":24,"cut":false,"hidden":false,"merged":[[0,0,3,2],[0,3,0,8],[0,9,0,11],[0,18,3,18],[1,3,1,8],[1,10,1,11],[2,3,2,8],[2,10,2,11],[3,3,3,8],[3,9,3,11],[13,0,13,18],[5,1,5,11],[6,1,6,11],[7,0,7,18],[8,0,8,18],[26,0,26,18],[9,0,9,18],[10,0,10,18],[11,0,11,18],[14,1,14,11],[22,0,22,18],[25,2,25,11],[23,0,23,18],[24,1,24,11],[16,2,16,11],[17,2,17,11],[18,2,18,11],[21,0,21,18],[19,0,19,18],[20,1,20,11],[12,0,12,18]]}
[]
[null,null,null,"Chromium Connect",null,null,null,null,null,"Doc","CG000466"]
[null,null,null,"32 Library Pooling Workbook",null,null,null,null,null,"Rev","A"]
[]
["Enter data in the \"Library Info Input\" tab"]
[null,"Refer to data entry rules on \"Readme\" tab."]
[]
[]
["Click on \"Import Pool Data\" button"]
[]
{"$rows_left_out":15}
{"sheet":"Library Info Input","index":2,"n_rows":35,"n_cols":9,"rows_kept":35,"cut":false,"hidden":false,"merged":[[0,1,0,9],[1,1,1,8]]}
[null,"Chromium Connect Pooling Workbook  |  10xgenomics.com"]
[null,"After entering library information in the blue cells below, click this button to autofill Library Pool tabs --"]
[null,"Library Pool","Tube Position\n(Tube Strip #, A-H)","Library ID","Sample Index","Average Library Size (bp)","Library Concentration (nM)","Cells/ sample","Reads/cell"]
[null,1,"1A","Library-1","SI-TT-A1",491,10,5000,50000]
[null,null,"1B"]
[null,null,"1C"]
[null,null,"1D"]
[null,null,"1E"]
[null,null,"1F"]
[null,null,"1G"]
{"$rows_left_out":26}
{"sheet":"Library Pool #1","index":3,"n_rows":57,"n_cols":18,"rows_kept":57,"cut":false,"hidden":false,"merged":[[44,4,44,6],[43,15,43,16],[45,1,45,4],[43,1,43,4],[4,7,4,10],[5,7,5,10],[6,7,6,10],[44,15,44,16],[8,14,8,16]]}
[null,"Chromium Connect Pooling Workbook  |  10xgenomics.com"]
[null,"Library Pool #1"]
[]
[null,"Conditions",null,null,null,null,"Legend"]
[null," •  Final Transfer Volume of libraries must be between 3-20 µl ",null,null,null,null,"Blue"," Fields where data need to be entered manually",null,null,null,null,null,"Pool Number_",1]
[null," •  Target Library Pool Volume must be between 50-300 µl",null,null,null,null,"Green"," Volumes to enter on Chromium Connect",null,null,null,null,null,"Target Library Pool Concentration_",3,"nM"]
[null," •  Dilution Factors must be integers between 1-10",null,null,null,null,"Red"," Verify that value is correct",null,null,null,null,null,"Target Library Pool Volume_",50,"uL"]
[]
[null,null,null,null,null,null,null,null,null,null,null,null,null,null,"Intermediate Dilution on Deck"]
[null,"Library Pool 1","Tube Position (Tube Strip #, A-H)","Library ID","Average Library Size (bp)","Prorated Size","Library Concentration (nM)","Dilution Factor","Working  Concentration (nM)","Cells/ sample","Reads/cell","Reads/\nsample","Fraction of Total Pool Reads","Individual Library Concentration (nM)","Library Dilution Volume (µl)","Diluent Dilution Volume (µl)","Total\nVolume (µl)","Final Transfer Volume (µl)"]
{"$rows_left_out":48}
{"sheet":"Library Pool #2","index":4,"n_rows":57,"n_cols":18,"rows_kept":57,"cut":false,"hidden":false,"merged":[[45,1,45,4],[8,14,8,16],[6,7,6,10]]}
[null,"Chromium Connect Pooling Workbook  |  10xgenomics.com"]
[null,"Library Pool #2"]
[]
[null,"Conditions",null,null,null,null,"Legend"]
[null," •  Final Transfer Volume of libraries must be between 3-20 µl ",null,null,null,null,"Blue"," Fields where data need to be entered manually",null,null,null,null,null,"Pool Number_",2]
[null," •  Target Library Pool Volume must be between 50-300 µl",null,null,null,null,"Green"," Volumes to enter on Chromium Connect",null,null,null,null,null,"Target Library Pool Concentration_",3,"nM"]
[null," •  Dilution Factors must be integers between 1-10",null,null,null,null,"Red"," Verify that value is correct",null,null,null,null,null,"Target Library Pool Volume_",0,"uL"]
[]
[null,null,null,null,null,null,null,null,null,null,null,null,null,null,"Intermediate Dilution on Deck"]
[null,"Library Pool 2","Tube Position (Tube Strip #, A-H)","Library ID","Average Library Size (bp)","Prorated Size","Library Concentration (nM)","Dilution Factor","Working  Concentration (nM)","Cells/ sample","Reads/cell ","Reads/\nsample","Fraction of Total Pool Reads","Individual Library Concentration (nM)","Library Dilution Volume (µl)","Diluent Dilution Volume (µl)","Total\nVolume (µl)","Final Transfer Volume (µl)"]
{"$rows_left_out":48}
{"sheet":"Library Pool #3","index":5,"n_rows":57,"n_cols":18,"rows_kept":57,"cut":false,"hidden":false,"merged":[[8,14,8,16],[45,1,45,4],[6,7,6,10]]}
[null,"Chromium Connect Pooling Workbook  |  10xgenomics.com"]
[null,"Library Pool #3"]
[]
[null,"Conditions",null,null,null,null,"Legend"]
[null," •  Final Transfer Volume of libraries must be between 3-20 µl ",null,null,null,null,"Blue"," Fields where data need to be entered manually",null,null,null,null,null,"Pool Number_",3]
[null," •  Target Library Pool Volume must be between 50-300 µl",null,null,null,null,"Green"," Volumes to enter on Chromium Connect",null,null,null,null,null,"Target Library Pool Concentration_",3,"nM"]
[null," •  Dilution Factors must be integers between 1-10",null,null,null,null,"Red"," Verify that value is correct",null,null,null,null,null,"Target Library Pool Volume_",0,"uL"]
[]
[null,null,null,null,null,null,null,null,null,null,null,null,null,null,"Intermediate Dilution on Deck"]
[null,"Library Pool 3","Tube Position (Tube Strip #, A-H)","Library ID","Average Library Size (bp)","Prorated Size","Library Concentration (nM)","Dilution Factor","Working  Concentration (nM)","Cells/ sample","Reads/cell ","Reads/\nsample","Fraction of Total Pool Reads","Individual Library Concentration (nM)","Library Dilution Volume (µl)","Diluent Dilution Volume (µl)","Total\nVolume (µl)","Final Transfer Volume (µl)"]
{"$rows_left_out":48}
{"sheet":"Library Pool #4","index":6,"n_rows":57,"n_cols":18,"rows_kept":57,"cut":false,"hidden":false,"merged":[[8,14,8,16],[45,1,45,4],[6,7,6,10]]}
[null,"Chromium Connect Pooling Workbook  |  10xgenomics.com"]
[null,"Library Pool #4"]
[]
[null,"Conditions",null,null,null,null,"Legend"]
[null," •  Final Transfer Volume of libraries must be between 3-20 µl ",null,null,null,null,"Blue"," Fields where data need to be entered manually",null,null,null,null,null,"Pool Number_",4]
[null," •  Target Library Pool Volume must be between 50-300 µl",null,null,null,null,"Green"," Volumes to enter on Chromium Connect",null,null,null,null,null,"Target Library Pool Concentration_",3,"nM"]
[null," •  Dilution Factors must be integers between 1-10",null,null,null,null,"Red"," Verify that value is correct",null,null,null,null,null,"Target Library Pool Volume_",0,"uL"]
[]
[null,null,null,null,null,null,null,null,null,null,null,null,null,null,"Intermediate Dilution on Deck"]
[null,"Library Pool 4","Tube Position (Tube Strip #, A-H)","Library ID","Average Library Size (bp)","Prorated Size","Library Concentration (nM)","Dilution Factor","Working  concentration (nM)","Cells/ sample","Reads/cell","Reads/\nsample","Fraction of Total Pool Reads","Individual Library Concentration (nM)","Library Dilution Volume (µl)","Diluent Dilution Volume (µl)","Total\nVolume (µl)","Final Transfer Volume (µl)"]
{"$rows_left_out":48}
{"sheet":"Library Pool #5","index":7,"n_rows":57,"n_cols":18,"rows_kept":57,"cut":false,"hidden":false,"merged":[[8,14,8,16],[45,1,45,4],[6,7,6,10]]}
[null,"Chromium Connect Pooling Workbook  |  10xgenomics.com"]
[null,"Library Pool #5"]
[]
[null,"Conditions",null,null,null,null,"Legend"]
[null," •  Final Transfer Volume of libraries must be between 3-20 µl ",null,null,null,null,"Blue"," Fields where data need to be entered manually",null,null,null,null,null,"Pool Number_",5]
[null," •  Target Library Pool Volume must be between 50-300 µl",null,null,null,null,"Green"," Volumes to enter on Chromium Connect",null,null,null,null,null,"Target Library Pool Concentration_",3,"nM"]
[null," •  Dilution Factors must be integers between 1-10",null,null,null,null,"Red"," Verify that value is correct",null,null,null,null,null,"Target Library Pool Volume_",0,"uL"]
[]
[null,null,null,null,null,null,null,null,null,null,null,null,null,null,"Intermediate Dilution on Deck"]
[null,"Library Pool","Tube Position (Tube Strip #, A-H)","Library ID","Average Library Size (bp)","Prorated Size","Library Concentration (nM)","Dilution Factor","Working  concentration (nM)","Cells/ sample","Reads/cell","Reads/\nsample","Fraction of Total Pool Reads","Individual Library Concentration (nM)","Library Dilution Volume (µl)","Diluent Dilution Volume (µl)","Total\nVolume (µl)","Final Transfer Volume (µl)"]
{"$rows_left_out":48}
{"sheet":"Library Pool #6","index":8,"n_rows":57,"n_cols":18,"rows_kept":57,"cut":false,"hidden":false,"merged":[[8,14,8,16],[45,1,45,4],[6,7,6,10]]}
[null,"Chromium Connect Pooling Workbook  |  10xgenomics.com"]
[null,"Library Pool #6"]
[]
[null,"Conditions",null,null,null,null,"Legend"]
[null," •  Final Transfer Volume of libraries must be between 3-20 µl ",null,null,null,null,"Blue"," Fields where data need to be entered manually",null,null,null,null,null,"Pool Number_",6]
[null," •  Target Library Pool Volume must be between 50-300 µl",null,null,null,null,"Green"," Volumes to enter on Chromium Connect",null,null,null,null,null,"Target Library Pool Concentration_",3,"nM"]
[null," •  Dilution Factors must be integers between 1-10",null,null,null,null,"Red"," Verify that value is correct",null,null,null,null,null,"Target Library Pool Volume_",0,"uL"]
[]
[null,null,null,null,null,null,null,null,null,null,null,null,null,null,"Intermediate Dilution on Deck"]
[null,"Library Pool","Tube Position (Tube Strip #, A-H)","Library ID","Average Library Size (bp)","Prorated Size","Library Concentration (nM)","Dilution Factor","Working  concentration (nM)","Cells/ sample","Reads/cell","Reads/\nsample","Fraction of Total Pool Reads","Individual Library Concentration (nM)","Library Dilution Volume (µl)","Diluent Dilution Volume (µl)","Total\nVolume (µl)","Final Transfer Volume (µl)"]
{"$rows_left_out":48}
{"sheet":"Summary sheet","index":9,"n_rows":43,"n_cols":20,"rows_kept":43,"cut":false,"hidden":false,"merged":[[37,17,38,18],[1,2,1,16],[37,5,38,6],[37,2,38,3],[37,8,38,9],[37,11,38,12],[37,14,38,15],[2,17,2,19],[2,2,2,4],[2,5,2,7],[2,8,2,10],[2,11,2,13],[2,14,2,16]]}
[null,"Chromium Connect Pooling Worksheet  |  10xgenomics.com"]
[null,null,"After reviewing information below, click this button to export data to CSV Sheet -------------------------------------------------------------------------------------------"]
[null,null,"POOL 1",null,null,"POOL 2",null,null,"POOL 3",null,null,"POOL 4",null,null,"POOL 5",null,null,"POOL 6"]
[null,{"$f":"'Library Info Input'!D3","v":"Library ID"},"Library Dilution Volume (µl)","Diluent Dilution Volume (µl)","Final\nTransfer Volume (µl)","Library Dilution Volume (µl)","Diluent Dilution Volume (µl)","Final\nTransfer Volume (µl)","Library Dilution Volume (µl)","Diluent Dilution Volume (µl)","Final\nTransfer Volume (µl)","Library Dilution Volume (µl)","Diluent Dilution Volume (µl)","Final\nTransfer Volume (µl)","Library Dilution Volume (µl)","Diluent Dilution Volume (µl)","Final\nTransfer Volume (µl)","Library Dilution Volume (µl)","Diluent Dilution Volume (µl)","Final\nTransfer Volume (µl)"]
[null,{"$f":"'Library Info Input'!D4","v":"Library-1"},{"$f":"IF(ISNUMBER(SEARCH(\"1\",'Library Pool #1'!B11)),'Library Pool #1'!O11,\"\")","v":0},{"$f":"IF(ISNUMBER(SEARCH(\"1\",'Library Pool #1'!B11)),'Library Pool #1'!P11,\"\")","v":0},{"$f":"IF(ISNUMBER(SEARCH(\"1\",'Library Pool #1'!B11)),'Library Pool #1'!R11,\"\")","v":15},{"$f":"IF(ISNUMBER(SEARCH(\"2\",'Library Pool #2'!B11)),'Library Pool #2'!O11,\"\")","v":""},{"$f":"IF(ISNUMBER(SEARCH(\"2\",'Library Pool #2'!B11)),'Library Pool #2'!P11,\"\")","v":""},{"$f":"IF(ISNUMBER(SEARCH(\"2\",'Library Pool #2'!B11)),'Library Pool #2'!R11,\"\")","v":""},{"$f":"IF(ISNUMBER(SEARCH(\"3\",'Library Pool #3'!B11)),'Library Pool #3'!O11,\"\")","v":""},{"$f":"IF(ISNUMBER(SEARCH(\"3\",'Library Pool #3'!B11)),'Library Pool #3'!P11,\"\")","v":""},{"$f":"IF(ISNUMBER(SEARCH(\"3\",'Library Pool #3'!B11)),'Library Pool #3'!R11,\"\")","v":""},{"$f":"IF(ISNUMBER(SEARCH(\"4\",'Library Pool #4'!B11)),'Library Pool #4'!O11,\"\")","v":""},{"$f":"IF(ISNUMBER(SEARCH(\"4\",'Library Pool #4'!B11)),'Library Pool #4'!P11,\"\")","v":""},{"$f":"IF(ISNUMBER(SEARCH(\"4\",'Library Pool #4'!B11)),'Library Pool #4'!R11,\"\")","v":""},{"$f":"IF(ISNUMBER(SEARCH(\"5\",'Library Pool #5'!B11)),'Library Pool #5'!O11,\"\")","v":""},{"$f":"IF(ISNUMBER(SEARCH(\"5\",'Library Pool #5'!B11)),'Library Pool #5'!P11,\"\")","v":""},{"$f":"IF(ISNUMBER(SEARCH(\"5\",'Library Pool #5'!B11)),'Library Pool #5'!R11,\"\")","v":""},{"$f":"IF(ISNUMBER(SEARCH(\"6\",'Library Pool #6'!B11)),'Library Pool #6'!O11,\"\")","v":""},{"$f":"IF(ISNUMBER(SEARCH(\"6\",'Library Pool #6'!B11)),'Library Pool #6'!P11,\"\")","v":""},{"$f":"IF(ISNUMBER(SEARCH(\"6\",'Library Pool #6'!B11)),'Library Pool #6'!R11,\"\")","v":""}]
[null,{"$f":"'Library Info Input'!D5","v":0},{"$f":"IF(ISNUMBER(SEARCH(\"1\",'Library Pool #1'!B12)),'Library Pool #1'!O12,\"\")","v":""},{"$f":"IF(ISNUMBER(SEARCH(\"1\",'Library Pool #1'!B12)),'Library Pool #1'!P12,\"\")","v":""},{"$f":"IF(ISNUMBER(SEARCH(\"1\",'Library Pool #1'!B12)),'Library Pool #1'!R12,\"\")","v":""},{"$f":"IF(ISNUMBER(SEARCH(\"2\",'Library Pool #2'!B12)),'Library Pool #2'!O12,\"\")","v":""},{"$f":"IF(ISNUMBER(SEARCH(\"2\",'Library Pool #2'!B12)),'Library Pool #2'!P12,\"\")","v":""},{"$f":"IF(ISNUMBER(SEARCH(\"2\",'Library Pool #2'!B12)),'Library Pool #2'!R12,\"\")","v":""},{"$f":"IF(ISNUMBER(SEARCH(\"3\",'Library Pool #3'!B12)),'Library Pool #3'!O12,\"\")","v":""},{"$f":"IF(ISNUMBER(SEARCH(\"3\",'Library Pool #3'!B12)),'Library Pool #3'!P12,\"\")","v":""},{"$f":"IF(ISNUMBER(SEARCH(\"3\",'Library Pool #3'!B12)),'Library Pool #3'!R12,\"\")","v":""},{"$f":"IF(ISNUMBER(SEARCH(\"4\",'Library Pool #4'!B12)),'Library Pool #4'!O12,\"\")","v":""},{"$f":"IF(ISNUMBER(SEARCH(\"4\",'Library Pool #4'!B12)),'Library Pool #4'!P12,\"\")","v":""},{"$f":"IF(ISNUMBER(SEARCH(\"4\",'Library Pool #4'!B12)),'Library Pool #4'!R12,\"\")","v":""},{"$f":"IF(ISNUMBER(SEARCH(\"5\",'Library Pool #5'!B12)),'Library Pool #5'!O12,\"\")","v":""},{"$f":"IF(ISNUMBER(SEARCH(\"5\",'Library Pool #5'!B12)),'Library Pool #5'!P12,\"\")","v":""},{"$f":"IF(ISNUMBER(SEARCH(\"5\",'Library Pool #5'!B12)),'Library Pool #5'!R12,\"\")","v":""},{"$f":"IF(ISNUMBER(SEARCH(\"6\",'Library Pool #6'!B12)),'Library Pool #6'!O12,\"\")","v":""},{"$f":"IF(ISNUMBER(SEARCH(\"6\",'Library Pool #6'!B12)),'Library Pool #6'!P12,\"\")","v":""},{"$f":"IF(ISNUMBER(SEARCH(\"6\",'Library Pool #6'!B12)),'Library Pool #6'!R12,\"\")","v":""}]
[null,{"$f":"'Library Info Input'!D6","v":0},{"$f":"IF(ISNUMBER(SEARCH(\"1\",'Library Pool #1'!B13)),'Library Pool #1'!O13,\"\")","v":""},{"$f":"IF(ISNUMBER(SEARCH(\"1\",'Library Pool #1'!B13)),'Library Pool #1'!P13,\"\")","v":""},{"$f":"IF(ISNUMBER(SEARCH(\"1\",'Library Pool #1'!B13)),'Library Pool #1'!R13,\"\")","v":""},{"$f":"IF(ISNUMBER(SEARCH(\"2\",'Library Pool #2'!B13)),'Library Pool #2'!O13,\"\")","v":""},{"$f":"IF(ISNUMBER(SEARCH(\"2\",'Library Pool #2'!B13)),'Library Pool #2'!P13,\"\")","v":""},{"$f":"IF(ISNUMBER(SEARCH(\"2\",'Library Pool #2'!B13)),'Library Pool #2'!R13,\"\")","v":""},{"$f":"IF(ISNUMBER(SEARCH(\"3\",'Library Pool #3'!B13)),'Library Pool #3'!O13,\"\")","v":""},{"$f":"IF(ISNUMBER(SEARCH(\"3\",'Library Pool #3'!B13)),'Library Pool #3'!P13,\"\")","v":""},{"$f":"IF(ISNUMBER(SEARCH(\"3\",'Library Pool #3'!B13)),'Library Pool #3'!R13,\"\")","v":""},{"$f":"IF(ISNUMBER(SEARCH(\"4\",'Library Pool #4'!B13)),'Library Pool #4'!O13,\"\")","v":""},{"$f":"IF(ISNUMBER(SEARCH(\"4\",'Library Pool #4'!B13)),'Library Pool #4'!P13,\"\")","v":""},{"$f":"IF(ISNUMBER(SEARCH(\"4\",'Library Pool #4'!B13)),'Library Pool #4'!R13,\"\")","v":""},{"$f":"IF(ISNUMBER(SEARCH(\"5\",'Library Pool #5'!B13)),'Library Pool #5'!O13,\"\")","v":""},{"$f":"IF(ISNUMBER(SEARCH(\"5\",'Library Pool #5'!B13)),'Library Pool #5'!P13,\"\")","v":""},{"$f":"IF(ISNUMBER(SEARCH(\"5\",'Library Pool #5'!B13)),'Library Pool #5'!R13,\"\")","v":""},{"$f":"IF(ISNUMBER(SEARCH(\"6\",'Library Pool #6'!B13)),'Library Pool #6'!O13,\"\")","v":""},{"$f":"IF(ISNUMBER(SEARCH(\"6\",'Library Pool #6'!B13)),'Library Pool #6'!P13,\"\")","v":""},{"$f":"IF(ISNUMBER(SEARCH(\"6\",'Library Pool #6'!B13)),'Library Pool #6'!R13,\"\")","v":""}]
[null,{"$f":"'Library Info Input'!D7","v":0},{"$f":"IF(ISNUMBER(SEARCH(\"1\",'Library Pool #1'!B14)),'Library Pool #1'!O14,\"\")","v":""},{"$f":"IF(ISNUMBER(SEARCH(\"1\",'Library Pool #1'!B14)),'Library Pool #1'!P14,\"\")","v":""},{"$f":"IF(ISNUMBER(SEARCH(\"1\",'Library Pool #1'!B14)),'Library Pool #1'!R14,\"\")","v":""},{"$f":"IF(ISNUMBER(SEARCH(\"2\",'Library Pool #2'!B14)),'Library Pool #2'!O14,\"\")","v":""},{"$f":"IF(ISNUMBER(SEARCH(\"2\",'Library Pool #2'!B14)),'Library Pool #2'!P14,\"\")","v":""},{"$f":"IF(ISNUMBER(SEARCH(\"2\",'Library Pool #2'!B14)),'Library Pool #2'!R14,\"\")","v":""},{"$f":"IF(ISNUMBER(SEARCH(\"3\",'Library Pool #3'!B14)),'Library Pool #3'!O14,\"\")","v":""},{"$f":"IF(ISNUMBER(SEARCH(\"3\",'Library Pool #3'!B14)),'Library Pool #3'!P14,\"\")","v":""},{"$f":"IF(ISNUMBER(SEARCH(\"3\",'Library Pool #3'!B14)),'Library Pool #3'!R14,\"\")","v":""},{"$f":"IF(ISNUMBER(SEARCH(\"4\",'Library Pool #4'!B14)),'Library Pool #4'!O14,\"\")","v":""},{"$f":"IF(ISNUMBER(SEARCH(\"4\",'Library Pool #4'!B14)),'Library Pool #4'!P14,\"\")","v":""},{"$f":"IF(ISNUMBER(SEARCH(\"4\",'Library Pool #4'!B14)),'Library Pool #4'!R14,\"\")","v":""},{"$f":"IF(ISNUMBER(SEARCH(\"5\",'Library Pool #5'!B14)),'Library Pool #5'!O14,\"\")","v":""},{"$f":"IF(ISNUMBER(SEARCH(\"5\",'Library Pool #5'!B14)),'Library Pool #5'!P14,\"\")","v":""},{"$f":"IF(ISNUMBER(SEARCH(\"5\",'Library Pool #5'!B14)),'Library Pool #5'!R14,\"\")","v":""},{"$f":"IF(ISNUMBER(SEARCH(\"6\",'Library Pool #6'!B14)),'Library Pool #6'!O14,\"\")","v":""},{"$f":"IF(ISNUMBER(SEARCH(\"6\",'Library Pool #6'!B14)),'Library Pool #6'!P14,\"\")","v":""},{"$f":"IF(ISNUMBER(SEARCH(\"6\",'Library Pool #6'!B14)),'Library Pool #6'!R14,\"\")","v":""}]
[null,{"$f":"'Library Info Input'!D8","v":0},{"$f":"IF(ISNUMBER(SEARCH(\"1\",'Library Pool #1'!B15)),'Library Pool #1'!O15,\"\")","v":""},{"$f":"IF(ISNUMBER(SEARCH(\"1\",'Library Pool #1'!B15)),'Library Pool #1'!P15,\"\")","v":""},{"$f":"IF(ISNUMBER(SEARCH(\"1\",'Library Pool #1'!B15)),'Library Pool #1'!R15,\"\")","v":""},{"$f":"IF(ISNUMBER(SEARCH(\"2\",'Library Pool #2'!B15)),'Library Pool #2'!O15,\"\")","v":""},{"$f":"IF(ISNUMBER(SEARCH(\"2\",'Library Pool #2'!B15)),'Library Pool #2'!P15,\"\")","v":""},{"$f":"IF(ISNUMBER(SEARCH(\"2\",'Library Pool #2'!B15)),'Library Pool #2'!R15,\"\")","v":""},{"$f":"IF(ISNUMBER(SEARCH(\"3\",'Library Pool #3'!B15)),'Library Pool #3'!O15,\"\")","v":""},{"$f":"IF(ISNUMBER(SEARCH(\"3\",'Library Pool #3'!B15)),'Library Pool #3'!P15,\"\")","v":""},{"$f":"IF(ISNUMBER(SEARCH(\"3\",'Library Pool #3'!B15)),'Library Pool #3'!R15,\"\")","v":""},{"$f":"IF(ISNUMBER(SEARCH(\"4\",'Library Pool #4'!B15)),'Library Pool #4'!O15,\"\")","v":""},{"$f":"IF(ISNUMBER(SEARCH(\"4\",'Library Pool #4'!B15)),'Library Pool #4'!P15,\"\")","v":""},{"$f":"IF(ISNUMBER(SEARCH(\"4\",'Library Pool #4'!B15)),'Library Pool #4'!R15,\"\")","v":""},{"$f":"IF(ISNUMBER(SEARCH(\"5\",'Library Pool #5'!B15)),'Library Pool #5'!O15,\"\")","v":""},{"$f":"IF(ISNUMBER(SEARCH(\"5\",'Library Pool #5'!B15)),'Library Pool #5'!P15,\"\")","v":""},{"$f":"IF(ISNUMBER(SEARCH(\"5\",'Library Pool #5'!B15)),'Library Pool #5'!R15,\"\")","v":""},{"$f":"IF(ISNUMBER(SEARCH(\"6\",'Library Pool #6'!B15)),'Library Pool #6'!O15,\"\")","v":""},{"$f":"IF(ISNUMBER(SEARCH(\"6\",'Library Pool #6'!B15)),'Library Pool #6'!P15,\"\")","v":""},{"$f":"IF(ISNUMBER(SEARCH(\"6\",'Library Pool #6'!B15)),'Library Pool #6'!R15,\"\")","v":""}]
[null,{"$f":"'Library Info Input'!D9","v":0},{"$f":"IF(ISNUMBER(SEARCH(\"1\",'Library Pool #1'!B16)),'Library Pool #1'!O16,\"\")","v":""},{"$f":"IF(ISNUMBER(SEARCH(\"1\",'Library Pool #1'!B16)),'Library Pool #1'!P16,\"\")","v":""},{"$f":"IF(ISNUMBER(SEARCH(\"1\",'Library Pool #1'!B16)),'Library Pool #1'!R16,\"\")","v":""},{"$f":"IF(ISNUMBER(SEARCH(\"2\",'Library Pool #2'!B16)),'Library Pool #2'!O16,\"\")","v":""},{"$f":"IF(ISNUMBER(SEARCH(\"2\",'Library Pool #2'!B16)),'Library Pool #2'!P16,\"\")","v":""},{"$f":"IF(ISNUMBER(SEARCH(\"2\",'Library Pool #2'!B16)),'Library Pool #2'!R16,\"\")","v":""},{"$f":"IF(ISNUMBER(SEARCH(\"3\",'Library Pool #3'!B16)),'Library Pool #3'!O16,\"\")","v":""},{"$f":"IF(ISNUMBER(SEARCH(\"3\",'Library Pool #3'!B16)),'Library Pool #3'!P16,\"\")","v":""},{"$f":"IF(ISNUMBER(SEARCH(\"3\",'Library Pool #3'!B16)),'Library Pool #3'!R16,\"\")","v":""},{"$f":"IF(ISNUMBER(SEARCH(\"4\",'Library Pool #4'!B16)),'Library Pool #4'!O16,\"\")","v":""},{"$f":"IF(ISNUMBER(SEARCH(\"4\",'Library Pool #4'!B16)),'Library Pool #4'!P16,\"\")","v":""},{"$f":"IF(ISNUMBER(SEARCH(\"4\",'Library Pool #4'!B16)),'Library Pool #4'!R16,\"\")","v":""},{"$f":"IF(ISNUMBER(SEARCH(\"5\",'Library Pool #5'!B16)),'Library Pool #5'!O16,\"\")","v":""},{"$f":"IF(ISNUMBER(SEARCH(\"5\",'Library Pool #5'!B16)),'Library Pool #5'!P16,\"\")","v":""},{"$f":"IF(ISNUMBER(SEARCH(\"5\",'Library Pool #5'!B16)),'Library Pool #5'!R16,\"\")","v":""},{"$f":"IF(ISNUMBER(SEARCH(\"6\",'Library Pool #6'!B16)),'Library Pool #6'!O16,\"\")","v":""},{"$f":"IF(ISNUMBER(SEARCH(\"6\",'Library Pool #6'!B16)),'Library Pool #6'!P16,\"\")","v":""},{"$f":"IF(ISNUMBER(SEARCH(\"6\",'Library Pool #6'!B16)),'Library Pool #6'!R16,\"\")","v":""}]
{"$rows_left_out":34}
{"sheet":"csv for Connect","index":10,"n_rows":43,"n_cols":10,"rows_kept":43,"cut":false,"hidden":true,"merged":[]}
["V1.28"]
["SAMPLEPARAMETERS","SAMPLENAME","lib_trans_vol","lib_dil_vol","lib_dil_dilu","lib_do_pool","USERDEFINED1","USERDEFINED2","USERDEFINED3","USERDEFINED4"]
[{"$f":"\"ID\" & 'Library Info Input'!C4","v":"ID1A"},{"$f":"'Library Info Input'!D4","v":"Library-1"},56.818181818181813,0,0,1]
[{"$f":"\"ID\" & 'Library Info Input'!C5","v":"ID1B"},{"$f":"'Library Info Input'!D5","v":0},0,0,0,3]
[{"$f":"\"ID\" & 'Library Info Input'!C6","v":"ID1C"},{"$f":"'Library Info Input'!D6","v":0},43.478260869565219,0,0,1]
[{"$f":"\"ID\" & 'Library Info Input'!C7","v":"ID1D"},{"$f":"'Library Info Input'!D7","v":0},0,0,0,6]
[{"$f":"\"ID\" & 'Library Info Input'!C8","v":"ID1E"},{"$f":"'Library Info Input'!D8","v":0},0,0,0,6]
[{"$f":"\"ID\" & 'Library Info Input'!C9","v":"ID1F"},{"$f":"'Library Info Input'!D9","v":0},0,0,0,6]
[{"$f":"\"ID\" & 'Library Info Input'!C10","v":"ID1G"},{"$f":"'Library Info Input'!D10","v":0},0,0,0,6]
[{"$f":"\"ID\" & 'Library Info Input'!C11","v":"ID1H"},{"$f":"'Library Info Input'!D11","v":0},0,0,0,6]
{"$rows_left_out":34}
{"sheet":"WorksheetWillHide","index":11,"n_rows":32,"n_cols":3,"rows_kept":32,"cut":false,"hidden":true,"merged":[]}
[0,0,56.818181818181813]
[0,0,0]
[0,0,43.478260869565219]
[0,0,0]
[0,0,0]
[0,0,0]
[0,0,0]
[0,0,0]
[0,0,0]
[0,0,0]
{"$rows_left_out":23}
{"sheet":"Sheet3","index":12,"n_rows":0,"n_cols":0,"rows_kept":0,"cut":false,"hidden":true,"merged":[]}