{"text_format":"1","workbook":"xlsx","n_sheets":5,"sheets":["Berechnungen","Daten","Malaquias","Binder","Wortlaut Ergebnisse"],"not_rendered":{"charts":0,"images":11,"macros":1,"external_links":0,"defined_names":4,"comments":0,"pivot_tables":0},"unopened":[],"bounds":{"document_bytes":16777216,"sheet_cells":100000,"rows_first":2000,"rows_last":500,"rows_between":2000,"halvings":0,"cell_chars":16384,"cell_head_chars":4096},"cells_cut":0,"cells_raw":0,"read":"whole","date_system":"1900"}

{"sheet":"Berechnungen","index":0,"n_rows":42,"n_cols":7,"rows_kept":42,"cut":false,"hidden":false,"merged":[[39,2,39,3],[34,2,34,7],[44,2,44,7],[18,2,18,7],[20,6,23,7],[40,2,40,3],[41,2,41,3],[36,6,41,7],[30,2,30,7],[36,2,36,3],[37,2,37,3],[38,2,38,3],[5,2,5,7],[20,2,20,3],[21,2,21,3],[22,2,22,3],[23,2,23,3]]}
[]
[]
[]
[null,null,"\"SHOX-D-Rechner\""]
[]
[null,null,"Mit Hilfe dieses Rechners können Sie die \"SDS Sitzhöhe/Körperhöhe\" nach Malaquias et al. (2013) und das \"Extremitäten/Sitzhöhen-Verhältnis\" nach Binder (2003) berechnen. Basierend auf den Empfehlungen der Autoren können die Ergebnisse dazu beitragen zu entscheiden, ob die Einleitung einer SHOX-Gen-Analyse bei kleinwüchsigen Kindern mit dem klinischen Verdacht auf eine SHOX-Defizienz sinnvoll ist. Weitere Erläuterungen und die Originalpublikationen sind jeweils für die einzelnen Berechnungsmethoden (s.u.) verlinkt.\n\nFür die Berechnung geben Sie die Werte des Kindes in die Felder unten ein. Die Berechnung erfolgt automatisch, sobald alle erforderlichen Angaben vorhanden sind."]
[]
[null,null,"Angaben zum Patienten"]
[]
[null,null,"Name",null,null,null,"Körperhöhe (cm)"]
[null,null,"Vorname",null,null,null,"Sitzhöhe (cm)"]
[null,null,"Geburtsdatum",null,null,null,"Armspannweite (cm)"]
[null,null,"Geschlecht",null,null,null,"Datum der Messung"]
[]
[]
[]
[null,null,"SDS Sitzhöhe/Körperhöhe nach Malaquias et al."]
[]
[null,null,"Malaquias et al. haben in ihrer Studie überprüft, ob das Verhältnis Sitzhöhe/ Körperhöhe (SH/KH) eine Hilfe für die Einleitung einer SHOX-Gen Analyse bieten kann. Ein Standard-Deviation-Score (SDS) des Quotienten Sitzhöhe/Körperhöhe > +2 wurde als Grenze für das Vorhandensein einer SHOX-Defizienz-relevanten Disproportion definiert."]
[]
[null,null,"Geschlecht",null,{"$f":"IF(Daten!A9=1,\"M\",IF(Daten!A9=2,\"W\",0))","v":0},null,{"$f":"IF(D12=0,'Wortlaut Ergebnisse'!A4,IF(E21=0,'Wortlaut Ergebnisse'!A4,IF(H10=0,'Wortlaut Ergebnisse'!A4,IF(H11=0,'Wortlaut Ergebnisse'!A4,IF(H13=0,'Wortlaut Ergebnisse'!A4,IF((E23-E24>0),'Wortlaut Ergebnisse'!A2, 'Wortlaut Ergebnisse'!A3))))))","v":"Für die Berechnung sind noch nicht alle Daten vorhanden. Es werden mindestens benötigt:\n- Geburtsdatum\n- Geschlecht\n- Körperhöhe\n- Sitzhöhe\n- Datum der Messung dieser auxologischen Parameter"}]
[null,null,"Alter zum Zeitpunkt der Messung (Jahre)",null,{"$f":"ROUND((H13-D12)/365,0)","v":0}]
[null,null,"Quotient Sitzhöhe/Körperhöhe dieses Patienten",null,{"$f":"H11/H10","v":{"$error":"#DIV/0!"}}]
[null,null,"+2 SDS-Referenzwert des Quotienten Sitzhöhe/Körperhöhe dieses Patienten",null,{"$f":"IF(Daten!A9=1,VLOOKUP(E22,Daten!C4:D24,2,FALSE),IF(Daten!A9=2,VLOOKUP(E22,Daten!F4:G24,2,FALSE)))","v":false}]
[]
[]
[]
[]
[null,null,"Extremitäten/Sitzhöhen-Verhältnis nach Binder et al."]
[]
[null,null,"Das Extremitäten/Sitzhöhen-Verhältnis bezeichnet die Summe aus Beinlänge und Armspannweite geteilt durch die Sitzhöhe. Wenn die folgende Bedingung erfüllt ist, dann ist nach Binder et al. die Einleitung einer SHOX-Gen-Analyse sinnvoll."]
[]
[]
[]
[null,null,"Der Wert 1,95 + 1/2 Körperhöhe spiegelt -1 Standardabweichung (SD) des Mittelwertes  der Referenzpopulation wider.\n\nDie Berechnung und Beurteilung des Extremitäten/Sitzhöhen-Verhältnisses nach Binder ist nur für Kinder im Schulalter (ab 6 Jahre) und mit einer Körperhöhe über 110 cm aussagekräftig. Daher wird das Verhältnis nur für Patienten berechnet, die diese Bedingungen erfüllen."]
[]
[null,null,"Beinlänge (cm)",null,{"$f":"H10-H11","v":0},null,{"$f":"IF(OR(D12=0,H10=0,H11=0,H12=0,H13=0),'Wortlaut Ergebnisse'!A8,IF(E22<6,'Wortlaut Ergebnisse'!A10,IF(H10<110,'Wortlaut Ergebnisse'!A9,IF(Berechnungen!E41<Berechnungen!E42,'Wortlaut Ergebnisse'!A6,'Wortlaut Ergebnisse'!A7))))","v":"Für die Berechnung sind noch nicht alle Daten vorhanden. Es werden mindestens benötigt:\n- Geburtsdatum\n- Körperhöhe\n- Sitzhöhe\n- Armspannweite\n- Datum der Messung dieser auxologischen Parameter"}]
[null,null,"Armspannweite (cm)",null,{"$f":"H12","v":0}]
[null,null,"Sitzhöhe (cm)",null,{"$f":"H11","v":0}]
[null,null,"Körperhöhe (cm)",null,{"$f":"H10","v":0}]
[null,null,"Extremitäten/Sitzhöhen-Verhältnis dieses Patienten",null,{"$f":"(E37+E38)/E39","v":{"$error":"#DIV/0!"}}]
[null,null,"1,95+1/2 Körperhöhe (m)",null,{"$f":"1.95+(0.5*H10/100)","v":1.95}]

{"sheet":"Daten","index":1,"n_rows":24,"n_cols":7,"rows_kept":24,"cut":false,"hidden":true,"merged":[]}
["Geschlecht",null,"Jungen","Sitzhöhe/Körperhöhe",null,"Mädchen","Sitzhöhe/Körperhöhe"]
["M"]
["W",null,"Alter","+2 SDS",null,"Alter","+2 SDS"]
[null,null,1,0.68682845082639021,null,1,0.68943448303798449]
[null,null,2,0.64019195107891924,null,2,0.63942920417566151]
[null,null,3,0.60537680003779992,null,3,0.60341452308192667]
[null,null,4,0.58738483220450877,null,4,0.58659363856773805]
["Geschlecht",null,5,0.57612962360657194,null,5,0.57740465959117693]
[{"$f":"IF(OR(Berechnungen!D13=\"m\",Berechnungen!D13=\"M\"),1,IF(OR(Berechnungen!D13=\"W\",Berechnungen!D13=\"w\"),2,))","v":0},null,6,0.56998839687255209,null,6,0.57123577552937654]
[null,null,7,0.56385763701504488,null,7,0.56419484421237032]
[null,null,8,0.55773741910793195,null,8,0.55805164884424219]
[null,null,9,0.55057909733854082,null,9,0.55191988350297705]
[null,null,10,0.5444818350364834,null,10,0.5485931463214585]
[null,null,11,0.53944078606294199,null,11,0.54457494208753821]
[null,null,12,0.53630450242304117,null,12,0.54142711005235011]
[null,null,13,0.53212279090317338,null,13,0.54142711005235011]
[null,null,14,0.53191686961256457,null,14,0.54352566474247554]
[null,null,15,0.53401103051655108,null,15,0.5477227741227263]
[null,null,16,0.5369457101663484,null,16,0.54982132881285162]
[null,null,17,0.537994432256517,null,17,0.54982132881285162]
[null,null,18,0.54093177182784358,null,18,0.54982132881285162]
[null,null,19,0.54198212478284913,null,19,0.55087060615791439]
[null,null,20,0.54281817294731927,null,20,0.55191988350297705]
[null,null,21,0.53966225333716045,null,21,0.55191988350297705]

{"sheet":"Malaquias","index":2,"n_rows":170,"n_cols":2,"rows_kept":170,"cut":false,"hidden":false,"merged":[[1,7,2,8],[168,1,168,8],[169,1,169,8]]}
[]
[]
[]
[]
[]
[]
[]
[]
[]
[]
[]
[]
[]
[]
[]
[]
[]
[]
[]
[]
[]
[]
[]
[]
[]
[]
[]
[]
[]
[]
[]
[]
[]
[]
[]
[]
[]
[]
[]
[]
[]
[]
[]
[]
[]
[]
[]
[]
[]
[]
[]
[]
[]
[]
[]
[]
[]
[]
[]
[]
[]
[]
[]
[]
[]
[]
[]
[]
[]
[]
[]
[]
[]
[]
[]
[]
[]
[]
[]
[]
[]
[]
[]
[]
[]
[]
[]
[]
[]
[]
[]
[]
[]
[]
[]
[]
[]
[]
[]
[]
[]
[]
[]
[]
[]
[]
[]
[]
[]
[]
[]
[]
[]
[]
[]
[]
[]
[]
[]
[]
[]
[]
[]
[]
[]
[]
[]
[]
[]
[]
[]
[]
[]
[]
[]
[]
[]
[]
[]
[]
[]
[]
[]
[]
[]
[]
[]
[]
[]
[]
[]
[]
[]
[]
[]
[]
[]
[]
[]
[]
[]
[]
[]
[]
[]
[]
[null,"Literatur:"]
[]
[null,"Malaquias et al.: The sitting height/height ratio for age in healthy and short individuals and its potential role in selecting short children for SHOX analysis. Horm Res Paediatr. 2013;80(6):449-56"]
[null,"\nFredriks et al.: Nationwide age references for sitting height, leg length, and sitting height/height ratio, and their diagnostic value for disproportionate growth disorders. Arch Dis Child 2005;90:807–812\n\nCole, T J, The LMS method for constructing normalized growth standards. Eur J Clin Nutr. 1990 Jan;44(1):45-60"]

{"sheet":"Binder","index":3,"n_rows":61,"n_cols":2,"rows_kept":61,"cut":false,"hidden":false,"merged":[[60,1,60,8]]}
[]
[]
[]
[]
[]
[]
[]
[]
[]
[]
[]
[]
[]
[]
[]
[]
[]
[]
[]
[]
[]
[]
[]
[]
[]
[]
[]
[]
[]
[]
[]
[]
[]
[]
[]
[]
[]
[]
[]
[]
[]
[]
[]
[]
[]
[]
[]
[]
[]
[]
[]
[]
[]
[]
[]
[]
[]
[]
[null,"Literatur:"]
[]
[null,"Binder et al.: Auxology Is a Valuable Instrument for the Clinical Diagnosis of SHOX Haploinsufficiency in School-Age Children with Unexplained Short Stature. J Clin Endocrinol Metab 2003 88: 4891–4896"]

{"sheet":"Wortlaut Ergebnisse","index":4,"n_rows":10,"n_cols":1,"rows_kept":10,"cut":false,"hidden":true,"merged":[]}
["Ergebnis Malaquias"]
["Ergebnis:\nDer Quotient Sitzhöhe/Körperhöhe dieses Patienten liegt über 2 SDS, laut Malaquias et al. kann die Einleitung einer SHOX-Gen Analyse sinnvoll sein."]
["Ergebnis:\nDer Quotient Sitzhöhe/Körperhöhe dieses Patienten liegt nicht über 2 SDS, laut Malaquias et al. erscheint die Einleitung einer SHOX-Gen Analyse daher nicht sinnvoll."]
["Für die Berechnung sind noch nicht alle Daten vorhanden. Es werden mindestens benötigt:\n- Geburtsdatum\n- Geschlecht\n- Körperhöhe\n- Sitzhöhe\n- Datum der Messung dieser auxologischen Parameter"]
["Ergebnis Binder"]
["Ergebnis:\nDas Extremitäten/Sitzhöhen-Verhältnis des Patienten ist kleiner als 1,95+1/2 Körperhöhe (m). Nach Binder et al. kann die Einleitung einer SHOX-Gen-Analyse sinnvoll sein."]
["Ergebnis:\nDas Extremitäten/Sitzhöhen-Verhältnis des Patienten ist nicht kleiner als 1,95+1/2 Körperhöhe (m). Nach Binder et al. ist die Einleitung einer SHOX-Gen-Analyse nicht sinnvoll"]
["Für die Berechnung sind noch nicht alle Daten vorhanden. Es werden mindestens benötigt:\n- Geburtsdatum\n- Körperhöhe\n- Sitzhöhe\n- Armspannweite\n- Datum der Messung dieser auxologischen Parameter"]
["Die Körperhöhe des Patienten liegt unter 110 cm. Nach Binder et al. ist die Berechnung des Extremitäten/ Sitzhöhen-Verhältnisses in diesem Fall nicht sinnvoll, da der Test für diese Patienten weniger zuverlässig ist. Deshalb wird hierfür kein Ergebnis angegeben.\n\nHier bietet sich die Anwendung der Berechnung nach Malaquias et al. weiter oben auf dieser Seite an. "]
["Der Patient ist jünger als 6 Jahre. Nach Binder et al. ist die Berechnung des Extremitäten/ Sitzhöhen-Verhältnisses nur bei Kindern im Schulalter sinnvoll, für Kinder im Vorschulalter ist der Test weniger zuverlässig. Deshalb wird hierfür kein Ergebnis angegeben.\n\nHier bietet sich die Anwendung der Berechnung nach Malaquias et al. weiter oben auf dieser Seite an. "]