{"text_format":"1","workbook":"xlsx","n_sheets":20,"sheets":["Admin","Definitions","0.Submission Checklist","1.Design Record Drawing","2.Design FMEA","3.Process FMEA","4.Control Plan","5.MSA GR&R","6.Dimensional Results","7.Material Test Results","8.Performance Test Results","9.Statistical Analysis & Cp ","10.Post PPAP Run@Rate Pilot Run","11.Appearance Approval","12.Master Sample","13.Tooling Information Form","14.Packaging Form","15.Checking Aids","16.Software Firmware","17.Part Submission Warrant"],"not_rendered":{"charts":0,"images":10,"macros":1,"external_links":1,"defined_names":39,"comments":8,"pivot_tables":0},"unopened":[],"bounds":{"document_bytes":16777216,"sheet_cells":100000,"rows_first":2000,"rows_last":500,"rows_between":2000,"halvings":0,"cell_chars":16384,"cell_head_chars":4096},"cells_cut":0,"cells_raw":0,"read":"whole","date_system":"1900"}

{"sheet":"Admin","index":0,"n_rows":30,"n_cols":3,"rows_kept":30,"cut":false,"hidden":true,"merged":[]}
["Art der Veränderung","dkPAP-Stufe","Spalte 1"]
["Neue oder zusätzliche Werkzeuge","Stufe 3"]
["Modifizierte Werkzeuge ","Stufe 2"," Fokus auf Veränderung"]
["Werkzeug-, Produktions- oder Gerätetransfer ","Stufe 2"]
["Lieferantenwechsel oder nicht gleichwertige Materialien","Stufe 3"]
["Produkt, wenn das Werkzeug für >12 Monate inaktiv war","Stufe 1"]
["Produkt-/Prozessänderungen bei Komponenten eines Produkts","Stufe 3"]
["Änderung des Prüfverfahrens","Stufe 2","mit Fokus auf Veränderung/Auswirkung der Veränderung "]
["Schüttgut: Neue Rohstoffquelle ","Stufe 3"]
["Änderung des Produktaussehens ","Stufe 1"]
["Neues Bauteil ","Stufe 3"]
["Neuer Lieferant","Stufe 3"]
["Änderung des Produktionsprozesses oder -verfahrens ","Stufe 3"]
["VDA Mindesteinhaltung","Stufe 1"]
["Standortwechsel","Stufe 3"]
[]
["Tab Farben "]
[]
[]
[null,null,"Dropdown für benutzerdefiniert"]
[]
[null,null,"✔"]
[null,null,"E"]
[]
[]
["Ausgewählte Stufe"]
["Stufe 1 "]
["Stufe 2"]
["Stufe 3"]
["BENUTZERDEFINIERT"]

{"sheet":"Definitions","index":1,"n_rows":0,"n_cols":0,"rows_kept":0,"cut":false,"hidden":true,"merged":[]}

{"sheet":"0.Submission Checklist","index":2,"n_rows":34,"n_cols":21,"rows_kept":34,"cut":false,"hidden":false,"merged":[[17,7,17,22],[6,17,6,22],[10,3,10,12],[6,3,6,12],[7,3,7,12],[8,3,8,12],[12,3,12,7],[12,8,12,12],[15,7,16,22],[11,8,11,12],[13,8,13,12],[14,3,14,7],[14,8,14,12],[13,3,13,7],[7,0,7,2],[8,0,8,2],[10,0,10,2],[20,1,20,2],[15,1,16,2],[15,0,16,0],[17,1,17,2],[18,1,18,2],[19,1,19,2],[12,0,12,1],[11,0,11,1],[13,0,13,1],[2,0,2,2],[3,0,3,2],[4,0,4,2],[5,0,5,2],[6,0,6,2],[0,13,0,22],[15,3,15,6],[2,13,2,16],[3,13,3,16],[4,13,4,16],[5,13,5,16],[6,13,6,16],[1,13,1,16],[0,0,0,12],[9,0,9,2],[9,3,9,12],[1,3,1,12],[2,3,2,12],[3,3,3,12],[1,17,1,22],[1,0,1,2],[2,17,2,22],[3,17,3,22],[4,17,4,22],[5,17,5,22],[4,3,4,12],[5,3,5,12],[18,7,18,22],[27,7,27,22],[29,7,29,22],[30,7,30,22],[22,7,22,22],[23,7,23,22],[26,7,26,22],[25,7,25,22],[24,7,24,22],[28,7,28,22],[21,1,21,2],[22,1,22,2],[19,7,19,22],[20,7,20,22],[21,7,21,22],[23,1,23,2],[24,1,24,2],[25,1,25,2],[26,1,26,2],[33,7,33,22],[31,1,31,2],[33,1,33,2],[32,7,32,22],[32,1,32,2],[27,1,27,2],[29,1,29,2],[30,1,30,2],[31,7,31,22],[28,1,28,2]]}
["Vom dormakaba-Team auszufüllen: ",null,null,null,null,null,null,null,null,null,null,null,null,"Vom Lieferanten auszufüllen: "]
["Zeichnungsnummer:",null,null,null,null,null,null,null,null,null,null,null,null,"Name des Lieferanten:"]
["Zeichnungsrevision:",null,null,null,null,null,null,null,null,null,null,null,null,"Standort des Lieferanten: "]
["Material # (SAP falls zutreffend):",null,null,null,null,null,null,null,null,null,null,null,null,"Kontaktperson Lieferant: "]
["Materialbeschreibung:",null,null,null,null,null,null,null,null,null,null,null,null,"E-Mail Kontaktperson: "]
["Verantwortlicher dk-Ingenieur:",null,null,null,null,null,null,null,null,null,null,null,null,"Teilereferenznr. des Lieferanten: "]
["dk Einkaufverantwortlicher:",null,null,null,null,null,null,null,null,null,null,null,null,"dk Einkaufverantwortlicher:"]
["dk Qualitätsverantwortlicher:"]
["dkPAP Erstellungsdatum:",null,null,"Submission"]
["dkPAP Fälligkeitsdatum:"]
["dkPAP Referenz # (falls zutreffend):",null,null,null,null,null,null,null,null,null,null,null,null,null,"Vorlagedokumente",null,null,null,null,null,{"$f":"IF(C14=\"Stufe 1\",COUNTA(D18:D34),IF(C14=\"Stufe 2\",COUNTA(E18:E34),IF(C14=\"Stufe 3\",COUNTA(F18:F34),COUNTA(G18:G34))))","v":8}]
["Grund für dkPAP ",null,"Änderung des Prüfverfahrens","Bauteil enthält CTQ?",null,null,null,null,"Ja"]
["Erforderliche Stufe ",null,{"$f":"VLOOKUP($C$12,Change_Table[],2,0)","v":"Stufe 2"},"Bauteil enthält SW/ZB?",null,null,null,null,"Ja"]
["Vorlagestufe",null,"Stufe 1","Anzahl benötigter Muster: ",null,null,null,null,"(Anzahl einfügen)"]
[null,null,null,"Beispiel PO-Nummer:",null,null,null,null,"(PO-Nummer einfügen)"]
["#","Matrix Anforderungen",null,"Stufe ",null,null,null,"Beschreibungen und Erläuterungen: Bewegen Sie den Mauszeiger über die Zelle für eine genauere Definition der Anforderung. "]
[null,null,null,1,2,3,"B"]
[1,"Entwurfsprotokoll/Zeichnung",null,"✔","✔","✔","✔","Fügen Sie eine saubere Kopie der aktuell genehmigten Ballonzeichnung zur Überprüfung bei.  "]
[2,"Design FMEA",null,null,"✔","✔",null,"Erforderliches Zugriffsrecht nur, wenn der Lieferant für die Teilegestaltung verantwortlich ist."]
[3,"Prozess FMEA",null,null,"✔","✔",null," Prozessschritte in FMEA müssen mit dem Prozessleitplan übereinstimmen und alle mit jedem Vorgang verbundenen Merkmale berücksichtigen."]
[4,"Kontrollplan",null,null,"✔","✔",null,"Kontrollplan, der alle Prozesskontrollen aufzeichnet. "]
[5,"Messsystemanalyse (MSA) GR&R",null,{"$f":"IF(AND(I12=\"Ja\", C14=\"Stufe 1\"), D23, \" \")","v":"✔"},{"$f":"IF(AND(I12=\"Ja\", C14=\"Stufe 2\"), D23, \" \")","v":" "},"✔","✔","Analyse der Messwerkzeuge für alle im Kontrollplan erkannten Prüfstellen, die zur Messung von CTQs verwendet werden. "]
[6,"Ergebnisse der Maßprüfung",null,"✔","✔","✔",null,"Messergebnisse aller Abmessungen der in 1. angegebenen Stücklistensymbolzeichnung. Direkt in Excel-Arbeitsmappe einfügen. "]
[7,"Materialtestergebnisse",null,null,null,"✔",null,"Analysezertifikate aller Primärrohstoffe wie beispielsweise Chemikalien, Kunststoffe, Metalle und Kautschuke"]
[8,"Leistungstestergebnisse",null,"✔","✔","✔",null,"Leistungstestanforderungen und -ergebnisse "]
[9,"Statistische Analyse & Leistungsfähigkeit",null,{"$f":"IF(AND(I12=\"Ja\", C14=\"Stufe 1\"), D23, \" \")","v":"✔"},null,"✔",null,"Die statistische Analyse und Prozessfähigkeit bei einem Mindestprobenlauf von 30 Stück muss an allen qualitätskritischen (CTQ-) Abmessungen des Bauteils durchgeführt werden. "]
[10,"Post dkPAP Run at Rate Pilot Run",null,null,null,"✔",null,"Überprüfung der Produktionsläufe mit Stichproben zur Einreichung in größeren Mengen.  Anzahl benötigter Bauteile  "]
[11,"Zulassung des Erscheinungsbilds",null,"✔","✔","✔",null,"Methode tbd, Nur erforderlich für Bauteile mit Farbe, Maserung oder anderen kosmetischen Anforderungen, die auf dem Teiledruck angegeben sind. "]
[12,"Referenzmuster",null,null,null,"✔",null,"Ein Referenzmuster ist ein Endmuster des Produkts, das vom Kunden geprüft und unterschrieben wurde"]
[13,"Werkzeuginformationsformular",null,null,"✔","✔",null,"Erforderlich für alle dormakaba-eigenen Werkzeuge"]
[14,"Verpackungsform",null,null,null,"✔",null,"Wird verwendet, um sowohl externe als auch interne Verpackungsanforderungen zu skizzieren und zu überprüfen, einschließlich aller damit verbundenen Tests."]
[15,"Prüfmittel",null,null,null,"✔",null,"Zur Dokumentation aller teilespezifischen Prüfmittel (für Baugruppen oder Komponenten) "]
[16,"Validierung von Software-/Firmwareänderungen",null,{"$f":"IF(AND(I13=\"Ja\", C14=\"Stufe 1\"), D23, \" \")","v":"✔"},{"$f":"IF(AND(I13=\"Ja\", C14=\"Stufe 2\"), D23, \" \")","v":" "},{"$f":"IF(AND(I13=\"Ja\", C14=\"Stufe 3\"), D23, \" \")","v":" "},null,"Eine vollständige Programmierüberprüfung der Erwartungswerte und der verifizierten Werte, die bei SW/ZB-Änderungen miteinzubeziehen sind."]
[17,"Teilevorlagebestätigung (PSW)",null,"✔","✔","✔",null,"Für alle Bauteile ist ein vollständig ausgefülltes dormakaba PSW erforderlich, das gewährleistet, dass das Teil/Material alle geltenden Spezifikationen und Normen erfüllt."]

{"sheet":"1.Design Record Drawing","index":3,"n_rows":7,"n_cols":4,"rows_kept":7,"cut":false,"hidden":false,"merged":[[6,3,6,10],[1,2,1,11],[3,3,3,5],[3,6,3,10],[4,3,4,10],[5,3,5,10]]}
[]
[null,null,"Bestandsplan"]
[]
[null,null,"Materialnummer:",{"$f":"'0.Submission Checklist'!D4","v":0}]
[null,null,"Zeichnungsnummer: ",{"$f":"'0.Submission Checklist'!D2","v":0}]
[null,null,"Zeichnungsrevision:",{"$f":"'0.Submission Checklist'!D3","v":0}]
[null,null,"Vorbereitet von:"]

{"sheet":"2.Design FMEA","index":4,"n_rows":82,"n_cols":16,"rows_kept":82,"cut":false,"hidden":false,"merged":[[0,0,0,15],[1,6,1,9],[2,6,2,9],[3,3,3,5],[3,6,4,9],[4,3,4,4]]}
["Design-Fehlermodus- und -auswirkungsanalyse"]
[null,null,"Produktnummer:",null,null,"Markt:",null,null,null,null,"Dokumentennummer:"]
[null,null,"Produktname:",null,null,"Modelljahr:",null,null,null,null,"Erscheinungsdatum:"]
[null,null,"Teammitglieder:",null,null,null,null,null,null,null,"Datum der letzten Revision:"]
[null,null,"Revisionsnummer:",null,null,"Genehmigt von:",null,null,null,null,"Neues Revisionsdatum:"]
[]
["Artikel","Produktfunktion","Potenzieller Ausfallmodus","Potenzielle Ausfalleffekte","B","Mögliche Ursachen","A","Derzeitige Prüfungen","E","RPZ","Empfohlene Handlungen","Pläne/Verantwortung","pB","pA","pE","pRPZ"]
[null,null,null,null,null,null,null,null,null,{"$f":"E8*G8*I8","v":0},null,null,null,null,null,{"$f":"O8*N8*M8","v":0}]
[null,null,null,null,null,null,null,null,null,0,null,null,null,null,null,0]
[null,null,null,null,null,null,null,null,null,0,null,null,null,null,null,0]
[null,null,null,null,null,null,null,null,null,0,null,null,null,null,null,0]
[null,null,null,null,null,null,null,null,null,0,null,null,null,null,null,0]
[null,null,null,null,null,null,null,null,null,0,null,null,null,null,null,0]
[null,null,null,null,null,null,null,null,null,0,null,null,null,null,null,0]
[null,null,null,null,null,null,null,null,null,0,null,null,null,null,null,0]
[null,null,null,null,null,null,null,null,null,0,null,null,null,null,null,0]
[null,null,null,null,null,null,null,null,null,0,null,null,null,null,null,0]
[null,null,null,null,null,null,null,null,null,0,null,null,null,null,null,0]
[null,null,null,null,null,null,null,null,null,0,null,null,null,null,null,0]
[null,null,null,null,null,null,null,null,null,0,null,null,null,null,null,0]
[null,null,null,null,null,null,null,null,null,0,null,null,null,null,null,0]
[null,null,null,null,null,null,null,null,null,0,null,null,null,null,null,0]
[null,null,null,null,null,null,null,null,null,0,null,null,null,null,null,0]
[null,null,null,null,null,null,null,null,null,0,null,null,null,null,null,0]
[null,null,null,null,null,null,null,null,null,0,null,null,null,null,null,0]
[null,null,null,null,null,null,null,null,null,0,null,null,null,null,null,0]
[null,null,null,null,null,null,null,null,null,0,null,null,null,null,null,0]
[null,null,null,null,null,null,null,null,null,0,null,null,null,null,null,0]
[null,null,null,null,null,null,null,null,null,0,null,null,null,null,null,0]
[null,null,null,null,null,null,null,null,null,0,null,null,null,null,null,0]
[null,null,null,null,null,null,null,null,null,0,null,null,null,null,null,0]
[null,null,null,null,null,null,null,null,null,0,null,null,null,null,null,0]
[null,null,null,null,null,null,null,null,null,0,null,null,null,null,null,0]
[null,null,null,null,null,null,null,null,null,0,null,null,null,null,null,0]
[null,null,null,null,null,null,null,null,null,0,null,null,null,null,null,0]
[null,null,null,null,null,null,null,null,null,0,null,null,null,null,null,0]
[null,null,null,null,null,null,null,null,null,0,null,null,null,null,null,0]
[null,null,null,null,null,null,null,null,null,0,null,null,null,null,null,0]
[null,null,null,null,null,null,null,null,null,0,null,null,null,null,null,0]
[null,null,null,null,null,null,null,null,null,0,null,null,null,null,null,0]
[null,null,null,null,null,null,null,null,null,0,null,null,null,null,null,0]
[null,null,null,null,null,null,null,null,null,0,null,null,null,null,null,0]
[null,null,null,null,null,null,null,null,null,0,null,null,null,null,null,0]
[null,null,null,null,null,null,null,null,null,0,null,null,null,null,null,0]
[null,null,null,null,null,null,null,null,null,0,null,null,null,null,null,0]
[null,null,null,null,null,null,null,null,null,0,null,null,null,null,null,0]
[null,null,null,null,null,null,null,null,null,0,null,null,null,null,null,0]
[null,null,null,null,null,null,null,null,null,0,null,null,null,null,null,0]
[null,null,null,null,null,null,null,null,null,0,null,null,null,null,null,0]
[null,null,null,null,null,null,null,null,null,0,null,null,null,null,null,0]
[null,null,null,null,null,null,null,null,null,0,null,null,null,null,null,0]
[null,null,null,null,null,null,null,null,null,0,null,null,null,null,null,0]
[null,null,null,null,null,null,null,null,null,0,null,null,null,null,null,0]
[null,null,null,null,null,null,null,null,null,0,null,null,null,null,null,0]
[null,null,null,null,null,null,null,null,null,0,null,null,null,null,null,0]
[null,null,null,null,null,null,null,null,null,0,null,null,null,null,null,0]
[null,null,null,null,null,null,null,null,null,0,null,null,null,null,null,0]
[null,null,null,null,null,null,null,null,null,0,null,null,null,null,null,0]
[null,null,null,null,null,null,null,null,null,0,null,null,null,null,null,0]
[null,null,null,null,null,null,null,null,null,0,null,null,null,null,null,0]
[null,null,null,null,null,null,null,null,null,0,null,null,null,null,null,0]
[null,null,null,null,null,null,null,null,null,0,null,null,null,null,null,0]
[null,null,null,null,null,null,null,null,null,0,null,null,null,null,null,0]
[null,null,null,null,null,null,null,null,null,0,null,null,null,null,null,0]
[null,null,null,null,null,null,null,null,null,0,null,null,null,null,null,0]
[null,null,null,null,null,null,null,null,null,0,null,null,null,null,null,0]
[null,null,null,null,null,null,null,null,null,0,null,null,null,null,null,0]
[null,null,null,null,null,null,null,null,null,0,null,null,null,null,null,0]
[null,null,null,null,null,null,null,null,null,0,null,null,null,null,null,0]
[null,null,null,null,null,null,null,null,null,0,null,null,null,null,null,0]
[null,null,null,null,null,null,null,null,null,0,null,null,null,null,null,0]
[null,null,null,null,null,null,null,null,null,{"$f":"E72*G72*I72","v":0},null,null,null,null,null,0]
[null,null,null,null,null,null,null,null,null,0,null,null,null,null,null,0]
[null,null,null,null,null,null,null,null,null,0,null,null,null,null,null,0]
[null,null,null,null,null,null,null,null,null,0,null,null,null,null,null,{"$f":"O75*N75*M75","v":0}]
[null,null,null,null,null,null,null,null,null,0,null,null,null,null,null,0]
[null,null,null,null,null,null,null,null,null,0,null,null,null,null,null,0]
[null,null,null,null,null,null,null,null,null,0,null,null,null,null,null,0]
[null,null,null,null,null,null,null,null,null,0,null,null,null,null,null,0]
[null,null,null,null,null,null,null,null,null,0,null,null,null,null,null,0]
[null,null,null,null,null,null,null,null,null,0,null,null,null,null,null,0]
[null,null,null,null,null,null,null,null,null,0,null,null,null,null,null,0]

{"sheet":"3.Process FMEA","index":5,"n_rows":82,"n_cols":16,"rows_kept":82,"cut":false,"hidden":false,"merged":[[0,0,0,15],[1,6,1,9],[2,6,2,9],[3,3,3,5],[3,6,4,9],[4,3,4,4]]}
["Prozessfehlermodus- und -auswirkungsanalyse"]
[null,null,"Produktnummer:",null,null,"Markt:",null,null,null,null,"Dokumentennummer:"]
[null,null,"Produktname:",null,null,"Modelljahr:",null,null,null,null,"Erscheinungsdatum:"]
[null,null,"Teammitglieder:",null,null,null,null,null,null,null,"Datum der letzten Revision:"]
[null,null,"Revisionsnummer:",null,null,"Genehmigt von:",null,null,null,null,"Neues Revisionsdatum:"]
[]
["Artikel","Produktfunktion","Potenzieller Ausfallmodus","Potenzielle Ausfalleffekte","B","Mögliche Ursachen","A","Derzeitige Prüfungen","E","RPZ","Empfohlene Handlungen","Pläne/Verantwortung","pB","pA","pE","pRPZ"]
[null,null,null,null,null,null,null,null,null,{"$f":"E8*G8*I8","v":0},null,null,null,null,null,{"$f":"O8*N8*M8","v":0}]
[null,null,null,null,null,null,null,null,null,0,null,null,null,null,null,0]
[null,null,null,null,null,null,null,null,null,0,null,null,null,null,null,0]
[null,null,null,null,null,null,null,null,null,0,null,null,null,null,null,0]
[null,null,null,null,null,null,null,null,null,0,null,null,null,null,null,0]
[null,null,null,null,null,null,null,null,null,0,null,null,null,null,null,0]
[null,null,null,null,null,null,null,null,null,0,null,null,null,null,null,0]
[null,null,null,null,null,null,null,null,null,0,null,null,null,null,null,0]
[null,null,null,null,null,null,null,null,null,0,null,null,null,null,null,0]
[null,null,null,null,null,null,null,null,null,0,null,null,null,null,null,0]
[null,null,null,null,null,null,null,null,null,0,null,null,null,null,null,0]
[null,null,null,null,null,null,null,null,null,0,null,null,null,null,null,0]
[null,null,null,null,null,null,null,null,null,0,null,null,null,null,null,0]
[null,null,null,null,null,null,null,null,null,0,null,null,null,null,null,0]
[null,null,null,null,null,null,null,null,null,0,null,null,null,null,null,0]
[null,null,null,null,null,null,null,null,null,0,null,null,null,null,null,0]
[null,null,null,null,null,null,null,null,null,0,null,null,null,null,null,0]
[null,null,null,null,null,null,null,null,null,0,null,null,null,null,null,0]
[null,null,null,null,null,null,null,null,null,0,null,null,null,null,null,0]
[null,null,null,null,null,null,null,null,null,0,null,null,null,null,null,0]
[null,null,null,null,null,null,null,null,null,0,null,null,null,null,null,0]
[null,null,null,null,null,null,null,null,null,0,null,null,null,null,null,0]
[null,null,null,null,null,null,null,null,null,0,null,null,null,null,null,0]
[null,null,null,null,null,null,null,null,null,0,null,null,null,null,null,0]
[null,null,null,null,null,null,null,null,null,0,null,null,null,null,null,0]
[null,null,null,null,null,null,null,null,null,0,null,null,null,null,null,0]
[null,null,null,null,null,null,null,null,null,0,null,null,null,null,null,0]
[null,null,null,null,null,null,null,null,null,0,null,null,null,null,null,0]
[null,null,null,null,null,null,null,null,null,0,null,null,null,null,null,0]
[null,null,null,null,null,null,null,null,null,0,null,null,null,null,null,0]
[null,null,null,null,null,null,null,null,null,0,null,null,null,null,null,0]
[null,null,null,null,null,null,null,null,null,0,null,null,null,null,null,0]
[null,null,null,null,null,null,null,null,null,0,null,null,null,null,null,0]
[null,null,null,null,null,null,null,null,null,0,null,null,null,null,null,0]
[null,null,null,null,null,null,null,null,null,0,null,null,null,null,null,0]
[null,null,null,null,null,null,null,null,null,0,null,null,null,null,null,0]
[null,null,null,null,null,null,null,null,null,0,null,null,null,null,null,0]
[null,null,null,null,null,null,null,null,null,0,null,null,null,null,null,0]
[null,null,null,null,null,null,null,null,null,0,null,null,null,null,null,0]
[null,null,null,null,null,null,null,null,null,0,null,null,null,null,null,0]
[null,null,null,null,null,null,null,null,null,0,null,null,null,null,null,0]
[null,null,null,null,null,null,null,null,null,0,null,null,null,null,null,0]
[null,null,null,null,null,null,null,null,null,0,null,null,null,null,null,0]
[null,null,null,null,null,null,null,null,null,0,null,null,null,null,null,0]
[null,null,null,null,null,null,null,null,null,0,null,null,null,null,null,0]
[null,null,null,null,null,null,null,null,null,0,null,null,null,null,null,0]
[null,null,null,null,null,null,null,null,null,0,null,null,null,null,null,0]
[null,null,null,null,null,null,null,null,null,0,null,null,null,null,null,0]
[null,null,null,null,null,null,null,null,null,0,null,null,null,null,null,0]
[null,null,null,null,null,null,null,null,null,0,null,null,null,null,null,0]
[null,null,null,null,null,null,null,null,null,0,null,null,null,null,null,0]
[null,null,null,null,null,null,null,null,null,0,null,null,null,null,null,0]
[null,null,null,null,null,null,null,null,null,0,null,null,null,null,null,0]
[null,null,null,null,null,null,null,null,null,0,null,null,null,null,null,0]
[null,null,null,null,null,null,null,null,null,0,null,null,null,null,null,0]
[null,null,null,null,null,null,null,null,null,0,null,null,null,null,null,0]
[null,null,null,null,null,null,null,null,null,0,null,null,null,null,null,0]
[null,null,null,null,null,null,null,null,null,0,null,null,null,null,null,0]
[null,null,null,null,null,null,null,null,null,0,null,null,null,null,null,0]
[null,null,null,null,null,null,null,null,null,0,null,null,null,null,null,0]
[null,null,null,null,null,null,null,null,null,0,null,null,null,null,null,0]
[null,null,null,null,null,null,null,null,null,0,null,null,null,null,null,0]
[null,null,null,null,null,null,null,null,null,0,null,null,null,null,null,0]
[null,null,null,null,null,null,null,null,null,0,null,null,null,null,null,0]
[null,null,null,null,null,null,null,null,null,{"$f":"E72*G72*I72","v":0},null,null,null,null,null,0]
[null,null,null,null,null,null,null,null,null,0,null,null,null,null,null,0]
[null,null,null,null,null,null,null,null,null,0,null,null,null,null,null,0]
[null,null,null,null,null,null,null,null,null,0,null,null,null,null,null,{"$f":"O75*N75*M75","v":0}]
[null,null,null,null,null,null,null,null,null,0,null,null,null,null,null,0]
[null,null,null,null,null,null,null,null,null,0,null,null,null,null,null,0]
[null,null,null,null,null,null,null,null,null,0,null,null,null,null,null,0]
[null,null,null,null,null,null,null,null,null,0,null,null,null,null,null,0]
[null,null,null,null,null,null,null,null,null,0,null,null,null,null,null,0]
[null,null,null,null,null,null,null,null,null,0,null,null,null,null,null,0]
[null,null,null,null,null,null,null,null,null,0,null,null,null,null,null,0]

{"sheet":"4.Control Plan","index":6,"n_rows":47,"n_cols":16,"rows_kept":47,"cut":false,"hidden":false,"merged":[[1,1,1,2],[1,3,1,4],[1,7,1,9],[2,1,2,2],[2,3,2,6],[3,14,3,15],[4,14,5,15],[6,1,6,3],[6,4,6,6],[6,7,8,7],[6,8,8,8],[6,9,6,11],[6,12,8,12],[6,13,8,13],[6,14,8,14],[3,1,5,2],[3,3,5,4],[19,7,21,7],[24,7,27,7],[29,7,36,7],[6,15,8,15],[7,1,8,1],[7,2,8,2],[7,3,8,3],[7,4,8,4],[7,9,8,9],[7,10,7,11]]}
[null,null,null,null,null,null,null,null,"Kontrollplan"]
[null,"Name des Lieferanten:",null,{"$f":"'0.Submission Checklist'!R2","v":0},null,null,null,"Zulassungen",null,null,"Vorbereitet von",null,null,null,"Ausgabedatum:"]
[null,"Produktname",null,null,null,null,null,"Abteilung","Name/Unterschrift","Datum","Abteilung","Bezeichnung","Abteilung","Bezeichnung","Revisionsdatum:"]
[null,"Kontrollplannummer",null,null,null,null,null,"Qualität",{"$f":"'0.Submission Checklist'!D8","v":0},null,"Technik",null,"Im Maschinenzentrum",null,"Notizen:"]
[null,null,null,null,null,null,null,"Einkauf",{"$f":"'0.Submission Checklist'!D7","v":0},null,"Qualität",null,"Montage",null,"Dieser Kontrollplan wird bei Prozessänderungen und/oder neuen Ausfallmodi aktualisiert."]
[null,null,null,null,null,null,null,"Technik",{"$f":"'0.Submission Checklist'!D6","v":0},null,"Verpackung",null,"Zeichnung"]
[null,"Prozessablauf",null,null,"Produktfunktion und\n Kundenbeschwerden",null,null,"Gemessene Produkt-/Prozesscharakteristik\n","Produkt-/\nProzessspezifikation\n","Methoden",null,null,"Verantwortliche Person","Vorgesetzter","Aufzeichung","Reaktion, wenn außer Kontrolle / nicht konform"]
[null,"Prozessschritt-Nr.","Prozessschrittname","Maschine, Gerät, Vorrichtung für die Fertigung",null,null,null,null,null,"Messverfahren","Muster"]
[null,null,null,null,"Ölleckage vom Ritzel",null,null,null,null,null,"Größe","Häufigkeit"]
[null,0,"Hauptschritt"]
[null,0.1,"Teilschritt"]
[null,0.2,"Teilschritt"]
[null,0.3,"Teilschritt"]
[null,0.4,"…"]
[null,0.5]
[null,0.6]
[null,0.7]
[null,0.8]
[null,1,"Hauptschritt"]
[null,1.1000000000000001,"Teilschritt"]
[null,1.2,"Teilschritt"]
[null,1.3,"Teilschritt"]
[null,1.4,"…"]
[null,2,"Hauptschritt"]
[null,2.1,"Teilschritt"]
[null,2.2000000000000002,"Teilschritt"]
[null,2.2999999999999998,"Teilschritt"]
[null,2.4,"…"]
[null,3]
[null,3.1]
[null,3.2]
[null,3.3]
[null,3.4]
[null,3.5]
[null,3.6]
[null,3.7]
[null,3.8]
[null,4]
[null,4.0999999999999996]
[null,5]
[null,5.0999999999999996]
[null,6]
[null,6.1]
[null,6.2]
[null,6.3]
[null,6.4]
[null,6.5]

{"sheet":"5.MSA GR&R","index":7,"n_rows":101,"n_cols":17,"rows_kept":101,"cut":false,"hidden":false,"merged":[[16,5,16,6],[16,9,16,10],[16,13,16,14],[1,2,1,17],[4,2,4,4],[4,5,4,14],[5,2,5,4],[5,5,5,14],[6,2,6,4],[6,5,6,14],[7,2,7,4],[7,5,7,14],[15,5,15,6],[15,9,15,10],[15,13,15,14],[27,4,27,6],[27,9,27,11],[27,14,27,16],[17,5,17,6],[17,9,17,10],[17,13,17,14],[18,5,18,6],[18,9,18,10],[18,13,18,14],[19,5,19,6],[19,9,19,10],[19,13,19,14],[20,9,20,10],[20,13,20,14],[28,3,28,5],[28,8,28,10],[28,13,28,15],[47,4,47,6],[47,9,47,11],[47,14,47,16],[83,5,83,6],[49,2,49,7],[51,9,51,10],[55,11,55,12],[59,2,59,16],[63,5,63,6],[63,8,63,9],[63,11,63,12],[69,5,69,6],[69,8,69,9],[70,5,70,6],[82,5,82,6],[82,8,82,9],[87,12,87,13],[90,11,92,15],[91,5,91,6],[91,8,91,9],[92,5,92,6]]}
[]
[null,null,"MSA GR&R"]
[]
[]
[null,null,"Material:",null,null,{"$f":"'0.Submission Checklist'!D4","v":0}]
[null,null,"Zeichnungsnummer: ",null,null,{"$f":"'0.Submission Checklist'!D2","v":0}]
[null,null,"Zeichnungsrevision:",null,null,{"$f":"'0.Submission Checklist'!D3","v":0}]
[null,null,"Vorbereitet von:"]
[]
[null,null,"Anleitung für dieses Formular:"]
[null,null,"1) Füllen Sie nur die schattierten Felder aus."]
[null,null,"2) Wenn Sie codierte Daten verwenden, achten Sie darauf, die „Gesamttoleranz“ in codierter Form zu schreiben."]
[]
[null,null,"Hinweis: „Gesamttoleranz“ und „Bedienernamen“ MÜSSEN ausgefüllt werden, damit das Formular ordnungsgemäß funktioniert!!"]
[]
[null,null,null,null,"Messgerätename:",null,null,null,"Bauteilnummer:",null,null,null,"Durchgeführt von:"]
[null,null,null,null,"Messgerätenummer:",null,null,null,"Bauteilname:",null,null,null,"Bediener A:"]
[null,null,null,null,"Abstufungen:",null,null,null,"Betriebsnummer:",null,null,null,"Bediener B:"]
[null,null,null,null,"Null ist gleich:",null,null,null,"Merkmal:",null,null,null,"Bediener C:"]
[null,null,null,null,"Maßeinheit:",null,null,null,"Spezifikation:",null,null,null,"Bereich:"]
[null,null,null,null,null,null,null,null,"Gesamttoleranz:",null,null,null,"Datum:"]
[]
[null,null,"Anleitung:"]
[null,null,"1) Wählen Sie 10 Teile zufällig aus und nummerieren Sie sie von 1 bis 10. (bei Bedarf können Sie 5 Teile verwendet)"]
[null,null,"2) Lassen Sie zwei oder drei Bediener unabhängig voneinander jedes Teil zwei- oder dreimal messen. Notieren Sie die Ergebnisse unten."]
[null,null,"3) Analysieren Sie die Ergebnisse, um die Variabilität sowohl aufgrund der Wiederholbarkeit als auch der Reproduzierbarkeit zu bestimmen."]
[]
[null,null,"Bediener","A:",{"$f":"IF(N17=\"\",\"\",N17)","v":""},null,null,"Bediener","B)",{"$f":"IF(N18=\"\",\"\",N18)","v":""},null,null,"Bediener","C",{"$f":"IF(N19=\"\",\"\",N19)","v":""}]
[null,null,"Muster","Wiederholungen",null,null,null,"Muster","Wiederholungen",null,null,null,"Muster","Wiederholungen"]
[null,null,"Nummer",1,2,3,"R","Nummer",1,2,3,"R","Nummer",1,2,3,"R"]
[null,null,1,null,null,null,{"$f":"IF(COUNT(D31)=1,ABS((MAX(D31:F31))-(MIN(D31:F31))),\" \")","v":" "},1,null,null,null,{"$f":"IF(COUNT(I31)=1,ABS((MAX(I31:K31))-(MIN(I31:K31))),\" \")","v":" "},1,null,null,null,{"$f":"IF(COUNT(N31)=1,ABS((MAX(N31:P31))-(MIN(N31:P31))),\" \")","v":" "}]
[null,null,2,null,null,null," ",2,null,null,null," ",2,null,null,null," "]
[null,null,3,null,null,null," ",3,null,null,null," ",3,null,null,null," "]
[null,null,4,null,null,null," ",4,null,null,null," ",4,null,null,null," "]
[null,null,5,null,null,null," ",5,null,null,null," ",5,null,null,null," "]
[null,null,6,null,null,null," ",6,null,null,null," ",6,null,null,null," "]
[null,null,7,null,null,null," ",7,null,null,null," ",7,null,null,null," "]
[null,null,8,null,null,null," ",8,null,null,null," ",8,null,null,null," "]
[null,null,9,null,null,null," ",9,null,null,null," ",9,null,null,null," "]
[null,null,10,null,null,null," ",10,null,null,null," ",10,null,null,null," "]
[null,null,"Total",{"$f":"IF(COUNT(D31)=1,SUM(D31:D40),\" \")","v":" "},{"$f":"IF(COUNT(E31)=1,SUM(E31:E40),\" \")","v":" "},{"$f":"IF(COUNT(F31)=1,SUM(F31:F40),\" \")","v":" "},{"$f":"IF(COUNT(G31)=1,SUM(G31:G40),\" \")","v":" "},"Total",{"$f":"IF(COUNT(I31)=1,SUM(I31:I40),\" \")","v":" "},{"$f":"IF(COUNT(J31)=1,SUM(J31:J40),\" \")","v":" "},{"$f":"IF(COUNT(K31)=1,SUM(K31:K40),\" \")","v":" "},{"$f":"IF(COUNT(L31)=1,SUM(L31:L40),\" \")","v":" "},"Total",{"$f":"IF(COUNT(N31)=1,SUM(N31:N40),\" \")","v":" "},{"$f":"IF(COUNT(O31)=1,SUM(O31:O40),\" \")","v":" "},{"$f":"IF(COUNT(P31)=1,SUM(P31:P40),\" \")","v":" "},{"$f":"IF(COUNT(Q31)=1,SUM(Q31:Q40),\" \")","v":" "}]
[null,null,"Mittel",{"$f":"IF(COUNT(D31)=1,AVERAGE(D31:D40),\" \")","v":" "},{"$f":"IF(COUNT(E31)=1,AVERAGE(E31:E40),\" \")","v":" "},{"$f":"IF(COUNT(F31)=1,AVERAGE(F31:F40),\" \")","v":" "},{"$f":"IF(COUNT(G31)=1,AVERAGE(G31:G40),\" \")","v":" "},"Mittel",{"$f":"IF(COUNT(I31)=1,AVERAGE(I31:I40),\" \")","v":" "},{"$f":"IF(COUNT(J31)=1,AVERAGE(J31:J40),\" \")","v":" "},{"$f":"IF(COUNT(K31)=1,AVERAGE(K31:K40),\" \")","v":" "},{"$f":"IF(COUNT(L31)=1,AVERAGE(L31:L40),\" \")","v":" "},"Mittel",{"$f":"IF(COUNT(N31)=1,AVERAGE(N31:N40),\" \")","v":" "},{"$f":"IF(COUNT(O31)=1,AVERAGE(O31:O40),\" \")","v":" "},{"$f":"IF(COUNT(P31)=1,AVERAGE(P31:P40),\" \")","v":" "},{"$f":"IF(COUNT(Q31)=1,AVERAGE(Q31:Q40),\" \")","v":" "}]
[null,null,null,"Xbar1","Xbar2","Xbar3","RbarA",null,"Xbar1","Xbar2","Xbar3","RbarB",null,"Xbar1","Xbar2","Xbar3","RbarC"]
[]
[null,null,null,"XbarA =","Xbar1 + Xbar2 + Xbar3",null,null,null,"XbarB =","Xbar1 + Xbar2 + Xbar3",null,null,null,"XbarC =","Xbar1 + Xbar2 + Xbar3"]
[null,null,null,null,"Wiederholungen",null,null,null,null,"Wiederholungen",null,null,null,null,"Wiederholungen"]
[]
[null,null,null,"XbarA =",{"$f":"IF(COUNT(D42)=1,AVERAGE(D42:F42),\" \")","v":" "},null,null,null,"XbarB =",{"$f":"IF(COUNT(I42)=1,AVERAGE(I42:K42),\" \")","v":" "},null,null,null,"XbarC =",{"$f":"IF(COUNT(N42)=1,AVERAGE(N42:P42),\" \")","v":" "}]
[]
[null,null,"Test zur statistischen Bereichskontrolle"]
[]
[null,null,"Rbar1 =","RbarA + RbarB + RbarC =",null,null,null,{"$f":"IF(COUNT(Q42)=1,(G42+L42+Q42),(G42+L42))","v":{"$error":"#VALUE!"}},"=",{"$f":"H52/H53","v":{"$error":"#VALUE!"}}]
[null,null,null,"       Bediener",null,null,null,{"$f":"IF((N19>=\"a\"),3,2)","v":2}]
[]
[]
[null,null,"UCLR =","D4 * Rbar1      =",null,null,{"$f":"IF((COUNT(D31:F31)=2),E100,E101)","v":2.5739999999999998},"*",{"$f":"J52","v":{"$error":"#VALUE!"}},null,"=",{"$f":"G56*I56","v":{"$error":"#VALUE!"}},null,"= Bereichsobergrenze"]
[]
[null,null,"Hinweis: D4 basiert auf der Anzahl Wiederholungen.  (siehe Tabelle unten)"]
[]
[null,null,"                                     Ausführliche Messsystemanalyse"]
[]
[null,null,"Wiederholbarkeit (Messvariation)"]
[]
[null,null,"SGV =","Rbar1 / d2  =",null,{"$f":"J52","v":{"$error":"#VALUE!"}},null,"/",{"$f":"IF((COUNT(D31:F31)=2),F100,F101)","v":1.6930000000000001},null,"=",{"$f":"F64/I64","v":{"$error":"#VALUE!"}}]
[]
[null,null,"Hinweis: d2 basiert auf der Anzahl Wiederholungen.  (siehe Tabelle unten)"]
[]
[null,null,"Prozentualer Toleranzverbrauch des Messgeräts:"]
[]
[null,null,"100 * 6 * SGV",null,"=",{"$f":"L64*6*100","v":{"$error":"#VALUE!"}},null,"=",{"$f":"(L64*6)/F71","v":{"$error":"#VALUE!"}}]
[null,null,"Toleranz",null,null,{"$f":"J21","v":0}]
[]
[null,null,"Wiederholbarkeit (zwischen Betreibervariation)"]
[]
[null,null,"Rbar2 =","XbarGrößtes von ABC - XbarKleinstes von ABC =",null,null,null,null,{"$f":"MAX(E48,J48,O48)","v":0},null,"-",{"$f":"MIN(E48,J48,O48)","v":0},null,"=",{"$f":"I75-L75","v":0}]
[]
[null,null,"SOV =","Rbar2 / d0  =",null,{"$f":"O75","v":0},null,"/",{"$f":"IF((COUNTA(N17:N19)=2),G100,G101)","v":1.9079999999999999},null,"=",{"$f":"F77/I77","v":0}]
[]
[null,null,"Hinweis: d0 basiert auf der Anzahl Betreiber.  (siehe Tabelle)"]
[]
[null,null,"Prozentsatz der von der Betreibervariation verbrauchten Toleranz:"]
[]
[null,null,"100 * 6 * SOV",null,"=",{"$f":"L77*6*100","v":0},null,"=",{"$f":"(L77*6)/F84","v":{"$error":"#DIV/0!"}}]
[null,null,"Toleranz",null,null,{"$f":"J21","v":0}]
[]
[null,null,"Kombination Reproduzierbarkeit und Wiederholbarkeit (Messvariation)"]
[]
[null,null,"SMV =",null,"      SOV2 + SGV2    =",null,null,{"$f":"L77","v":0},"+",{"$f":"L64","v":{"$error":"#VALUE!"}},null,"=",{"$f":"SQRT((H88^2)+(J88^2))","v":{"$error":"#VALUE!"}}]
[]
[null,null,"Prozentualer Toleranzverbrauch durch Messvariabilität:"]
[null,null,null,null,null,null,null,null,null,null,null,{"$f":"IF(I92<0.1,\"PASS\",IF(AND(I92>=0.1, I92<=0.3),\"MARGINAL\",IF(I92>0.3,\"FAIL\",\"Error\")))","v":{"$error":"#VALUE!"}}]
[null,null,"100 * 6 * SMV",null,"=",{"$f":"M88*6*100","v":{"$error":"#VALUE!"}},null,"=",{"$f":"(M88*6)/F93","v":{"$error":"#VALUE!"}}]
[null,null,"Toleranz",null,null,{"$f":"J21","v":0}]
[]
[]
[]
[null,null,"Tabelle der in Berechnungen verwendeten Faktoren."]
[]
[null,null,null,"n","D4","d2","d0"]
[null,null,null,2,3.2679999999999998,1.1279999999999999,1.41]
[null,null,null,3,2.5739999999999998,1.6930000000000001,1.9079999999999999]

{"sheet":"6.Dimensional Results","index":8,"n_rows":335,"n_cols":47,"rows_kept":335,"cut":false,"hidden":false,"merged":[[4,7,4,9],[4,10,4,15],[4,16,4,17],[4,18,4,23],[4,25,4,26],[5,7,5,9],[5,10,5,15],[5,16,5,17],[5,18,5,23],[5,25,5,26],[0,1,2,8],[0,9,2,18],[0,19,2,26],[3,7,3,9],[3,10,3,15],[3,16,3,17],[3,18,3,23],[3,25,3,26],[12,1,12,2],[12,8,12,9],[12,10,13,12],[12,13,13,14],[12,15,12,23],[12,24,13,26],[8,2,8,3],[8,4,8,5],[8,8,8,10],[8,11,8,23],[10,1,10,4],[10,12,10,14],[10,16,10,17],[10,22,10,23],[6,7,6,9],[6,10,6,13],[6,16,6,17],[6,18,6,19],[6,21,6,23],[6,25,6,26],[15,3,15,6],[15,10,15,12],[15,13,15,14],[15,22,15,23],[15,24,15,26],[16,3,16,6],[16,10,16,12],[16,13,16,14],[16,22,16,23],[16,24,16,26],[12,33,13,33],[12,34,13,34],[13,3,13,6],[13,22,13,23],[14,3,14,6],[14,10,14,12],[14,13,14,14],[14,22,14,23],[14,24,14,26],[12,27,13,27],[12,28,13,28],[12,29,13,29],[12,30,13,30],[12,31,13,31],[12,32,13,32],[19,3,19,6],[19,10,19,12],[19,13,19,14],[19,22,19,23],[19,24,19,26],[20,3,20,6],[20,10,20,12],[20,13,20,14],[20,22,20,23],[20,24,20,26],[17,3,17,6],[17,10,17,12],[17,13,17,14],[17,22,17,23],[17,24,17,26],[18,3,18,6],[18,10,18,12],[18,13,18,14],[18,22,18,23],[18,24,18,26],[23,3,23,6],[23,10,23,12],[23,13,23,14],[23,22,23,23],[23,24,23,26],[24,3,24,6],[24,10,24,12],[24,13,24,14],[24,22,24,23],[24,24,24,26],[21,3,21,6],[21,10,21,12],[21,13,21,14],[21,22,21,23],[21,24,21,26],[22,3,22,6],[22,10,22,12],[22,13,22,14],[22,22,22,23],[22,24,22,26],[27,3,27,6],[27,10,27,12],[27,13,27,14],[27,22,27,23],[27,24,27,26],[28,3,28,6],[28,10,28,12],[28,13,28,14],[28,22,28,23],[28,24,28,26],[25,3,25,6],[25,10,25,12],[25,13,25,14],[25,22,25,23],[25,24,25,26],[26,3,26,6],[26,10,26,12],[26,13,26,14],[26,22,26,23],[26,24,26,26],[31,3,31,6],[31,10,31,12],[31,22,31,23],[31,24,31,26],[32,3,32,6],[32,10,32,12],[32,22,32,23],[32,24,32,26],[29,3,29,6],[29,10,29,12],[29,13,29,14],[29,22,29,23],[29,24,29,26],[30,3,30,6],[30,10,30,12],[30,22,30,23],[30,24,30,26],[37,3,37,6],[37,10,37,12],[37,22,37,23],[37,24,37,26],[38,3,38,6],[38,10,38,12],[38,22,38,23],[38,24,38,26],[35,3,35,6],[35,10,35,12],[35,22,35,23],[35,24,35,26],[36,3,36,6],[36,10,36,12],[36,22,36,23],[36,24,36,26],[33,3,33,6],[33,10,33,12],[33,22,33,23],[33,24,33,26],[34,3,34,6],[34,10,34,12],[34,22,34,23],[34,24,34,26],[43,3,43,6],[43,10,43,12],[43,22,43,23],[43,24,43,26],[44,3,44,6],[44,10,44,12],[44,22,44,23],[44,24,44,26],[41,3,41,6],[41,10,41,12],[41,22,41,23],[41,24,41,26],[42,3,42,6],[42,10,42,12],[42,22,42,23],[42,24,42,26],[39,3,39,6],[39,10,39,12],[39,22,39,23],[39,24,39,26],[40,3,40,6],[40,10,40,12],[40,22,40,23],[40,24,40,26],[49,3,49,6],[49,10,49,12],[49,22,49,23],[49,24,49,26],[50,3,50,6],[50,10,50,12],[50,22,50,23],[50,24,50,26],[47,3,47,6],[47,10,47,12],[47,22,47,23],[47,24,47,26],[48,3,48,6],[48,10,48,12],[48,22,48,23],[48,24,48,26],[45,3,45,6],[45,10,45,12],[45,22,45,23],[45,24,45,26],[46,3,46,6],[46,10,46,12],[46,22,46,23],[46,24,46,26],[55,3,55,6],[55,10,55,12],[55,22,55,23],[55,24,55,26],[56,3,56,6],[56,10,56,12],[56,22,56,23],[56,24,56,26],[53,3,53,6],[53,10,53,12],[53,22,53,23],[53,24,53,26],[54,3,54,6],[54,10,54,12],[54,22,54,23],[54,24,54,26],[51,3,51,6],[51,10,51,12],[51,22,51,23],[51,24,51,26],[52,3,52,6],[52,10,52,12],[52,22,52,23],[52,24,52,26],[61,3,61,6],[61,10,61,12],[61,22,61,23],[61,24,61,26],[62,3,62,6],[62,10,62,12],[62,22,62,23],[62,24,62,26],[59,3,59,6],[59,10,59,12],[59,22,59,23],[59,24,59,26],[60,3,60,6],[60,10,60,12],[60,22,60,23],[60,24,60,26],[57,3,57,6],[57,10,57,12],[57,22,57,23],[57,24,57,26],[58,3,58,6],[58,10,58,12],[58,22,58,23],[58,24,58,26],[67,3,67,6],[67,10,67,12],[67,22,67,23],[67,24,67,26],[68,3,68,6],[68,10,68,12],[68,22,68,23],[68,24,68,26],[65,3,65,6],[65,10,65,12],[65,22,65,23],[65,24,65,26],[66,3,66,6],[66,10,66,12],[66,22,66,23],[66,24,66,26],[63,3,63,6],[63,10,63,12],[63,22,63,23],[63,24,63,26],[64,3,64,6],[64,10,64,12],[64,22,64,23],[64,24,64,26],[73,3,73,6],[73,10,73,12],[73,22,73,23],[73,24,73,26],[74,3,74,6],[74,10,74,12],[74,22,74,23],[74,24,74,26],[71,3,71,6],[71,10,71,12],[71,22,71,23],[71,24,71,26],[72,3,72,6],[72,10,72,12],[72,22,72,23],[72,24,72,26],[69,3,69,6],[69,10,69,12],[69,22,69,23],[69,24,69,26],[70,3,70,6],[70,10,70,12],[70,22,70,23],[70,24,70,26],[77,3,77,6],[77,10,77,12],[77,22,77,23],[77,24,77,26],[78,3,78,6],[78,10,78,12],[78,13,78,14],[78,22,78,23],[78,24,78,26],[75,3,75,6],[75,10,75,12],[75,22,75,23],[75,24,75,26],[76,3,76,6],[76,10,76,12],[76,22,76,23],[76,24,76,26],[81,3,81,6],[81,10,81,12],[81,13,81,14],[81,22,81,23],[81,24,81,26],[82,3,82,6],[82,10,82,12],[82,13,82,14],[82,22,82,23],[82,24,82,26],[79,3,79,6],[79,10,79,12],[79,13,79,14],[79,22,79,23],[79,24,79,26],[80,3,80,6],[80,10,80,12],[80,13,80,14],[80,22,80,23],[80,24,80,26],[85,3,85,6],[85,10,85,12],[85,13,85,14],[85,22,85,23],[85,24,85,26],[86,3,86,6],[86,10,86,12],[86,13,86,14],[86,22,86,23],[86,24,86,26],[83,3,83,6],[83,10,83,12],[83,13,83,14],[83,22,83,23],[83,24,83,26],[84,3,84,6],[84,10,84,12],[84,13,84,14],[84,22,84,23],[84,24,84,26],[89,3,89,6],[89,10,89,12],[89,13,89,14],[89,22,89,23],[89,24,89,26],[90,3,90,6],[90,10,90,12],[90,13,90,14],[90,22,90,23],[90,24,90,26],[87,3,87,6],[87,10,87,12],[87,13,87,14],[87,22,87,23],[87,24,87,26],[88,3,88,6],[88,10,88,12],[88,13,88,14],[88,22,88,23],[88,24,88,26],[93,3,93,6],[93,10,93,12],[93,13,93,14],[93,22,93,23],[93,24,93,26],[94,3,94,6],[94,10,94,12],[94,13,94,14],[94,22,94,23],[94,24,94,26],[91,3,91,6],[91,10,91,12],[91,13,91,14],[91,22,91,23],[91,24,91,26],[92,3,92,6],[92,10,92,12],[92,13,92,14],[92,22,92,23],[92,24,92,26],[97,3,97,6],[97,10,97,12],[97,13,97,14],[97,22,97,23],[97,24,97,26],[98,3,98,6],[98,10,98,12],[98,13,98,14],[98,22,98,23],[98,24,98,26],[95,3,95,6],[95,10,95,12],[95,13,95,14],[95,22,95,23],[95,24,95,26],[96,3,96,6],[96,10,96,12],[96,13,96,14],[96,22,96,23],[96,24,96,26],[101,3,101,6],[101,10,101,12],[101,22,101,23],[101,24,101,26],[102,3,102,6],[102,10,102,12],[102,22,102,23],[102,24,102,26],[99,3,99,6],[99,10,99,12],[99,13,99,14],[99,22,99,23],[99,24,99,26],[100,3,100,6],[100,10,100,12],[100,22,100,23],[100,24,100,26],[107,3,107,6],[107,10,107,12],[107,22,107,23],[107,24,107,26],[108,3,108,6],[108,10,108,12],[108,22,108,23],[108,24,108,26],[105,3,105,6],[105,10,105,12],[105,22,105,23],[105,24,105,26],[106,3,106,6],[106,10,106,12],[106,22,106,23],[106,24,106,26],[103,3,103,6],[103,10,103,12],[103,22,103,23],[103,24,103,26],[104,3,104,6],[104,10,104,12],[104,22,104,23],[104,24,104,26],[113,3,113,6],[113,10,113,12],[113,22,113,23],[113,24,113,26],[114,3,114,6],[114,10,114,12],[114,22,114,23],[114,24,114,26],[111,3,111,6],[111,10,111,12],[111,22,111,23],[111,24,111,26],[112,3,112,6],[112,10,112,12],[112,22,112,23],[112,24,112,26],[109,3,109,6],[109,10,109,12],[109,22,109,23],[109,24,109,26],[110,3,110,6],[110,10,110,12],[110,22,110,23],[110,24,110,26],[119,3,119,6],[119,10,119,12],[119,22,119,23],[119,24,119,26],[120,3,120,6],[120,10,120,12],[120,22,120,23],[120,24,120,26],[117,3,117,6],[117,10,117,12],[117,22,117,23],[117,24,117,26],[118,3,118,6],[118,10,118,12],[118,22,118,23],[118,24,118,26],[115,3,115,6],[115,10,115,12],[115,22,115,23],[115,24,115,26],[116,3,116,6],[116,10,116,12],[116,22,116,23],[116,24,116,26],[125,3,125,6],[125,10,125,12],[125,22,125,23],[125,24,125,26],[126,3,126,6],[126,10,126,12],[126,22,126,23],[126,24,126,26],[123,3,123,6],[123,10,123,12],[123,22,123,23],[123,24,123,26],[124,3,124,6],[124,10,124,12],[124,22,124,23],[124,24,124,26],[121,3,121,6],[121,10,121,12],[121,22,121,23],[121,24,121,26],[122,3,122,6],[122,10,122,12],[122,22,122,23],[122,24,122,26],[131,3,131,6],[131,10,131,12],[131,22,131,23],[131,24,131,26],[132,3,132,6],[132,10,132,12],[132,22,132,23],[132,24,132,26],[129,3,129,6],[129,10,129,12],[129,22,129,23],[129,24,129,26],[130,3,130,6],[130,10,130,12],[130,22,130,23],[130,24,130,26],[127,3,127,6],[127,10,127,12],[127,22,127,23],[127,24,127,26],[128,3,128,6],[128,10,128,12],[128,22,128,23],[128,24,128,26],[137,3,137,6],[137,10,137,12],[137,22,137,23],[137,24,137,26],[138,3,138,6],[138,10,138,12],[138,22,138,23],[138,24,138,26],[135,3,135,6],[135,10,135,12],[135,22,135,23],[135,24,135,26],[136,3,136,6],[136,10,136,12],[136,22,136,23],[136,24,136,26],[133,3,133,6],[133,10,133,12],[133,22,133,23],[133,24,133,26],[134,3,134,6],[134,10,134,12],[134,22,134,23],[134,24,134,26],[141,3,141,6],[141,10,141,12],[141,13,141,14],[141,22,141,23],[141,24,141,26],[142,3,142,6],[142,10,142,12],[142,13,142,14],[142,22,142,23],[142,24,142,26],[139,3,139,6],[139,10,139,12],[139,22,139,23],[139,24,139,26],[140,3,140,6],[140,10,140,12],[140,13,140,14],[140,22,140,23],[140,24,140,26],[145,3,145,6],[145,10,145,12],[145,13,145,14],[145,22,145,23],[145,24,145,26],[146,3,146,6],[146,10,146,12],[146,13,146,14],[146,22,146,23],[146,24,146,26],[143,3,143,6],[143,10,143,12],[143,13,143,14],[143,22,143,23],[143,24,143,26],[144,3,144,6],[144,10,144,12],[144,13,144,14],[144,22,144,23],[144,24,144,26],[149,3,149,6],[149,10,149,12],[149,13,149,14],[149,22,149,23],[149,24,149,26],[150,3,150,6],[150,10,150,12],[150,13,150,14],[150,22,150,23],[150,24,150,26],[147,3,147,6],[147,10,147,12],[147,13,147,14],[147,22,147,23],[147,24,147,26],[148,3,148,6],[148,10,148,12],[148,13,148,14],[148,22,148,23],[148,24,148,26],[153,3,153,6],[153,10,153,12],[153,13,153,14],[153,22,153,23],[153,24,153,26],[154,3,154,6],[154,10,154,12],[154,13,154,14],[154,22,154,23],[154,24,154,26],[151,3,151,6],[151,10,151,12],[151,13,151,14],[151,22,151,23],[151,24,151,26],[152,3,152,6],[152,10,152,12],[152,13,152,14],[152,22,152,23],[152,24,152,26],[157,3,157,6],[157,10,157,12],[157,13,157,14],[157,22,157,23],[157,24,157,26],[158,3,158,6],[158,10,158,12],[158,13,158,14],[158,22,158,23],[158,24,158,26],[155,3,155,6],[155,10,155,12],[155,13,155,14],[155,22,155,23],[155,24,155,26],[156,3,156,6],[156,10,156,12],[156,13,156,14],[156,22,156,23],[156,24,156,26],[161,3,161,6],[161,10,161,12],[161,13,161,14],[161,22,161,23],[161,24,161,26],[162,3,162,6],[162,10,162,12],[162,13,162,14],[162,22,162,23],[162,24,162,26],[159,3,159,6],[159,10,159,12],[159,13,159,14],[159,22,159,23],[159,24,159,26],[160,3,160,6],[160,10,160,12],[160,13,160,14],[160,22,160,23],[160,24,160,26],[165,3,165,6],[165,10,165,12],[165,13,165,14],[165,22,165,23],[165,24,165,26],[166,3,166,6],[166,10,166,12],[166,13,166,14],[166,22,166,23],[166,24,166,26],[163,3,163,6],[163,10,163,12],[163,13,163,14],[163,22,163,23],[163,24,163,26],[164,3,164,6],[164,10,164,12],[164,13,164,14],[164,22,164,23],[164,24,164,26],[169,3,169,6],[169,10,169,12],[169,13,169,14],[169,22,169,23],[169,24,169,26],[170,3,170,6],[170,10,170,12],[170,13,170,14],[170,22,170,23],[170,24,170,26],[167,3,167,6],[167,10,167,12],[167,13,167,14],[167,22,167,23],[167,24,167,26],[168,3,168,6],[168,10,168,12],[168,13,168,14],[168,22,168,23],[168,24,168,26],[173,3,173,6],[173,10,173,12],[173,13,173,14],[173,22,173,23],[173,24,173,26],[174,3,174,6],[174,10,174,12],[174,13,174,14],[174,22,174,23],[174,24,174,26],[171,3,171,6],[171,10,171,12],[171,13,171,14],[171,22,171,23],[171,24,171,26],[172,3,172,6],[172,10,172,12],[172,13,172,14],[172,22,172,23],[172,24,172,26],[177,3,177,6],[177,10,177,12],[177,13,177,14],[177,22,177,23],[177,24,177,26],[178,3,178,6],[178,10,178,12],[178,13,178,14],[178,22,178,23],[178,24,178,26],[175,3,175,6],[175,10,175,12],[175,13,175,14],[175,22,175,23],[175,24,175,26],[176,3,176,6],[176,10,176,12],[176,13,176,14],[176,22,176,23],[176,24,176,26],[181,3,181,6],[181,10,181,12],[181,13,181,14],[181,22,181,23],[181,24,181,26],[182,3,182,6],[182,10,182,12],[182,13,182,14],[182,22,182,23],[182,24,182,26],[179,3,179,6],[179,10,179,12],[179,13,179,14],[179,22,179,23],[179,24,179,26],[180,3,180,6],[180,10,180,12],[180,13,180,14],[180,22,180,23],[180,24,180,26],[185,3,185,6],[185,10,185,12],[185,13,185,14],[185,22,185,23],[185,24,185,26],[186,3,186,6],[186,10,186,12],[186,13,186,14],[186,22,186,23],[186,24,186,26],[183,3,183,6],[183,10,183,12],[183,13,183,14],[183,22,183,23],[183,24,183,26],[184,3,184,6],[184,10,184,12],[184,13,184,14],[184,22,184,23],[184,24,184,26],[189,3,189,6],[189,10,189,12],[189,13,189,14],[189,22,189,23],[189,24,189,26],[190,3,190,6],[190,10,190,12],[190,13,190,14],[190,22,190,23],[190,24,190,26],[187,3,187,6],[187,10,187,12],[187,13,187,14],[187,22,187,23],[187,24,187,26],[188,3,188,6],[188,10,188,12],[188,13,188,14],[188,22,188,23],[188,24,188,26],[193,3,193,6],[193,10,193,12],[193,13,193,14],[193,22,193,23],[193,24,193,26],[194,3,194,6],[194,10,194,12],[194,13,194,14],[194,22,194,23],[194,24,194,26],[191,3,191,6],[191,10,191,12],[191,13,191,14],[191,22,191,23],[191,24,191,26],[192,3,192,6],[192,10,192,12],[192,13,192,14],[192,22,192,23],[192,24,192,26],[197,3,197,6],[197,10,197,12],[197,13,197,14],[197,22,197,23],[197,24,197,26],[198,3,198,6],[198,10,198,12],[198,13,198,14],[198,22,198,23],[198,24,198,26],[195,3,195,6],[195,10,195,12],[195,13,195,14],[195,22,195,23],[195,24,195,26],[196,3,196,6],[196,10,196,12],[196,13,196,14],[196,22,196,23],[196,24,196,26],[201,3,201,6],[201,10,201,12],[201,13,201,14],[201,22,201,23],[201,24,201,26],[202,3,202,6],[202,10,202,12],[202,13,202,14],[202,22,202,23],[202,24,202,26],[199,3,199,6],[199,10,199,12],[199,13,199,14],[199,22,199,23],[199,24,199,26],[200,3,200,6],[200,10,200,12],[200,13,200,14],[200,22,200,23],[200,24,200,26],[205,3,205,6],[205,10,205,12],[205,13,205,14],[205,22,205,23],[205,24,205,26],[206,3,206,6],[206,10,206,12],[206,13,206,14],[206,22,206,23],[206,24,206,26],[203,3,203,6],[203,10,203,12],[203,13,203,14],[203,22,203,23],[203,24,203,26],[204,3,204,6],[204,10,204,12],[204,13,204,14],[204,22,204,23],[204,24,204,26],[209,3,209,6],[209,10,209,12],[209,13,209,14],[209,22,209,23],[209,24,209,26],[210,3,210,6],[210,10,210,12],[210,13,210,14],[210,22,210,23],[210,24,210,26],[207,3,207,6],[207,10,207,12],[207,13,207,14],[207,22,207,23],[207,24,207,26],[208,3,208,6],[208,10,208,12],[208,13,208,14],[208,22,208,23],[208,24,208,26],[213,3,213,6],[213,10,213,12],[213,13,213,14],[213,22,213,23],[213,24,213,26],[214,3,214,6],[214,10,214,12],[214,13,214,14],[214,22,214,23],[214,24,214,26],[211,3,211,6],[211,10,211,12],[211,13,211,14],[211,22,211,23],[211,24,211,26],[212,3,212,6],[212,10,212,12],[212,13,212,14],[212,22,212,23],[212,24,212,26],[217,3,217,6],[217,10,217,12],[217,13,217,14],[217,22,217,23],[217,24,217,26],[218,3,218,6],[218,10,218,12],[218,13,218,14],[218,22,218,23],[218,24,218,26],[215,3,215,6],[215,10,215,12],[215,13,215,14],[215,22,215,23],[215,24,215,26],[216,3,216,6],[216,10,216,12],[216,13,216,14],[216,22,216,23],[216,24,216,26],[221,3,221,6],[221,10,221,12],[221,13,221,14],[221,22,221,23],[221,24,221,26],[222,3,222,6],[222,10,222,12],[222,13,222,14],[222,22,222,23],[222,24,222,26],[219,3,219,6],[219,10,219,12],[219,13,219,14],[219,22,219,23],[219,24,219,26]],"merged_total":1552,"flags":["merged_cut"]}
[null,null,null,null,null,null,null,null,null,"Ergebnisse der Maßprüfung "]
[]
[]
[null,null,null,null,null,null,null,"Lieferant:",null,null,{"$f":"'0.Submission Checklist'!R2","v":0},null,null,null,null,null,"Design Eng:",null,null,null,null,null,null,null,"Antragsteller:"]
[null,null,null,null,null,null,null,"Inspektionsdatum:",null,null,null,null,null,null,null,null,"Quality Eng:",null,null,null,null,null,null,null,"ECR/CR"]
[null,null,null,null,null,null,null,"Inspiziert von:",null,null,null,null,null,null,null,null,"Kaufvertreter",null,null,null,null,null,null,null,"Bauteil-ID"]
[null,null,null,null,null,null,null,"RE:",null,null,"Siehe Abschnitt Notizen",null,null,null,null,null,"Inspektionsart:",null,"Inspek.-typ eing."]
[null,null,null,null,null,null,null,null,null,"Gesamt # Dim:",{"$f":"IF(B15=\"\",\"\",COUNTA(B15:B333))","v":""},null,null,"Gesamt Fehlerhafte Dim:",{"$f":"IF(B15=\"\",\"\",COUNTIF(W15:X333,\"X\"))","v":""},"% OOT:",{"$f":"IF(B15=\"\",\"\",O8/K8)","v":""}]
[null,null,"Zeichnung:",null,null,null,"Rev:",null,"Beschreibung/Name:"]
[]
[null,"Zur Verfügung gestellte Dokumentation:",null,null,null,"C von C:",null,"Abweichung:",null,"Inspektionsdaten:",null,null,"Qualitätsplan:",null,null,null,"Kommentierte Zeichnung:",null,null,"Serialisierte Teile:"]
[]
[null,null,null,null,null,null,null,null,"Toleranz",null,"Messverfahren",null,null,"Messgerät-ID",null,"MESSERGEBNISSE (DATEN)",null,null,null,null,null,null,null,null,"Kommentare",null,null,"USL","LSL","Mean","Std.",null,null,"Pp","PPK"]
[null,"Artikel","Zone","Spezifikation",null,null,null,"Abmessung","Low","High",null,null,null,null,null,"Smpl 1","Smpl 2","Smpl 3","Smpl 4","Smpl 5","Smpl 6","Pass","Fail"]
[null,null,null,null,null,null,null,1.0129999999999999,-1.4999999999999999E-2,1.4999999999999999E-2,null,null,null,null,null,1.026,1.026,1.0229999999999999,1.026,1.026,1.026,{"$f":"IF(I15=\"Ref\",\"\",(IF(I15=\"Basic\",\"\",(IF(P15=\"P\",\"X\",(IF(P15=\"F\",\"\",IF(MAX(P15:T15)>(H15+J15),\"\",IF(MIN(P15:T15)<(H15+I15),\"\",\"X\")))))))))","v":"X"},{"$f":"IF(I15=\"Ref\",\"\",(IF(I15=\"Basic\",\"\",(IF(P15=\"P\",\"\",IF(P15=\"F\",\"X\",IF(MAX(P15:T15)>(H15+J15),\"X\",IF(MIN(P15:T15)<(H15+I15),\"X\",\"\"))))))))","v":""},null,null,null,null,{"$f":"H15+J15","v":1.0279999999999998},{"$f":"H15+I15","v":0.99799999999999989},{"$f":"AVERAGE(P15:U15)","v":1.0254999999999999},{"$f":"_xlfn.STDEV.S(P15:U15)","v":1.2247448713916355E-3},{"$f":"(AB15-AD15)/(3*AE15)","v":0.68041381743973139},{"$f":"(AD15-AC15)/(3*AE15)","v":7.4845519918371961},{"$f":"(AB15-AC15)/(6*AE15)","v":4.0824829046384643},{"$f":"MIN(AF15, AG15)","v":0.68041381743973139},{"$f":"IF(Q15=\"\",\"0\",(IF(P15<AI15,1,IF(Q15>#REF!,1,0))))","v":{"$error":"#REF!"}},{"$f":"IF(R15=\"\",\"0\",(IF(R15<AI15,1,IF(R15>#REF!,1,0))))","v":{"$error":"#REF!"}},{"$f":"IF(S15=\"\",\"0\",(IF(S15<AI15,1,IF(S15>#REF!,1,0))))","v":{"$error":"#REF!"}},{"$f":"IF(T15=\"\",\"0\",(IF(T15<AI15,1,IF(T15>#REF!,1,0))))","v":{"$error":"#REF!"}},null,null,null,null,"<Reason for Insp>",1.0149999999999999]
[null,null,null,null,null,null,null,1.2,-1.4999999999999999E-2,1.4999999999999999E-2,null,null,null,null,null,null,null,null,null,null,null,"","X",null,null,null,null,{"$f":"H16+J16","v":1.2149999999999999},{"$f":"H16+I16","v":1.1850000000000001},{"$f":"AVERAGE(P16:T16)","v":{"$error":"#DIV/0!"}},{"$f":"_xlfn.STDEV.S(P16,Q16,R16,S16,T16)","v":{"$error":"#DIV/0!"}},{"$error":"#DIV/0!"},{"$error":"#DIV/0!"},{"$error":"#DIV/0!"},{"$f":"MIN(AF16, AG16)","v":{"$error":"#DIV/0!"}},{"$f":"IF(Q16=\"\",\"0\",(IF(P16<AI16,1,IF(Q16>#REF!,1,0))))","v":"0"},{"$f":"IF(R16=\"\",\"0\",(IF(R16<AI16,1,IF(R16>#REF!,1,0))))","v":"0"},{"$f":"IF(S16=\"\",\"0\",(IF(S16<AI16,1,IF(S16>#REF!,1,0))))","v":"0"},{"$f":"IF(T16=\"\",\"0\",(IF(T16<AI16,1,IF(T16>#REF!,1,0))))","v":"0"},null,null,null,null,"Assembly Issue",1.01,null,"Yes"]
[null,null,null,null,null,null,null,null,null,null,null,null,null,null,null,null,null,null,null,null,null,"X","",null,null,null,null,0,0,{"$error":"#DIV/0!"},{"$error":"#DIV/0!"},{"$error":"#DIV/0!"},{"$error":"#DIV/0!"},{"$error":"#DIV/0!"},{"$error":"#DIV/0!"},{"$f":"IF(Q17=\"\",\"0\",(IF(P17<AI17,1,IF(Q17>#REF!,1,0))))","v":"0"},{"$f":"IF(R17=\"\",\"0\",(IF(R17<AI17,1,IF(R17>#REF!,1,0))))","v":"0"},{"$f":"IF(S17=\"\",\"0\",(IF(S17<AI17,1,IF(S17>#REF!,1,0))))","v":"0"},{"$f":"IF(T17=\"\",\"0\",(IF(T17<AI17,1,IF(T17>#REF!,1,0))))","v":"0"},null,null,null,null,"Location Change",1.01,null,"No"]
[null,null,null,null,null,null,null,null,null,null,null,null,null,null,null,null,null,null,null,null,null,"X","",null,null,null,null,0,0,{"$error":"#DIV/0!"},{"$error":"#DIV/0!"},{"$error":"#DIV/0!"},{"$error":"#DIV/0!"},{"$error":"#DIV/0!"},{"$error":"#DIV/0!"},{"$f":"IF(Q18=\"\",\"0\",(IF(P18<AI18,1,IF(Q18>#REF!,1,0))))","v":"0"},{"$f":"IF(R18=\"\",\"0\",(IF(R18<AI18,1,IF(R18>#REF!,1,0))))","v":"0"},{"$f":"IF(S18=\"\",\"0\",(IF(S18<AI18,1,IF(S18>#REF!,1,0))))","v":"0"},{"$f":"IF(T18=\"\",\"0\",(IF(T18<AI18,1,IF(T18>#REF!,1,0))))","v":"0"},null,null,null,null,"New Part",1.0149999999999999,null,"N/A"]
[null,null,null,null,null,null,null,null,null,null,null,null,null,null,null,null,null,null,null,null,null,"X","",null,null,null,null,0,0,{"$error":"#DIV/0!"},{"$error":"#DIV/0!"},{"$error":"#DIV/0!"},{"$error":"#DIV/0!"},{"$error":"#DIV/0!"},{"$error":"#DIV/0!"},{"$f":"IF(Q19=\"\",\"0\",(IF(P19<AI19,1,IF(Q19>#REF!,1,0))))","v":"0"},{"$f":"IF(R19=\"\",\"0\",(IF(R19<AI19,1,IF(R19>#REF!,1,0))))","v":"0"},{"$f":"IF(S19=\"\",\"0\",(IF(S19<AI19,1,IF(S19>#REF!,1,0))))","v":"0"},{"$f":"IF(T19=\"\",\"0\",(IF(T19<AI19,1,IF(T19>#REF!,1,0))))","v":"0"},null,null,null,null,"New Supplier",1.0149999999999999,null,"Inspek.-typ eing."]
[null,null,null,null,null,null,null,null,null,null,null,null,null,null,null,null,null,null,null,null,null,"X","",null,null,null,null,0,0,{"$error":"#DIV/0!"},{"$error":"#DIV/0!"},{"$error":"#DIV/0!"},{"$error":"#DIV/0!"},{"$error":"#DIV/0!"},{"$error":"#DIV/0!"},{"$f":"IF(Q20=\"\",\"0\",(IF(P20<AI20,1,IF(Q20>#REF!,1,0))))","v":"0"},{"$f":"IF(R20=\"\",\"0\",(IF(R20<AI20,1,IF(R20>#REF!,1,0))))","v":"0"},{"$f":"IF(S20=\"\",\"0\",(IF(S20<AI20,1,IF(S20>#REF!,1,0))))","v":"0"},{"$f":"IF(T20=\"\",\"0\",(IF(T20<AI20,1,IF(T20>#REF!,1,0))))","v":"0"},null,null,null,null,"New Process/Tech.",null,null,"Erstes Teil"]
[null,null,null,null,null,null,null,null,null,null,null,null,null,null,null,null,null,null,null,null,null,"X","",null,null,null,null,0,0,{"$error":"#DIV/0!"},{"$error":"#DIV/0!"},{"$error":"#DIV/0!"},{"$error":"#DIV/0!"},{"$error":"#DIV/0!"},{"$error":"#DIV/0!"},{"$f":"IF(Q21=\"\",\"0\",(IF(P21<AI21,1,IF(Q21>#REF!,1,0))))","v":"0"},{"$f":"IF(R21=\"\",\"0\",(IF(R21<AI21,1,IF(R21>#REF!,1,0))))","v":"0"},{"$f":"IF(S21=\"\",\"0\",(IF(S21<AI21,1,IF(S21>#REF!,1,0))))","v":"0"},{"$f":"IF(T21=\"\",\"0\",(IF(T21<AI21,1,IF(T21>#REF!,1,0))))","v":"0"},null,null,null,null,"Drawing Revision",null,null,"Vollständiges Muster"]
[null,null,null,null,null,null,null,null,null,null,null,null,null,null,null,null,null,null,null,null,null,"X","",null,null,null,null,0,0,{"$error":"#DIV/0!"},{"$error":"#DIV/0!"},{"$error":"#DIV/0!"},{"$error":"#DIV/0!"},{"$error":"#DIV/0!"},{"$error":"#DIV/0!"},{"$f":"IF(Q22=\"\",\"0\",(IF(P22<AI22,1,IF(Q22>#REF!,1,0))))","v":"0"},{"$f":"IF(R22=\"\",\"0\",(IF(R22<AI22,1,IF(R22>#REF!,1,0))))","v":"0"},{"$f":"IF(S22=\"\",\"0\",(IF(S22<AI22,1,IF(S22>#REF!,1,0))))","v":"0"},{"$f":"IF(T22=\"\",\"0\",(IF(T22<AI22,1,IF(T22>#REF!,1,0))))","v":"0"},null,null,null,null,"New/Modified Tooling",null,null,"Messanfrage"]
[null,null,null,null,null,null,null,null,null,null,null,null,null,null,null,null,null,null,null,null,null,"X","",null,null,null,null,0,0,{"$error":"#DIV/0!"},{"$error":"#DIV/0!"},{"$error":"#DIV/0!"},{"$error":"#DIV/0!"},{"$error":"#DIV/0!"},{"$error":"#DIV/0!"},{"$f":"IF(Q23=\"\",\"0\",(IF(P23<AI23,1,IF(Q23>#REF!,1,0))))","v":"0"},{"$f":"IF(R23=\"\",\"0\",(IF(R23<AI23,1,IF(R23>#REF!,1,0))))","v":"0"},{"$f":"IF(S23=\"\",\"0\",(IF(S23<AI23,1,IF(S23>#REF!,1,0))))","v":"0"},{"$f":"IF(T23=\"\",\"0\",(IF(T23<AI23,1,IF(T23>#REF!,1,0))))","v":"0"},null,null,null,null,"Tooling Upgrade"]
[null,null,null,null,null,null,null,null,null,null,null,null,null,null,null,null,null,null,null,null,null,"X","",null,null,null,null,0,0,{"$error":"#DIV/0!"},{"$error":"#DIV/0!"},{"$error":"#DIV/0!"},{"$error":"#DIV/0!"},{"$error":"#DIV/0!"},{"$error":"#DIV/0!"},{"$f":"IF(Q24=\"\",\"0\",(IF(P24<AI24,1,IF(Q24>#REF!,1,0))))","v":"0"},{"$f":"IF(R24=\"\",\"0\",(IF(R24<AI24,1,IF(R24>#REF!,1,0))))","v":"0"},{"$f":"IF(S24=\"\",\"0\",(IF(S24<AI24,1,IF(S24>#REF!,1,0))))","v":"0"},{"$f":"IF(T24=\"\",\"0\",(IF(T24<AI24,1,IF(T24>#REF!,1,0))))","v":"0"},null,null,null,null,"Tooling Xfer"]
[null,null,null,null,null,null,null,null,null,null,null,null,null,null,null,null,null,null,null,null,null,"X","",null,null,null,null,0,0,{"$error":"#DIV/0!"},{"$error":"#DIV/0!"},{"$error":"#DIV/0!"},{"$error":"#DIV/0!"},{"$error":"#DIV/0!"},{"$error":"#DIV/0!"},{"$f":"IF(Q25=\"\",\"0\",(IF(P25<AI25,1,IF(Q25>#REF!,1,0))))","v":"0"},{"$f":"IF(R25=\"\",\"0\",(IF(R25<AI25,1,IF(R25>#REF!,1,0))))","v":"0"},{"$f":"IF(S25=\"\",\"0\",(IF(S25<AI25,1,IF(S25>#REF!,1,0))))","v":"0"},{"$f":"IF(T25=\"\",\"0\",(IF(T25<AI25,1,IF(T25>#REF!,1,0))))","v":"0"},null,null,null,null,"Chg of Supplier"]
[null,null,null,null,null,null,null,null,null,null,null,null,null,null,null,null,null,null,null,null,null,"X","",null,null,null,null,0,0,{"$error":"#DIV/0!"},{"$error":"#DIV/0!"},{"$error":"#DIV/0!"},{"$error":"#DIV/0!"},{"$error":"#DIV/0!"},{"$error":"#DIV/0!"},{"$f":"IF(Q26=\"\",\"0\",(IF(P26<AI26,1,IF(Q26>#REF!,1,0))))","v":"0"},{"$f":"IF(R26=\"\",\"0\",(IF(R26<AI26,1,IF(R26>#REF!,1,0))))","v":"0"},{"$f":"IF(S26=\"\",\"0\",(IF(S26<AI26,1,IF(S26>#REF!,1,0))))","v":"0"},{"$f":"IF(T26=\"\",\"0\",(IF(T26<AI26,1,IF(T26>#REF!,1,0))))","v":"0"},null,null,null,null,"Tooling Reactivated"]
[null,null,null,null,null,null,null,null,null,null,null,null,null,null,null,null,null,null,null,null,null,"X","",null,null,null,null,0,0,{"$error":"#DIV/0!"},{"$error":"#DIV/0!"},{"$error":"#DIV/0!"},{"$error":"#DIV/0!"},{"$error":"#DIV/0!"},{"$error":"#DIV/0!"},{"$f":"IF(Q27=\"\",\"0\",(IF(P27<AI27,1,IF(Q27>#REF!,1,0))))","v":"0"},{"$f":"IF(R27=\"\",\"0\",(IF(R27<AI27,1,IF(R27>#REF!,1,0))))","v":"0"},{"$f":"IF(S27=\"\",\"0\",(IF(S27<AI27,1,IF(S27>#REF!,1,0))))","v":"0"},{"$f":"IF(T27=\"\",\"0\",(IF(T27<AI27,1,IF(T27>#REF!,1,0))))","v":"0"},null,null,null,null,"Chg of Insp Method"]
[null,null,null,null,null,null,null,null,null,null,null,null,null,null,null,null,null,null,null,null,null,"X","",null,null,null,null,0,0,{"$error":"#DIV/0!"},{"$error":"#DIV/0!"},{"$error":"#DIV/0!"},{"$error":"#DIV/0!"},{"$error":"#DIV/0!"},{"$error":"#DIV/0!"},{"$f":"IF(Q28=\"\",\"0\",(IF(P28<AI28,1,IF(Q28>#REF!,1,0))))","v":"0"},{"$f":"IF(R28=\"\",\"0\",(IF(R28<AI28,1,IF(R28>#REF!,1,0))))","v":"0"},{"$f":"IF(S28=\"\",\"0\",(IF(S28<AI28,1,IF(S28>#REF!,1,0))))","v":"0"},{"$f":"IF(T28=\"\",\"0\",(IF(T28<AI28,1,IF(T28>#REF!,1,0))))","v":"0"},null,null,null,null,"New raw Mat'l"]
[null,null,null,null,null,null,null,null,null,null,null,null,null,null,null,null,null,null,null,null,null,"X","",null,null,null,null,0,0,{"$error":"#DIV/0!"},{"$error":"#DIV/0!"},{"$error":"#DIV/0!"},{"$error":"#DIV/0!"},{"$error":"#DIV/0!"},{"$error":"#DIV/0!"},{"$f":"IF(Q29=\"\",\"0\",(IF(P29<AI29,1,IF(Q29>#REF!,1,0))))","v":"0"},{"$f":"IF(R29=\"\",\"0\",(IF(R29<AI29,1,IF(R29>#REF!,1,0))))","v":"0"},{"$f":"IF(S29=\"\",\"0\",(IF(S29<AI29,1,IF(S29>#REF!,1,0))))","v":"0"},{"$f":"IF(T29=\"\",\"0\",(IF(T29<AI29,1,IF(T29>#REF!,1,0))))","v":"0"},null,null,null,null,"Chg in Appear Attritubes"]
[null,null,null,null,null,null,null,null,null,null,null,null,null,null,null,null,null,null,null,null,null,"X","",null,null,null,null,0,0,{"$error":"#DIV/0!"},{"$error":"#DIV/0!"},{"$error":"#DIV/0!"},{"$error":"#DIV/0!"},{"$error":"#DIV/0!"},{"$error":"#DIV/0!"},{"$f":"IF(Q30=\"\",\"0\",(IF(P30<AI30,1,IF(Q30>#REF!,1,0))))","v":"0"},{"$f":"IF(R30=\"\",\"0\",(IF(R30<AI30,1,IF(R30>#REF!,1,0))))","v":"0"},{"$f":"IF(S30=\"\",\"0\",(IF(S30<AI30,1,IF(S30>#REF!,1,0))))","v":"0"},{"$f":"IF(T30=\"\",\"0\",(IF(T30<AI30,1,IF(T30>#REF!,1,0))))","v":"0"},null,null,null,null,"Process Change"]
[null,null,null,null,null,null,null,null,null,null,null,null,null,null,null,null,null,null,null,null,null,"X","",null,null,null,null,0,0,{"$error":"#DIV/0!"},{"$error":"#DIV/0!"},{"$error":"#DIV/0!"},{"$error":"#DIV/0!"},{"$error":"#DIV/0!"},{"$error":"#DIV/0!"},{"$f":"IF(Q31=\"\",\"0\",(IF(P31<AI31,1,IF(Q31>#REF!,1,0))))","v":"0"},{"$f":"IF(R31=\"\",\"0\",(IF(R31<AI31,1,IF(R31>#REF!,1,0))))","v":"0"},{"$f":"IF(S31=\"\",\"0\",(IF(S31<AI31,1,IF(S31>#REF!,1,0))))","v":"0"},{"$f":"IF(T31=\"\",\"0\",(IF(T31<AI31,1,IF(T31>#REF!,1,0))))","v":"0"},null,null,null,null,"Receiving Inspection"]
[null,null,null,null,null,null,null,null,null,null,null,null,null,null,null,null,null,null,null,null,null,"X","",null,null,null,null,0,0,{"$error":"#DIV/0!"},{"$error":"#DIV/0!"},{"$error":"#DIV/0!"},{"$error":"#DIV/0!"},{"$error":"#DIV/0!"},{"$error":"#DIV/0!"},{"$f":"IF(Q32=\"\",\"0\",(IF(P32<AI32,1,IF(Q32>#REF!,1,0))))","v":"0"},{"$f":"IF(R32=\"\",\"0\",(IF(R32<AI32,1,IF(R32>#REF!,1,0))))","v":"0"},{"$f":"IF(S32=\"\",\"0\",(IF(S32<AI32,1,IF(S32>#REF!,1,0))))","v":"0"},{"$f":"IF(T32=\"\",\"0\",(IF(T32<AI32,1,IF(T32>#REF!,1,0))))","v":"0"},null,null,null,null,"See Notes Section"]
[null,null,null,null,null,null,null,null,null,null,null,null,null,null,null,null,null,null,null,null,null,"X","",null,null,null,null,0,0,{"$error":"#DIV/0!"},{"$error":"#DIV/0!"},{"$error":"#DIV/0!"},{"$error":"#DIV/0!"},{"$error":"#DIV/0!"},{"$error":"#DIV/0!"},{"$f":"IF(Q33=\"\",\"0\",(IF(P33<AI33,1,IF(Q33>#REF!,1,0))))","v":"0"},{"$f":"IF(R33=\"\",\"0\",(IF(R33<AI33,1,IF(R33>#REF!,1,0))))","v":"0"},{"$f":"IF(S33=\"\",\"0\",(IF(S33<AI33,1,IF(S33>#REF!,1,0))))","v":"0"},{"$f":"IF(T33=\"\",\"0\",(IF(T33<AI33,1,IF(T33>#REF!,1,0))))","v":"0"}]
[null,null,null,null,null,null,null,null,null,null,null,null,null,null,null,null,null,null,null,null,null,"X","",null,null,null,null,0,0,{"$error":"#DIV/0!"},{"$error":"#DIV/0!"},{"$error":"#DIV/0!"},{"$error":"#DIV/0!"},{"$error":"#DIV/0!"},{"$error":"#DIV/0!"},{"$f":"IF(Q34=\"\",\"0\",(IF(P34<AI34,1,IF(Q34>#REF!,1,0))))","v":"0"},{"$f":"IF(R34=\"\",\"0\",(IF(R34<AI34,1,IF(R34>#REF!,1,0))))","v":"0"},{"$f":"IF(S34=\"\",\"0\",(IF(S34<AI34,1,IF(S34>#REF!,1,0))))","v":"0"},{"$f":"IF(T34=\"\",\"0\",(IF(T34<AI34,1,IF(T34>#REF!,1,0))))","v":"0"},null,null,null,null,"Ball Micrometer"]
[null,null,null,null,null,null,null,null,null,null,null,null,null,null,null,null,null,null,null,null,null,"X","",null,null,null,null,0,0,{"$error":"#DIV/0!"},{"$error":"#DIV/0!"},{"$error":"#DIV/0!"},{"$error":"#DIV/0!"},{"$error":"#DIV/0!"},{"$error":"#DIV/0!"},{"$f":"IF(Q35=\"\",\"0\",(IF(P35<AI35,1,IF(Q35>#REF!,1,0))))","v":"0"},{"$f":"IF(R35=\"\",\"0\",(IF(R35<AI35,1,IF(R35>#REF!,1,0))))","v":"0"},{"$f":"IF(S35=\"\",\"0\",(IF(S35<AI35,1,IF(S35>#REF!,1,0))))","v":"0"},{"$f":"IF(T35=\"\",\"0\",(IF(T35<AI35,1,IF(T35>#REF!,1,0))))","v":"0"},null,null,null,null,"Caliper"]
[null,null,null,null,null,null,null,null,null,null,null,null,null,null,null,null,null,null,null,null,null,"X","",null,null,null,null,0,0,{"$error":"#DIV/0!"},{"$error":"#DIV/0!"},{"$error":"#DIV/0!"},{"$error":"#DIV/0!"},{"$error":"#DIV/0!"},{"$error":"#DIV/0!"},{"$f":"IF(Q36=\"\",\"0\",(IF(P36<AI36,1,IF(Q36>#REF!,1,0))))","v":"0"},{"$f":"IF(R36=\"\",\"0\",(IF(R36<AI36,1,IF(R36>#REF!,1,0))))","v":"0"},{"$f":"IF(S36=\"\",\"0\",(IF(S36<AI36,1,IF(S36>#REF!,1,0))))","v":"0"},{"$f":"IF(T36=\"\",\"0\",(IF(T36<AI36,1,IF(T36>#REF!,1,0))))","v":"0"},null,null,null,null,"CMM"]
[null,null,null,null,null,null,null,null,null,null,null,null,null,null,null,null,null,null,null,null,null,"X","",null,null,null,null,0,0,{"$error":"#DIV/0!"},{"$error":"#DIV/0!"},{"$error":"#DIV/0!"},{"$error":"#DIV/0!"},{"$error":"#DIV/0!"},{"$error":"#DIV/0!"},{"$f":"IF(Q37=\"\",\"0\",(IF(P37<AI37,1,IF(Q37>#REF!,1,0))))","v":"0"},{"$f":"IF(R37=\"\",\"0\",(IF(R37<AI37,1,IF(R37>#REF!,1,0))))","v":"0"},{"$f":"IF(S37=\"\",\"0\",(IF(S37<AI37,1,IF(S37>#REF!,1,0))))","v":"0"},{"$f":"IF(T37=\"\",\"0\",(IF(T37<AI37,1,IF(T37>#REF!,1,0))))","v":"0"},null,null,null,null,"Digital Height Gage"]
[null,null,null,null,null,null,null,null,null,null,null,null,null,null,null,null,null,null,null,null,null,"X","",null,null,null,null,0,0,{"$error":"#DIV/0!"},{"$error":"#DIV/0!"},{"$error":"#DIV/0!"},{"$error":"#DIV/0!"},{"$error":"#DIV/0!"},{"$error":"#DIV/0!"},{"$f":"IF(Q38=\"\",\"0\",(IF(P38<AI38,1,IF(Q38>#REF!,1,0))))","v":"0"},{"$f":"IF(R38=\"\",\"0\",(IF(R38<AI38,1,IF(R38>#REF!,1,0))))","v":"0"},{"$f":"IF(S38=\"\",\"0\",(IF(S38<AI38,1,IF(S38>#REF!,1,0))))","v":"0"},{"$f":"IF(T38=\"\",\"0\",(IF(T38<AI38,1,IF(T38>#REF!,1,0))))","v":"0"},null,null,null,null,"Feeler Gage"]
[null,null,null,null,null,null,null,null,null,null,null,null,null,null,null,null,null,null,null,null,null,"X","",null,null,null,null,0,0,{"$error":"#DIV/0!"},{"$error":"#DIV/0!"},{"$error":"#DIV/0!"},{"$error":"#DIV/0!"},{"$error":"#DIV/0!"},{"$error":"#DIV/0!"},{"$f":"IF(Q39=\"\",\"0\",(IF(P39<AI39,1,IF(Q39>#REF!,1,0))))","v":"0"},{"$f":"IF(R39=\"\",\"0\",(IF(R39<AI39,1,IF(R39>#REF!,1,0))))","v":"0"},{"$f":"IF(S39=\"\",\"0\",(IF(S39<AI39,1,IF(S39>#REF!,1,0))))","v":"0"},{"$f":"IF(T39=\"\",\"0\",(IF(T39<AI39,1,IF(T39>#REF!,1,0))))","v":"0"},null,null,null,null,"Functional Gage"]
[null,null,null,null,null,null,null,null,null,null,null,null,null,null,null,null,null,null,null,null,null,"X","",null,null,null,null,0,0,{"$error":"#DIV/0!"},{"$error":"#DIV/0!"},{"$error":"#DIV/0!"},{"$error":"#DIV/0!"},{"$error":"#DIV/0!"},{"$error":"#DIV/0!"},{"$f":"IF(Q40=\"\",\"0\",(IF(P40<AI40,1,IF(Q40>#REF!,1,0))))","v":"0"},{"$f":"IF(R40=\"\",\"0\",(IF(R40<AI40,1,IF(R40>#REF!,1,0))))","v":"0"},{"$f":"IF(S40=\"\",\"0\",(IF(S40<AI40,1,IF(S40>#REF!,1,0))))","v":"0"},{"$f":"IF(T40=\"\",\"0\",(IF(T40<AI40,1,IF(T40>#REF!,1,0))))","v":"0"},null,null,null,null,"Gage Block(s)"]
[null,null,null,null,null,null,null,null,null,null,null,null,null,null,null,null,null,null,null,null,null,"X","",null,null,null,null,0,0,{"$error":"#DIV/0!"},{"$error":"#DIV/0!"},{"$error":"#DIV/0!"},{"$error":"#DIV/0!"},{"$error":"#DIV/0!"},{"$error":"#DIV/0!"},{"$f":"IF(Q41=\"\",\"0\",(IF(P41<AI41,1,IF(Q41>#REF!,1,0))))","v":"0"},{"$f":"IF(R41=\"\",\"0\",(IF(R41<AI41,1,IF(R41>#REF!,1,0))))","v":"0"},{"$f":"IF(S41=\"\",\"0\",(IF(S41<AI41,1,IF(S41>#REF!,1,0))))","v":"0"},{"$f":"IF(T41=\"\",\"0\",(IF(T41<AI41,1,IF(T41>#REF!,1,0))))","v":"0"},null,null,null,null,"Gage Pin(s)"]
[null,null,null,null,null,null,null,null,null,null,null,null,null,null,null,null,null,null,null,null,null,"X","",null,null,null,null,0,0,{"$error":"#DIV/0!"},{"$error":"#DIV/0!"},{"$error":"#DIV/0!"},{"$error":"#DIV/0!"},{"$error":"#DIV/0!"},{"$error":"#DIV/0!"},{"$f":"IF(Q42=\"\",\"0\",(IF(P42<AI42,1,IF(Q42>#REF!,1,0))))","v":"0"},{"$f":"IF(R42=\"\",\"0\",(IF(R42<AI42,1,IF(R42>#REF!,1,0))))","v":"0"},{"$f":"IF(S42=\"\",\"0\",(IF(S42<AI42,1,IF(S42>#REF!,1,0))))","v":"0"},{"$f":"IF(T42=\"\",\"0\",(IF(T42<AI42,1,IF(T42>#REF!,1,0))))","v":"0"},null,null,null,null,"Height Gage & 90° Std"]
[null,null,null,null,null,null,null,null,null,null,null,null,null,null,null,null,null,null,null,null,null,"X","",null,null,null,null,0,0,{"$error":"#DIV/0!"},{"$error":"#DIV/0!"},{"$error":"#DIV/0!"},{"$error":"#DIV/0!"},{"$error":"#DIV/0!"},{"$error":"#DIV/0!"},{"$f":"IF(Q43=\"\",\"0\",(IF(P43<AI43,1,IF(Q43>#REF!,1,0))))","v":"0"},{"$f":"IF(R43=\"\",\"0\",(IF(R43<AI43,1,IF(R43>#REF!,1,0))))","v":"0"},{"$f":"IF(S43=\"\",\"0\",(IF(S43<AI43,1,IF(S43>#REF!,1,0))))","v":"0"},{"$f":"IF(T43=\"\",\"0\",(IF(T43<AI43,1,IF(T43>#REF!,1,0))))","v":"0"},null,null,null,null,"Height Gage & Indicator"]
[null,null,null,null,null,null,null,null,null,null,null,null,null,null,null,null,null,null,null,null,null,"X","",null,null,null,null,0,0,{"$error":"#DIV/0!"},{"$error":"#DIV/0!"},{"$error":"#DIV/0!"},{"$error":"#DIV/0!"},{"$error":"#DIV/0!"},{"$error":"#DIV/0!"},{"$f":"IF(Q44=\"\",\"0\",(IF(P44<AI44,1,IF(Q44>#REF!,1,0))))","v":"0"},{"$f":"IF(R44=\"\",\"0\",(IF(R44<AI44,1,IF(R44>#REF!,1,0))))","v":"0"},{"$f":"IF(S44=\"\",\"0\",(IF(S44<AI44,1,IF(S44>#REF!,1,0))))","v":"0"},{"$f":"IF(T44=\"\",\"0\",(IF(T44<AI44,1,IF(T44>#REF!,1,0))))","v":"0"},null,null,null,null,"Inside Micrometer"]
[null,null,null,null,null,null,null,null,null,null,null,null,null,null,null,null,null,null,null,null,null,"X","",null,null,null,null,0,0,{"$error":"#DIV/0!"},{"$error":"#DIV/0!"},{"$error":"#DIV/0!"},{"$error":"#DIV/0!"},{"$error":"#DIV/0!"},{"$error":"#DIV/0!"},{"$f":"IF(Q45=\"\",\"0\",(IF(P45<AI45,1,IF(Q45>#REF!,1,0))))","v":"0"},{"$f":"IF(R45=\"\",\"0\",(IF(R45<AI45,1,IF(R45>#REF!,1,0))))","v":"0"},{"$f":"IF(S45=\"\",\"0\",(IF(S45<AI45,1,IF(S45>#REF!,1,0))))","v":"0"},{"$f":"IF(T45=\"\",\"0\",(IF(T45<AI45,1,IF(T45>#REF!,1,0))))","v":"0"},null,null,null,null,"Optical Comparator"]
[null,null,null,null,null,null,null,null,null,null,null,null,null,null,null,null,null,null,null,null,null,"X","",null,null,null,null,0,0,{"$error":"#DIV/0!"},{"$error":"#DIV/0!"},{"$error":"#DIV/0!"},{"$error":"#DIV/0!"},{"$error":"#DIV/0!"},{"$error":"#DIV/0!"},{"$f":"IF(Q46=\"\",\"0\",(IF(P46<AI46,1,IF(Q46>#REF!,1,0))))","v":"0"},{"$f":"IF(R46=\"\",\"0\",(IF(R46<AI46,1,IF(R46>#REF!,1,0))))","v":"0"},{"$f":"IF(S46=\"\",\"0\",(IF(S46<AI46,1,IF(S46>#REF!,1,0))))","v":"0"},{"$f":"IF(T46=\"\",\"0\",(IF(T46<AI46,1,IF(T46>#REF!,1,0))))","v":"0"},null,null,null,null,"Outside Mic & Thd Wire "]
[null,null,null,null,null,null,null,null,null,null,null,null,null,null,null,null,null,null,null,null,null,"X","",null,null,null,null,0,0,{"$error":"#DIV/0!"},{"$error":"#DIV/0!"},{"$error":"#DIV/0!"},{"$error":"#DIV/0!"},{"$error":"#DIV/0!"},{"$error":"#DIV/0!"},{"$f":"IF(Q47=\"\",\"0\",(IF(P47<AI47,1,IF(Q47>#REF!,1,0))))","v":"0"},{"$f":"IF(R47=\"\",\"0\",(IF(R47<AI47,1,IF(R47>#REF!,1,0))))","v":"0"},{"$f":"IF(S47=\"\",\"0\",(IF(S47<AI47,1,IF(S47>#REF!,1,0))))","v":"0"},{"$f":"IF(T47=\"\",\"0\",(IF(T47<AI47,1,IF(T47>#REF!,1,0))))","v":"0"},null,null,null,null,"Outside Micrometer"]
[null,null,null,null,null,null,null,null,null,null,null,null,null,null,null,null,null,null,null,null,null,"X","",null,null,null,null,0,0,{"$error":"#DIV/0!"},{"$error":"#DIV/0!"},{"$error":"#DIV/0!"},{"$error":"#DIV/0!"},{"$error":"#DIV/0!"},{"$error":"#DIV/0!"},{"$f":"IF(Q48=\"\",\"0\",(IF(P48<AI48,1,IF(Q48>#REF!,1,0))))","v":"0"},{"$f":"IF(R48=\"\",\"0\",(IF(R48<AI48,1,IF(R48>#REF!,1,0))))","v":"0"},{"$f":"IF(S48=\"\",\"0\",(IF(S48<AI48,1,IF(S48>#REF!,1,0))))","v":"0"},{"$f":"IF(T48=\"\",\"0\",(IF(T48<AI48,1,IF(T48>#REF!,1,0))))","v":"0"},null,null,null,null,"Radius Gage"]
[null,null,null,null,null,null,null,null,null,null,null,null,null,null,null,null,null,null,null,null,null,"X","",null,null,null,null,0,0,{"$error":"#DIV/0!"},{"$error":"#DIV/0!"},{"$error":"#DIV/0!"},{"$error":"#DIV/0!"},{"$error":"#DIV/0!"},{"$error":"#DIV/0!"},{"$f":"IF(Q49=\"\",\"0\",(IF(P49<AI49,1,IF(Q49>#REF!,1,0))))","v":"0"},{"$f":"IF(R49=\"\",\"0\",(IF(R49<AI49,1,IF(R49>#REF!,1,0))))","v":"0"},{"$f":"IF(S49=\"\",\"0\",(IF(S49<AI49,1,IF(S49>#REF!,1,0))))","v":"0"},{"$f":"IF(T49=\"\",\"0\",(IF(T49<AI49,1,IF(T49>#REF!,1,0))))","v":"0"},null,null,null,null,"Sine Bar & Indicator"]
[null,null,null,null,null,null,null,null,null,null,null,null,null,null,null,null,null,null,null,null,null,"X","",null,null,null,null,0,0,{"$error":"#DIV/0!"},{"$error":"#DIV/0!"},{"$error":"#DIV/0!"},{"$error":"#DIV/0!"},{"$error":"#DIV/0!"},{"$error":"#DIV/0!"},{"$f":"IF(Q50=\"\",\"0\",(IF(P50<AI50,1,IF(Q50>#REF!,1,0))))","v":"0"},{"$f":"IF(R50=\"\",\"0\",(IF(R50<AI50,1,IF(R50>#REF!,1,0))))","v":"0"},{"$f":"IF(S50=\"\",\"0\",(IF(S50<AI50,1,IF(S50>#REF!,1,0))))","v":"0"},{"$f":"IF(T50=\"\",\"0\",(IF(T50<AI50,1,IF(T50>#REF!,1,0))))","v":"0"},null,null,null,null,"Tape Measure"]
[null,null,null,null,null,null,null,null,null,null,null,null,null,null,null,null,null,null,null,null,null,"X","",null,null,null,null,0,0,{"$error":"#DIV/0!"},{"$error":"#DIV/0!"},{"$error":"#DIV/0!"},{"$error":"#DIV/0!"},{"$error":"#DIV/0!"},{"$error":"#DIV/0!"},{"$f":"IF(Q51=\"\",\"0\",(IF(P51<AI51,1,IF(Q51>#REF!,1,0))))","v":"0"},{"$f":"IF(R51=\"\",\"0\",(IF(R51<AI51,1,IF(R51>#REF!,1,0))))","v":"0"},{"$f":"IF(S51=\"\",\"0\",(IF(S51<AI51,1,IF(S51>#REF!,1,0))))","v":"0"},{"$f":"IF(T51=\"\",\"0\",(IF(T51<AI51,1,IF(T51>#REF!,1,0))))","v":"0"},null,null,null,null,"Thread Micrometers"]
[null,null,null,null,null,null,null,null,null,null,null,null,null,null,null,null,null,null,null,null,null,"X","",null,null,null,null,0,0,{"$error":"#DIV/0!"},{"$error":"#DIV/0!"},{"$error":"#DIV/0!"},{"$error":"#DIV/0!"},{"$error":"#DIV/0!"},{"$error":"#DIV/0!"},{"$f":"IF(Q52=\"\",\"0\",(IF(P52<AI52,1,IF(Q52>#REF!,1,0))))","v":"0"},{"$f":"IF(R52=\"\",\"0\",(IF(R52<AI52,1,IF(R52>#REF!,1,0))))","v":"0"},{"$f":"IF(S52=\"\",\"0\",(IF(S52<AI52,1,IF(S52>#REF!,1,0))))","v":"0"},{"$f":"IF(T52=\"\",\"0\",(IF(T52<AI52,1,IF(T52>#REF!,1,0))))","v":"0"},null,null,null,null,"Vision System"]
[null,null,null,null,null,null,null,null,null,null,null,null,null,null,null,null,null,null,null,null,null,"X","",null,null,null,null,0,0,{"$error":"#DIV/0!"},{"$error":"#DIV/0!"},{"$error":"#DIV/0!"},{"$error":"#DIV/0!"},{"$error":"#DIV/0!"},{"$error":"#DIV/0!"},{"$f":"IF(Q53=\"\",\"0\",(IF(P53<AI53,1,IF(Q53>#REF!,1,0))))","v":"0"},{"$f":"IF(R53=\"\",\"0\",(IF(R53<AI53,1,IF(R53>#REF!,1,0))))","v":"0"},{"$f":"IF(S53=\"\",\"0\",(IF(S53<AI53,1,IF(S53>#REF!,1,0))))","v":"0"},{"$f":"IF(T53=\"\",\"0\",(IF(T53<AI53,1,IF(T53>#REF!,1,0))))","v":"0"},null,null,null,null,"Visual"]
[null,null,null,null,null,null,null,null,null,null,null,null,null,null,null,null,null,null,null,null,null,"X","",null,null,null,null,0,0,{"$error":"#DIV/0!"},{"$error":"#DIV/0!"},{"$error":"#DIV/0!"},{"$error":"#DIV/0!"},{"$error":"#DIV/0!"},{"$error":"#DIV/0!"},{"$f":"IF(Q54=\"\",\"0\",(IF(P54<AI54,1,IF(Q54>#REF!,1,0))))","v":"0"},{"$f":"IF(R54=\"\",\"0\",(IF(R54<AI54,1,IF(R54>#REF!,1,0))))","v":"0"},{"$f":"IF(S54=\"\",\"0\",(IF(S54<AI54,1,IF(S54>#REF!,1,0))))","v":"0"},{"$f":"IF(T54=\"\",\"0\",(IF(T54<AI54,1,IF(T54>#REF!,1,0))))","v":"0"}]
[null,null,null,null,null,null,null,null,null,null,null,null,null,null,null,null,null,null,null,null,null,"X","",null,null,null,null,0,0,{"$error":"#DIV/0!"},{"$error":"#DIV/0!"},{"$error":"#DIV/0!"},{"$error":"#DIV/0!"},{"$error":"#DIV/0!"},{"$error":"#DIV/0!"},{"$f":"IF(Q55=\"\",\"0\",(IF(P55<AI55,1,IF(Q55>#REF!,1,0))))","v":"0"},{"$f":"IF(R55=\"\",\"0\",(IF(R55<AI55,1,IF(R55>#REF!,1,0))))","v":"0"},{"$f":"IF(S55=\"\",\"0\",(IF(S55<AI55,1,IF(S55>#REF!,1,0))))","v":"0"},{"$f":"IF(T55=\"\",\"0\",(IF(T55<AI55,1,IF(T55>#REF!,1,0))))","v":"0"}]
[null,null,null,null,null,null,null,null,null,null,null,null,null,null,null,null,null,null,null,null,null,"X","",null,null,null,null,0,0,{"$error":"#DIV/0!"},{"$error":"#DIV/0!"},{"$error":"#DIV/0!"},{"$error":"#DIV/0!"},{"$error":"#DIV/0!"},{"$error":"#DIV/0!"},{"$f":"IF(Q56=\"\",\"0\",(IF(P56<AI56,1,IF(Q56>#REF!,1,0))))","v":"0"},{"$f":"IF(R56=\"\",\"0\",(IF(R56<AI56,1,IF(R56>#REF!,1,0))))","v":"0"},{"$f":"IF(S56=\"\",\"0\",(IF(S56<AI56,1,IF(S56>#REF!,1,0))))","v":"0"},{"$f":"IF(T56=\"\",\"0\",(IF(T56<AI56,1,IF(T56>#REF!,1,0))))","v":"0"}]
[null,null,null,null,null,null,null,null,null,null,null,null,null,null,null,null,null,null,null,null,null,"X","",null,null,null,null,0,0,{"$error":"#DIV/0!"},{"$error":"#DIV/0!"},{"$error":"#DIV/0!"},{"$error":"#DIV/0!"},{"$error":"#DIV/0!"},{"$error":"#DIV/0!"},{"$f":"IF(Q57=\"\",\"0\",(IF(P57<AI57,1,IF(Q57>#REF!,1,0))))","v":"0"},{"$f":"IF(R57=\"\",\"0\",(IF(R57<AI57,1,IF(R57>#REF!,1,0))))","v":"0"},{"$f":"IF(S57=\"\",\"0\",(IF(S57<AI57,1,IF(S57>#REF!,1,0))))","v":"0"},{"$f":"IF(T57=\"\",\"0\",(IF(T57<AI57,1,IF(T57>#REF!,1,0))))","v":"0"}]
[null,null,null,null,null,null,null,null,null,null,null,null,null,null,null,null,null,null,null,null,null,"X","",null,null,null,null,0,0,{"$error":"#DIV/0!"},{"$error":"#DIV/0!"},{"$error":"#DIV/0!"},{"$error":"#DIV/0!"},{"$error":"#DIV/0!"},{"$error":"#DIV/0!"},{"$f":"IF(Q58=\"\",\"0\",(IF(P58<AI58,1,IF(Q58>#REF!,1,0))))","v":"0"},{"$f":"IF(R58=\"\",\"0\",(IF(R58<AI58,1,IF(R58>#REF!,1,0))))","v":"0"},{"$f":"IF(S58=\"\",\"0\",(IF(S58<AI58,1,IF(S58>#REF!,1,0))))","v":"0"},{"$f":"IF(T58=\"\",\"0\",(IF(T58<AI58,1,IF(T58>#REF!,1,0))))","v":"0"}]
[null,null,null,null,null,null,null,null,null,null,null,null,null,null,null,null,null,null,null,null,null,"X","",null,null,null,null,0,0,{"$error":"#DIV/0!"},{"$error":"#DIV/0!"},{"$error":"#DIV/0!"},{"$error":"#DIV/0!"},{"$error":"#DIV/0!"},{"$error":"#DIV/0!"},{"$f":"IF(Q59=\"\",\"0\",(IF(P59<AI59,1,IF(Q59>#REF!,1,0))))","v":"0"},{"$f":"IF(R59=\"\",\"0\",(IF(R59<AI59,1,IF(R59>#REF!,1,0))))","v":"0"},{"$f":"IF(S59=\"\",\"0\",(IF(S59<AI59,1,IF(S59>#REF!,1,0))))","v":"0"},{"$f":"IF(T59=\"\",\"0\",(IF(T59<AI59,1,IF(T59>#REF!,1,0))))","v":"0"}]
[null,null,null,null,null,null,null,null,null,null,null,null,null,null,null,null,null,null,null,null,null,"X","",null,null,null,null,0,0,{"$error":"#DIV/0!"},{"$error":"#DIV/0!"},{"$error":"#DIV/0!"},{"$error":"#DIV/0!"},{"$error":"#DIV/0!"},{"$error":"#DIV/0!"},{"$f":"IF(Q60=\"\",\"0\",(IF(P60<AI60,1,IF(Q60>#REF!,1,0))))","v":"0"},{"$f":"IF(R60=\"\",\"0\",(IF(R60<AI60,1,IF(R60>#REF!,1,0))))","v":"0"},{"$f":"IF(S60=\"\",\"0\",(IF(S60<AI60,1,IF(S60>#REF!,1,0))))","v":"0"},{"$f":"IF(T60=\"\",\"0\",(IF(T60<AI60,1,IF(T60>#REF!,1,0))))","v":"0"}]
[null,null,null,null,null,null,null,null,null,null,null,null,null,null,null,null,null,null,null,null,null,"X","",null,null,null,null,0,0,{"$error":"#DIV/0!"},{"$error":"#DIV/0!"},{"$error":"#DIV/0!"},{"$error":"#DIV/0!"},{"$error":"#DIV/0!"},{"$error":"#DIV/0!"},{"$f":"IF(Q61=\"\",\"0\",(IF(P61<AI61,1,IF(Q61>#REF!,1,0))))","v":"0"},{"$f":"IF(R61=\"\",\"0\",(IF(R61<AI61,1,IF(R61>#REF!,1,0))))","v":"0"},{"$f":"IF(S61=\"\",\"0\",(IF(S61<AI61,1,IF(S61>#REF!,1,0))))","v":"0"},{"$f":"IF(T61=\"\",\"0\",(IF(T61<AI61,1,IF(T61>#REF!,1,0))))","v":"0"}]
[null,null,null,null,null,null,null,null,null,null,null,null,null,null,null,null,null,null,null,null,null,"X","",null,null,null,null,0,0,{"$error":"#DIV/0!"},{"$error":"#DIV/0!"},{"$error":"#DIV/0!"},{"$error":"#DIV/0!"},{"$error":"#DIV/0!"},{"$error":"#DIV/0!"},{"$f":"IF(Q62=\"\",\"0\",(IF(P62<AI62,1,IF(Q62>#REF!,1,0))))","v":"0"},{"$f":"IF(R62=\"\",\"0\",(IF(R62<AI62,1,IF(R62>#REF!,1,0))))","v":"0"},{"$f":"IF(S62=\"\",\"0\",(IF(S62<AI62,1,IF(S62>#REF!,1,0))))","v":"0"},{"$f":"IF(T62=\"\",\"0\",(IF(T62<AI62,1,IF(T62>#REF!,1,0))))","v":"0"}]
[null,null,null,null,null,null,null,null,null,null,null,null,null,null,null,null,null,null,null,null,null,"X","",null,null,null,null,0,0,{"$error":"#DIV/0!"},{"$error":"#DIV/0!"},{"$error":"#DIV/0!"},{"$error":"#DIV/0!"},{"$error":"#DIV/0!"},{"$error":"#DIV/0!"},{"$f":"IF(Q63=\"\",\"0\",(IF(P63<AI63,1,IF(Q63>#REF!,1,0))))","v":"0"},{"$f":"IF(R63=\"\",\"0\",(IF(R63<AI63,1,IF(R63>#REF!,1,0))))","v":"0"},{"$f":"IF(S63=\"\",\"0\",(IF(S63<AI63,1,IF(S63>#REF!,1,0))))","v":"0"},{"$f":"IF(T63=\"\",\"0\",(IF(T63<AI63,1,IF(T63>#REF!,1,0))))","v":"0"}]
[null,null,null,null,null,null,null,null,null,null,null,null,null,null,null,null,null,null,null,null,null,"X","",null,null,null,null,0,0,{"$error":"#DIV/0!"},{"$error":"#DIV/0!"},{"$error":"#DIV/0!"},{"$error":"#DIV/0!"},{"$error":"#DIV/0!"},{"$error":"#DIV/0!"},{"$f":"IF(Q64=\"\",\"0\",(IF(P64<AI64,1,IF(Q64>#REF!,1,0))))","v":"0"},{"$f":"IF(R64=\"\",\"0\",(IF(R64<AI64,1,IF(R64>#REF!,1,0))))","v":"0"},{"$f":"IF(S64=\"\",\"0\",(IF(S64<AI64,1,IF(S64>#REF!,1,0))))","v":"0"},{"$f":"IF(T64=\"\",\"0\",(IF(T64<AI64,1,IF(T64>#REF!,1,0))))","v":"0"}]
[null,null,null,null,null,null,null,null,null,null,null,null,null,null,null,null,null,null,null,null,null,"X","",null,null,null,null,0,0,{"$error":"#DIV/0!"},{"$error":"#DIV/0!"},{"$error":"#DIV/0!"},{"$error":"#DIV/0!"},{"$error":"#DIV/0!"},{"$error":"#DIV/0!"},{"$f":"IF(Q65=\"\",\"0\",(IF(P65<AI65,1,IF(Q65>#REF!,1,0))))","v":"0"},{"$f":"IF(R65=\"\",\"0\",(IF(R65<AI65,1,IF(R65>#REF!,1,0))))","v":"0"},{"$f":"IF(S65=\"\",\"0\",(IF(S65<AI65,1,IF(S65>#REF!,1,0))))","v":"0"},{"$f":"IF(T65=\"\",\"0\",(IF(T65<AI65,1,IF(T65>#REF!,1,0))))","v":"0"}]
[null,null,null,null,null,null,null,null,null,null,null,null,null,null,null,null,null,null,null,null,null,"X","",null,null,null,null,0,0,{"$error":"#DIV/0!"},{"$error":"#DIV/0!"},{"$error":"#DIV/0!"},{"$error":"#DIV/0!"},{"$error":"#DIV/0!"},{"$error":"#DIV/0!"},{"$f":"IF(Q66=\"\",\"0\",(IF(P66<AI66,1,IF(Q66>#REF!,1,0))))","v":"0"},{"$f":"IF(R66=\"\",\"0\",(IF(R66<AI66,1,IF(R66>#REF!,1,0))))","v":"0"},{"$f":"IF(S66=\"\",\"0\",(IF(S66<AI66,1,IF(S66>#REF!,1,0))))","v":"0"},{"$f":"IF(T66=\"\",\"0\",(IF(T66<AI66,1,IF(T66>#REF!,1,0))))","v":"0"}]
[null,null,null,null,null,null,null,null,null,null,null,null,null,null,null,null,null,null,null,null,null,"X","",null,null,null,null,0,0,{"$error":"#DIV/0!"},{"$error":"#DIV/0!"},{"$error":"#DIV/0!"},{"$error":"#DIV/0!"},{"$error":"#DIV/0!"},{"$error":"#DIV/0!"},{"$f":"IF(Q67=\"\",\"0\",(IF(P67<AI67,1,IF(Q67>#REF!,1,0))))","v":"0"},{"$f":"IF(R67=\"\",\"0\",(IF(R67<AI67,1,IF(R67>#REF!,1,0))))","v":"0"},{"$f":"IF(S67=\"\",\"0\",(IF(S67<AI67,1,IF(S67>#REF!,1,0))))","v":"0"},{"$f":"IF(T67=\"\",\"0\",(IF(T67<AI67,1,IF(T67>#REF!,1,0))))","v":"0"}]
[null,null,null,null,null,null,null,null,null,null,null,null,null,null,null,null,null,null,null,null,null,"X","",null,null,null,null,0,0,{"$error":"#DIV/0!"},{"$error":"#DIV/0!"},{"$error":"#DIV/0!"},{"$error":"#DIV/0!"},{"$error":"#DIV/0!"},{"$error":"#DIV/0!"},{"$f":"IF(Q68=\"\",\"0\",(IF(P68<AI68,1,IF(Q68>#REF!,1,0))))","v":"0"},{"$f":"IF(R68=\"\",\"0\",(IF(R68<AI68,1,IF(R68>#REF!,1,0))))","v":"0"},{"$f":"IF(S68=\"\",\"0\",(IF(S68<AI68,1,IF(S68>#REF!,1,0))))","v":"0"},{"$f":"IF(T68=\"\",\"0\",(IF(T68<AI68,1,IF(T68>#REF!,1,0))))","v":"0"}]
[null,null,null,null,null,null,null,null,null,null,null,null,null,null,null,null,null,null,null,null,null,"X","",null,null,null,null,0,0,{"$error":"#DIV/0!"},{"$error":"#DIV/0!"},{"$error":"#DIV/0!"},{"$error":"#DIV/0!"},{"$error":"#DIV/0!"},{"$error":"#DIV/0!"},{"$f":"IF(Q69=\"\",\"0\",(IF(P69<AI69,1,IF(Q69>#REF!,1,0))))","v":"0"},{"$f":"IF(R69=\"\",\"0\",(IF(R69<AI69,1,IF(R69>#REF!,1,0))))","v":"0"},{"$f":"IF(S69=\"\",\"0\",(IF(S69<AI69,1,IF(S69>#REF!,1,0))))","v":"0"},{"$f":"IF(T69=\"\",\"0\",(IF(T69<AI69,1,IF(T69>#REF!,1,0))))","v":"0"}]
[null,null,null,null,null,null,null,null,null,null,null,null,null,null,null,null,null,null,null,null,null,"X","",null,null,null,null,0,0,{"$error":"#DIV/0!"},{"$error":"#DIV/0!"},{"$error":"#DIV/0!"},{"$error":"#DIV/0!"},{"$error":"#DIV/0!"},{"$error":"#DIV/0!"},{"$f":"IF(Q70=\"\",\"0\",(IF(P70<AI70,1,IF(Q70>#REF!,1,0))))","v":"0"},{"$f":"IF(R70=\"\",\"0\",(IF(R70<AI70,1,IF(R70>#REF!,1,0))))","v":"0"},{"$f":"IF(S70=\"\",\"0\",(IF(S70<AI70,1,IF(S70>#REF!,1,0))))","v":"0"},{"$f":"IF(T70=\"\",\"0\",(IF(T70<AI70,1,IF(T70>#REF!,1,0))))","v":"0"}]
[null,null,null,null,null,null,null,null,null,null,null,null,null,null,null,null,null,null,null,null,null,"X","",null,null,null,null,0,0,{"$error":"#DIV/0!"},{"$error":"#DIV/0!"},{"$error":"#DIV/0!"},{"$error":"#DIV/0!"},{"$error":"#DIV/0!"},{"$error":"#DIV/0!"},{"$f":"IF(Q71=\"\",\"0\",(IF(P71<AI71,1,IF(Q71>#REF!,1,0))))","v":"0"},{"$f":"IF(R71=\"\",\"0\",(IF(R71<AI71,1,IF(R71>#REF!,1,0))))","v":"0"},{"$f":"IF(S71=\"\",\"0\",(IF(S71<AI71,1,IF(S71>#REF!,1,0))))","v":"0"},{"$f":"IF(T71=\"\",\"0\",(IF(T71<AI71,1,IF(T71>#REF!,1,0))))","v":"0"}]
[null,null,null,null,null,null,null,null,null,null,null,null,null,null,null,null,null,null,null,null,null,"X","",null,null,null,null,0,0,{"$error":"#DIV/0!"},{"$error":"#DIV/0!"},{"$error":"#DIV/0!"},{"$error":"#DIV/0!"},{"$error":"#DIV/0!"},{"$error":"#DIV/0!"},{"$f":"IF(Q72=\"\",\"0\",(IF(P72<AI72,1,IF(Q72>#REF!,1,0))))","v":"0"},{"$f":"IF(R72=\"\",\"0\",(IF(R72<AI72,1,IF(R72>#REF!,1,0))))","v":"0"},{"$f":"IF(S72=\"\",\"0\",(IF(S72<AI72,1,IF(S72>#REF!,1,0))))","v":"0"},{"$f":"IF(T72=\"\",\"0\",(IF(T72<AI72,1,IF(T72>#REF!,1,0))))","v":"0"}]
[null,null,null,null,null,null,null,null,null,null,null,null,null,null,null,null,null,null,null,null,null,"X","",null,null,null,null,0,0,{"$error":"#DIV/0!"},{"$error":"#DIV/0!"},{"$error":"#DIV/0!"},{"$error":"#DIV/0!"},{"$error":"#DIV/0!"},{"$error":"#DIV/0!"},{"$f":"IF(Q73=\"\",\"0\",(IF(P73<AI73,1,IF(Q73>#REF!,1,0))))","v":"0"},{"$f":"IF(R73=\"\",\"0\",(IF(R73<AI73,1,IF(R73>#REF!,1,0))))","v":"0"},{"$f":"IF(S73=\"\",\"0\",(IF(S73<AI73,1,IF(S73>#REF!,1,0))))","v":"0"},{"$f":"IF(T73=\"\",\"0\",(IF(T73<AI73,1,IF(T73>#REF!,1,0))))","v":"0"}]
[null,null,null,null,null,null,null,null,null,null,null,null,null,null,null,null,null,null,null,null,null,"X","",null,null,null,null,0,0,{"$error":"#DIV/0!"},{"$error":"#DIV/0!"},{"$error":"#DIV/0!"},{"$error":"#DIV/0!"},{"$error":"#DIV/0!"},{"$error":"#DIV/0!"},{"$f":"IF(Q74=\"\",\"0\",(IF(P74<AI74,1,IF(Q74>#REF!,1,0))))","v":"0"},{"$f":"IF(R74=\"\",\"0\",(IF(R74<AI74,1,IF(R74>#REF!,1,0))))","v":"0"},{"$f":"IF(S74=\"\",\"0\",(IF(S74<AI74,1,IF(S74>#REF!,1,0))))","v":"0"},{"$f":"IF(T74=\"\",\"0\",(IF(T74<AI74,1,IF(T74>#REF!,1,0))))","v":"0"}]
[null,null,null,null,null,null,null,null,null,null,null,null,null,null,null,null,null,null,null,null,null,"X","",null,null,null,null,0,0,{"$error":"#DIV/0!"},{"$error":"#DIV/0!"},{"$error":"#DIV/0!"},{"$error":"#DIV/0!"},{"$error":"#DIV/0!"},{"$error":"#DIV/0!"},{"$f":"IF(Q75=\"\",\"0\",(IF(P75<AI75,1,IF(Q75>#REF!,1,0))))","v":"0"},{"$f":"IF(R75=\"\",\"0\",(IF(R75<AI75,1,IF(R75>#REF!,1,0))))","v":"0"},{"$f":"IF(S75=\"\",\"0\",(IF(S75<AI75,1,IF(S75>#REF!,1,0))))","v":"0"},{"$f":"IF(T75=\"\",\"0\",(IF(T75<AI75,1,IF(T75>#REF!,1,0))))","v":"0"}]
[null,null,null,null,null,null,null,null,null,null,null,null,null,null,null,null,null,null,null,null,null,"X","",null,null,null,null,0,0,{"$error":"#DIV/0!"},{"$error":"#DIV/0!"},{"$error":"#DIV/0!"},{"$error":"#DIV/0!"},{"$error":"#DIV/0!"},{"$error":"#DIV/0!"},{"$f":"IF(Q76=\"\",\"0\",(IF(P76<AI76,1,IF(Q76>#REF!,1,0))))","v":"0"},{"$f":"IF(R76=\"\",\"0\",(IF(R76<AI76,1,IF(R76>#REF!,1,0))))","v":"0"},{"$f":"IF(S76=\"\",\"0\",(IF(S76<AI76,1,IF(S76>#REF!,1,0))))","v":"0"},{"$f":"IF(T76=\"\",\"0\",(IF(T76<AI76,1,IF(T76>#REF!,1,0))))","v":"0"}]
[null,null,null,null,null,null,null,null,null,null,null,null,null,null,null,null,null,null,null,null,null,"X","",null,null,null,null,0,0,{"$error":"#DIV/0!"},{"$error":"#DIV/0!"},{"$error":"#DIV/0!"},{"$error":"#DIV/0!"},{"$error":"#DIV/0!"},{"$error":"#DIV/0!"},{"$f":"IF(Q77=\"\",\"0\",(IF(P77<AI77,1,IF(Q77>#REF!,1,0))))","v":"0"},{"$f":"IF(R77=\"\",\"0\",(IF(R77<AI77,1,IF(R77>#REF!,1,0))))","v":"0"},{"$f":"IF(S77=\"\",\"0\",(IF(S77<AI77,1,IF(S77>#REF!,1,0))))","v":"0"},{"$f":"IF(T77=\"\",\"0\",(IF(T77<AI77,1,IF(T77>#REF!,1,0))))","v":"0"}]
[null,null,null,null,null,null,null,null,null,null,null,null,null,null,null,null,null,null,null,null,null,"X","",null,null,null,null,0,0,{"$error":"#DIV/0!"},{"$error":"#DIV/0!"},{"$error":"#DIV/0!"},{"$error":"#DIV/0!"},{"$error":"#DIV/0!"},{"$error":"#DIV/0!"},{"$f":"IF(Q78=\"\",\"0\",(IF(P78<AI78,1,IF(Q78>#REF!,1,0))))","v":"0"},{"$f":"IF(R78=\"\",\"0\",(IF(R78<AI78,1,IF(R78>#REF!,1,0))))","v":"0"},{"$f":"IF(S78=\"\",\"0\",(IF(S78<AI78,1,IF(S78>#REF!,1,0))))","v":"0"},{"$f":"IF(T78=\"\",\"0\",(IF(T78<AI78,1,IF(T78>#REF!,1,0))))","v":"0"}]
[null,null,null,null,null,null,null,null,null,null,null,null,null,null,null,null,null,null,null,null,null,{"$f":"IF(I79=\"Ref\",\"\",(IF(I79=\"Basic\",\"\",(IF(P79=\"P\",\"X\",(IF(P79=\"F\",\"\",IF(MAX(P79:T79)>(H79+J79),\"\",IF(MIN(P79:T79)<(H79+I79),\"\",\"X\")))))))))","v":"X"},{"$f":"IF(I79=\"Ref\",\"\",(IF(I79=\"Basic\",\"\",(IF(P79=\"P\",\"\",IF(P79=\"F\",\"X\",IF(MAX(P79:T79)>(H79+J79),\"X\",IF(MIN(P79:T79)<(H79+I79),\"X\",\"\"))))))))","v":""},null,null,null,null,0,0,{"$error":"#DIV/0!"},{"$error":"#DIV/0!"},{"$f":"(AB79-AD79)/(3*AE79)","v":{"$error":"#DIV/0!"}},{"$f":"(AD79-AC79)/(3*AE79)","v":{"$error":"#DIV/0!"}},{"$f":"(AB79-AC79)/(6*AE79)","v":{"$error":"#DIV/0!"}},{"$error":"#DIV/0!"},{"$f":"IF(Q79=\"\",\"0\",(IF(P79<AI79,1,IF(Q79>#REF!,1,0))))","v":"0"},{"$f":"IF(R79=\"\",\"0\",(IF(R79<AI79,1,IF(R79>#REF!,1,0))))","v":"0"},{"$f":"IF(S79=\"\",\"0\",(IF(S79<AI79,1,IF(S79>#REF!,1,0))))","v":"0"},{"$f":"IF(T79=\"\",\"0\",(IF(T79<AI79,1,IF(T79>#REF!,1,0))))","v":"0"}]
[null,null,null,null,null,null,null,null,null,null,null,null,null,null,null,null,null,null,null,null,null,"X","",null,null,null,null,{"$f":"H80+J80","v":0},{"$f":"H80+I80","v":0},{"$f":"AVERAGE(P80:T80)","v":{"$error":"#DIV/0!"}},{"$f":"_xlfn.STDEV.S(P80,Q80,R80,S80,T80)","v":{"$error":"#DIV/0!"}},{"$error":"#DIV/0!"},{"$error":"#DIV/0!"},{"$error":"#DIV/0!"},{"$f":"MIN(AF80, AG80)","v":{"$error":"#DIV/0!"}},{"$f":"IF(Q80=\"\",\"0\",(IF(P80<AI80,1,IF(Q80>#REF!,1,0))))","v":"0"},{"$f":"IF(R80=\"\",\"0\",(IF(R80<AI80,1,IF(R80>#REF!,1,0))))","v":"0"},{"$f":"IF(S80=\"\",\"0\",(IF(S80<AI80,1,IF(S80>#REF!,1,0))))","v":"0"},{"$f":"IF(T80=\"\",\"0\",(IF(T80<AI80,1,IF(T80>#REF!,1,0))))","v":"0"}]
[null,null,null,null,null,null,null,null,null,null,null,null,null,null,null,null,null,null,null,null,null,"X","",null,null,null,null,0,0,{"$error":"#DIV/0!"},{"$error":"#DIV/0!"},{"$error":"#DIV/0!"},{"$error":"#DIV/0!"},{"$error":"#DIV/0!"},{"$error":"#DIV/0!"},{"$f":"IF(Q81=\"\",\"0\",(IF(P81<AI81,1,IF(Q81>#REF!,1,0))))","v":"0"},{"$f":"IF(R81=\"\",\"0\",(IF(R81<AI81,1,IF(R81>#REF!,1,0))))","v":"0"},{"$f":"IF(S81=\"\",\"0\",(IF(S81<AI81,1,IF(S81>#REF!,1,0))))","v":"0"},{"$f":"IF(T81=\"\",\"0\",(IF(T81<AI81,1,IF(T81>#REF!,1,0))))","v":"0"}]
[null,null,null,null,null,null,null,null,null,null,null,null,null,null,null,null,null,null,null,null,null,"X","",null,null,null,null,0,0,{"$error":"#DIV/0!"},{"$error":"#DIV/0!"},{"$error":"#DIV/0!"},{"$error":"#DIV/0!"},{"$error":"#DIV/0!"},{"$error":"#DIV/0!"},{"$f":"IF(Q82=\"\",\"0\",(IF(P82<AI82,1,IF(Q82>#REF!,1,0))))","v":"0"},{"$f":"IF(R82=\"\",\"0\",(IF(R82<AI82,1,IF(R82>#REF!,1,0))))","v":"0"},{"$f":"IF(S82=\"\",\"0\",(IF(S82<AI82,1,IF(S82>#REF!,1,0))))","v":"0"},{"$f":"IF(T82=\"\",\"0\",(IF(T82<AI82,1,IF(T82>#REF!,1,0))))","v":"0"}]
[null,null,null,null,null,null,null,null,null,null,null,null,null,null,null,null,null,null,null,null,null,"X","",null,null,null,null,0,0,{"$error":"#DIV/0!"},{"$error":"#DIV/0!"},{"$error":"#DIV/0!"},{"$error":"#DIV/0!"},{"$error":"#DIV/0!"},{"$error":"#DIV/0!"},{"$f":"IF(Q83=\"\",\"0\",(IF(P83<AI83,1,IF(Q83>#REF!,1,0))))","v":"0"},{"$f":"IF(R83=\"\",\"0\",(IF(R83<AI83,1,IF(R83>#REF!,1,0))))","v":"0"},{"$f":"IF(S83=\"\",\"0\",(IF(S83<AI83,1,IF(S83>#REF!,1,0))))","v":"0"},{"$f":"IF(T83=\"\",\"0\",(IF(T83<AI83,1,IF(T83>#REF!,1,0))))","v":"0"}]
[null,null,null,null,null,null,null,null,null,null,null,null,null,null,null,null,null,null,null,null,null,"X","",null,null,null,null,0,0,{"$error":"#DIV/0!"},{"$error":"#DIV/0!"},{"$error":"#DIV/0!"},{"$error":"#DIV/0!"},{"$error":"#DIV/0!"},{"$error":"#DIV/0!"},{"$f":"IF(Q84=\"\",\"0\",(IF(P84<AI84,1,IF(Q84>#REF!,1,0))))","v":"0"},{"$f":"IF(R84=\"\",\"0\",(IF(R84<AI84,1,IF(R84>#REF!,1,0))))","v":"0"},{"$f":"IF(S84=\"\",\"0\",(IF(S84<AI84,1,IF(S84>#REF!,1,0))))","v":"0"},{"$f":"IF(T84=\"\",\"0\",(IF(T84<AI84,1,IF(T84>#REF!,1,0))))","v":"0"}]
[null,null,null,null,null,null,null,null,null,null,null,null,null,null,null,null,null,null,null,null,null,"X","",null,null,null,null,0,0,{"$error":"#DIV/0!"},{"$error":"#DIV/0!"},{"$error":"#DIV/0!"},{"$error":"#DIV/0!"},{"$error":"#DIV/0!"},{"$error":"#DIV/0!"},{"$f":"IF(Q85=\"\",\"0\",(IF(P85<AI85,1,IF(Q85>#REF!,1,0))))","v":"0"},{"$f":"IF(R85=\"\",\"0\",(IF(R85<AI85,1,IF(R85>#REF!,1,0))))","v":"0"},{"$f":"IF(S85=\"\",\"0\",(IF(S85<AI85,1,IF(S85>#REF!,1,0))))","v":"0"},{"$f":"IF(T85=\"\",\"0\",(IF(T85<AI85,1,IF(T85>#REF!,1,0))))","v":"0"}]
[null,null,null,null,null,null,null,null,null,null,null,null,null,null,null,null,null,null,null,null,null,"X","",null,null,null,null,0,0,{"$error":"#DIV/0!"},{"$error":"#DIV/0!"},{"$error":"#DIV/0!"},{"$error":"#DIV/0!"},{"$error":"#DIV/0!"},{"$error":"#DIV/0!"},{"$f":"IF(Q86=\"\",\"0\",(IF(P86<AI86,1,IF(Q86>#REF!,1,0))))","v":"0"},{"$f":"IF(R86=\"\",\"0\",(IF(R86<AI86,1,IF(R86>#REF!,1,0))))","v":"0"},{"$f":"IF(S86=\"\",\"0\",(IF(S86<AI86,1,IF(S86>#REF!,1,0))))","v":"0"},{"$f":"IF(T86=\"\",\"0\",(IF(T86<AI86,1,IF(T86>#REF!,1,0))))","v":"0"}]
[null,null,null,null,null,null,null,null,null,null,null,null,null,null,null,null,null,null,null,null,null,"X","",null,null,null,null,0,0,{"$error":"#DIV/0!"},{"$error":"#DIV/0!"},{"$error":"#DIV/0!"},{"$error":"#DIV/0!"},{"$error":"#DIV/0!"},{"$error":"#DIV/0!"},{"$f":"IF(Q87=\"\",\"0\",(IF(P87<AI87,1,IF(Q87>#REF!,1,0))))","v":"0"},{"$f":"IF(R87=\"\",\"0\",(IF(R87<AI87,1,IF(R87>#REF!,1,0))))","v":"0"},{"$f":"IF(S87=\"\",\"0\",(IF(S87<AI87,1,IF(S87>#REF!,1,0))))","v":"0"},{"$f":"IF(T87=\"\",\"0\",(IF(T87<AI87,1,IF(T87>#REF!,1,0))))","v":"0"}]
[null,null,null,null,null,null,null,null,null,null,null,null,null,null,null,null,null,null,null,null,null,"X","",null,null,null,null,0,0,{"$error":"#DIV/0!"},{"$error":"#DIV/0!"},{"$error":"#DIV/0!"},{"$error":"#DIV/0!"},{"$error":"#DIV/0!"},{"$error":"#DIV/0!"},{"$f":"IF(Q88=\"\",\"0\",(IF(P88<AI88,1,IF(Q88>#REF!,1,0))))","v":"0"},{"$f":"IF(R88=\"\",\"0\",(IF(R88<AI88,1,IF(R88>#REF!,1,0))))","v":"0"},{"$f":"IF(S88=\"\",\"0\",(IF(S88<AI88,1,IF(S88>#REF!,1,0))))","v":"0"},{"$f":"IF(T88=\"\",\"0\",(IF(T88<AI88,1,IF(T88>#REF!,1,0))))","v":"0"}]
[null,null,null,null,null,null,null,null,null,null,null,null,null,null,null,null,null,null,null,null,null,"X","",null,null,null,null,0,0,{"$error":"#DIV/0!"},{"$error":"#DIV/0!"},{"$error":"#DIV/0!"},{"$error":"#DIV/0!"},{"$error":"#DIV/0!"},{"$error":"#DIV/0!"},{"$f":"IF(Q89=\"\",\"0\",(IF(P89<AI89,1,IF(Q89>#REF!,1,0))))","v":"0"},{"$f":"IF(R89=\"\",\"0\",(IF(R89<AI89,1,IF(R89>#REF!,1,0))))","v":"0"},{"$f":"IF(S89=\"\",\"0\",(IF(S89<AI89,1,IF(S89>#REF!,1,0))))","v":"0"},{"$f":"IF(T89=\"\",\"0\",(IF(T89<AI89,1,IF(T89>#REF!,1,0))))","v":"0"}]
[null,null,null,null,null,null,null,null,null,null,null,null,null,null,null,null,null,null,null,null,null,"X","",null,null,null,null,0,0,{"$error":"#DIV/0!"},{"$error":"#DIV/0!"},{"$error":"#DIV/0!"},{"$error":"#DIV/0!"},{"$error":"#DIV/0!"},{"$error":"#DIV/0!"},{"$f":"IF(Q90=\"\",\"0\",(IF(P90<AI90,1,IF(Q90>#REF!,1,0))))","v":"0"},{"$f":"IF(R90=\"\",\"0\",(IF(R90<AI90,1,IF(R90>#REF!,1,0))))","v":"0"},{"$f":"IF(S90=\"\",\"0\",(IF(S90<AI90,1,IF(S90>#REF!,1,0))))","v":"0"},{"$f":"IF(T90=\"\",\"0\",(IF(T90<AI90,1,IF(T90>#REF!,1,0))))","v":"0"}]
[null,null,null,null,null,null,null,null,null,null,null,null,null,null,null,null,null,null,null,null,null,"X","",null,null,null,null,0,0,{"$error":"#DIV/0!"},{"$error":"#DIV/0!"},{"$error":"#DIV/0!"},{"$error":"#DIV/0!"},{"$error":"#DIV/0!"},{"$error":"#DIV/0!"},{"$f":"IF(Q91=\"\",\"0\",(IF(P91<AI91,1,IF(Q91>#REF!,1,0))))","v":"0"},{"$f":"IF(R91=\"\",\"0\",(IF(R91<AI91,1,IF(R91>#REF!,1,0))))","v":"0"},{"$f":"IF(S91=\"\",\"0\",(IF(S91<AI91,1,IF(S91>#REF!,1,0))))","v":"0"},{"$f":"IF(T91=\"\",\"0\",(IF(T91<AI91,1,IF(T91>#REF!,1,0))))","v":"0"}]
[null,null,null,null,null,null,null,null,null,null,null,null,null,null,null,null,null,null,null,null,null,"X","",null,null,null,null,0,0,{"$error":"#DIV/0!"},{"$error":"#DIV/0!"},{"$error":"#DIV/0!"},{"$error":"#DIV/0!"},{"$error":"#DIV/0!"},{"$error":"#DIV/0!"},{"$f":"IF(Q92=\"\",\"0\",(IF(P92<AI92,1,IF(Q92>#REF!,1,0))))","v":"0"},{"$f":"IF(R92=\"\",\"0\",(IF(R92<AI92,1,IF(R92>#REF!,1,0))))","v":"0"},{"$f":"IF(S92=\"\",\"0\",(IF(S92<AI92,1,IF(S92>#REF!,1,0))))","v":"0"},{"$f":"IF(T92=\"\",\"0\",(IF(T92<AI92,1,IF(T92>#REF!,1,0))))","v":"0"}]
[null,null,null,null,null,null,null,null,null,null,null,null,null,null,null,null,null,null,null,null,null,"X","",null,null,null,null,0,0,{"$error":"#DIV/0!"},{"$error":"#DIV/0!"},{"$error":"#DIV/0!"},{"$error":"#DIV/0!"},{"$error":"#DIV/0!"},{"$error":"#DIV/0!"},{"$f":"IF(Q93=\"\",\"0\",(IF(P93<AI93,1,IF(Q93>#REF!,1,0))))","v":"0"},{"$f":"IF(R93=\"\",\"0\",(IF(R93<AI93,1,IF(R93>#REF!,1,0))))","v":"0"},{"$f":"IF(S93=\"\",\"0\",(IF(S93<AI93,1,IF(S93>#REF!,1,0))))","v":"0"},{"$f":"IF(T93=\"\",\"0\",(IF(T93<AI93,1,IF(T93>#REF!,1,0))))","v":"0"}]
[null,null,null,null,null,null,null,null,null,null,null,null,null,null,null,null,null,null,null,null,null,"X","",null,null,null,null,0,0,{"$error":"#DIV/0!"},{"$error":"#DIV/0!"},{"$error":"#DIV/0!"},{"$error":"#DIV/0!"},{"$error":"#DIV/0!"},{"$error":"#DIV/0!"},{"$f":"IF(Q94=\"\",\"0\",(IF(P94<AI94,1,IF(Q94>#REF!,1,0))))","v":"0"},{"$f":"IF(R94=\"\",\"0\",(IF(R94<AI94,1,IF(R94>#REF!,1,0))))","v":"0"},{"$f":"IF(S94=\"\",\"0\",(IF(S94<AI94,1,IF(S94>#REF!,1,0))))","v":"0"},{"$f":"IF(T94=\"\",\"0\",(IF(T94<AI94,1,IF(T94>#REF!,1,0))))","v":"0"}]
[null,null,null,null,null,null,null,null,null,null,null,null,null,null,null,null,null,null,null,null,null,"X","",null,null,null,null,0,0,{"$error":"#DIV/0!"},{"$error":"#DIV/0!"},{"$error":"#DIV/0!"},{"$error":"#DIV/0!"},{"$error":"#DIV/0!"},{"$error":"#DIV/0!"},{"$f":"IF(Q95=\"\",\"0\",(IF(P95<AI95,1,IF(Q95>#REF!,1,0))))","v":"0"},{"$f":"IF(R95=\"\",\"0\",(IF(R95<AI95,1,IF(R95>#REF!,1,0))))","v":"0"},{"$f":"IF(S95=\"\",\"0\",(IF(S95<AI95,1,IF(S95>#REF!,1,0))))","v":"0"},{"$f":"IF(T95=\"\",\"0\",(IF(T95<AI95,1,IF(T95>#REF!,1,0))))","v":"0"}]
[null,null,null,null,null,null,null,null,null,null,null,null,null,null,null,null,null,null,null,null,null,"X","",null,null,null,null,0,0,{"$error":"#DIV/0!"},{"$error":"#DIV/0!"},{"$error":"#DIV/0!"},{"$error":"#DIV/0!"},{"$error":"#DIV/0!"},{"$error":"#DIV/0!"},{"$f":"IF(Q96=\"\",\"0\",(IF(P96<AI96,1,IF(Q96>#REF!,1,0))))","v":"0"},{"$f":"IF(R96=\"\",\"0\",(IF(R96<AI96,1,IF(R96>#REF!,1,0))))","v":"0"},{"$f":"IF(S96=\"\",\"0\",(IF(S96<AI96,1,IF(S96>#REF!,1,0))))","v":"0"},{"$f":"IF(T96=\"\",\"0\",(IF(T96<AI96,1,IF(T96>#REF!,1,0))))","v":"0"}]
[null,null,null,null,null,null,null,null,null,null,null,null,null,null,null,null,null,null,null,null,null,"X","",null,null,null,null,0,0,{"$error":"#DIV/0!"},{"$error":"#DIV/0!"},{"$error":"#DIV/0!"},{"$error":"#DIV/0!"},{"$error":"#DIV/0!"},{"$error":"#DIV/0!"},{"$f":"IF(Q97=\"\",\"0\",(IF(P97<AI97,1,IF(Q97>#REF!,1,0))))","v":"0"},{"$f":"IF(R97=\"\",\"0\",(IF(R97<AI97,1,IF(R97>#REF!,1,0))))","v":"0"},{"$f":"IF(S97=\"\",\"0\",(IF(S97<AI97,1,IF(S97>#REF!,1,0))))","v":"0"},{"$f":"IF(T97=\"\",\"0\",(IF(T97<AI97,1,IF(T97>#REF!,1,0))))","v":"0"}]
[null,null,null,null,null,null,null,null,null,null,null,null,null,null,null,null,null,null,null,null,null,"X","",null,null,null,null,0,0,{"$error":"#DIV/0!"},{"$error":"#DIV/0!"},{"$error":"#DIV/0!"},{"$error":"#DIV/0!"},{"$error":"#DIV/0!"},{"$error":"#DIV/0!"},{"$f":"IF(Q98=\"\",\"0\",(IF(P98<AI98,1,IF(Q98>#REF!,1,0))))","v":"0"},{"$f":"IF(R98=\"\",\"0\",(IF(R98<AI98,1,IF(R98>#REF!,1,0))))","v":"0"},{"$f":"IF(S98=\"\",\"0\",(IF(S98<AI98,1,IF(S98>#REF!,1,0))))","v":"0"},{"$f":"IF(T98=\"\",\"0\",(IF(T98<AI98,1,IF(T98>#REF!,1,0))))","v":"0"}]
[null,null,null,null,null,null,null,null,null,null,null,null,null,null,null,null,null,null,null,null,null,"X","",null,null,null,null,0,0,{"$error":"#DIV/0!"},{"$error":"#DIV/0!"},{"$error":"#DIV/0!"},{"$error":"#DIV/0!"},{"$error":"#DIV/0!"},{"$error":"#DIV/0!"},{"$f":"IF(Q99=\"\",\"0\",(IF(P99<AI99,1,IF(Q99>#REF!,1,0))))","v":"0"},{"$f":"IF(R99=\"\",\"0\",(IF(R99<AI99,1,IF(R99>#REF!,1,0))))","v":"0"},{"$f":"IF(S99=\"\",\"0\",(IF(S99<AI99,1,IF(S99>#REF!,1,0))))","v":"0"},{"$f":"IF(T99=\"\",\"0\",(IF(T99<AI99,1,IF(T99>#REF!,1,0))))","v":"0"}]
[null,null,null,null,null,null,null,null,null,null,null,null,null,null,null,null,null,null,null,null,null,"X","",null,null,null,null,0,0,{"$error":"#DIV/0!"},{"$error":"#DIV/0!"},{"$error":"#DIV/0!"},{"$error":"#DIV/0!"},{"$error":"#DIV/0!"},{"$error":"#DIV/0!"},{"$f":"IF(Q100=\"\",\"0\",(IF(P100<AI100,1,IF(Q100>#REF!,1,0))))","v":"0"},{"$f":"IF(R100=\"\",\"0\",(IF(R100<AI100,1,IF(R100>#REF!,1,0))))","v":"0"},{"$f":"IF(S100=\"\",\"0\",(IF(S100<AI100,1,IF(S100>#REF!,1,0))))","v":"0"},{"$f":"IF(T100=\"\",\"0\",(IF(T100<AI100,1,IF(T100>#REF!,1,0))))","v":"0"}]
[null,null,null,null,null,null,null,null,null,null,null,null,null,null,null,null,null,null,null,null,null,"X","",null,null,null,null,0,0,{"$error":"#DIV/0!"},{"$error":"#DIV/0!"},{"$error":"#DIV/0!"},{"$error":"#DIV/0!"},{"$error":"#DIV/0!"},{"$error":"#DIV/0!"},{"$f":"IF(Q101=\"\",\"0\",(IF(P101<AI101,1,IF(Q101>#REF!,1,0))))","v":"0"},{"$f":"IF(R101=\"\",\"0\",(IF(R101<AI101,1,IF(R101>#REF!,1,0))))","v":"0"},{"$f":"IF(S101=\"\",\"0\",(IF(S101<AI101,1,IF(S101>#REF!,1,0))))","v":"0"},{"$f":"IF(T101=\"\",\"0\",(IF(T101<AI101,1,IF(T101>#REF!,1,0))))","v":"0"}]
[null,null,null,null,null,null,null,null,null,null,null,null,null,null,null,null,null,null,null,null,null,"X","",null,null,null,null,0,0,{"$error":"#DIV/0!"},{"$error":"#DIV/0!"},{"$error":"#DIV/0!"},{"$error":"#DIV/0!"},{"$error":"#DIV/0!"},{"$error":"#DIV/0!"},{"$f":"IF(Q102=\"\",\"0\",(IF(P102<AI102,1,IF(Q102>#REF!,1,0))))","v":"0"},{"$f":"IF(R102=\"\",\"0\",(IF(R102<AI102,1,IF(R102>#REF!,1,0))))","v":"0"},{"$f":"IF(S102=\"\",\"0\",(IF(S102<AI102,1,IF(S102>#REF!,1,0))))","v":"0"},{"$f":"IF(T102=\"\",\"0\",(IF(T102<AI102,1,IF(T102>#REF!,1,0))))","v":"0"}]
[null,null,null,null,null,null,null,null,null,null,null,null,null,null,null,null,null,null,null,null,null,"X","",null,null,null,null,0,0,{"$error":"#DIV/0!"},{"$error":"#DIV/0!"},{"$error":"#DIV/0!"},{"$error":"#DIV/0!"},{"$error":"#DIV/0!"},{"$error":"#DIV/0!"},{"$f":"IF(Q103=\"\",\"0\",(IF(P103<AI103,1,IF(Q103>#REF!,1,0))))","v":"0"},{"$f":"IF(R103=\"\",\"0\",(IF(R103<AI103,1,IF(R103>#REF!,1,0))))","v":"0"},{"$f":"IF(S103=\"\",\"0\",(IF(S103<AI103,1,IF(S103>#REF!,1,0))))","v":"0"},{"$f":"IF(T103=\"\",\"0\",(IF(T103<AI103,1,IF(T103>#REF!,1,0))))","v":"0"}]
[null,null,null,null,null,null,null,null,null,null,null,null,null,null,null,null,null,null,null,null,null,"X","",null,null,null,null,0,0,{"$error":"#DIV/0!"},{"$error":"#DIV/0!"},{"$error":"#DIV/0!"},{"$error":"#DIV/0!"},{"$error":"#DIV/0!"},{"$error":"#DIV/0!"},{"$f":"IF(Q104=\"\",\"0\",(IF(P104<AI104,1,IF(Q104>#REF!,1,0))))","v":"0"},{"$f":"IF(R104=\"\",\"0\",(IF(R104<AI104,1,IF(R104>#REF!,1,0))))","v":"0"},{"$f":"IF(S104=\"\",\"0\",(IF(S104<AI104,1,IF(S104>#REF!,1,0))))","v":"0"},{"$f":"IF(T104=\"\",\"0\",(IF(T104<AI104,1,IF(T104>#REF!,1,0))))","v":"0"}]
[null,null,null,null,null,null,null,null,null,null,null,null,null,null,null,null,null,null,null,null,null,"X","",null,null,null,null,0,0,{"$error":"#DIV/0!"},{"$error":"#DIV/0!"},{"$error":"#DIV/0!"},{"$error":"#DIV/0!"},{"$error":"#DIV/0!"},{"$error":"#DIV/0!"},{"$f":"IF(Q105=\"\",\"0\",(IF(P105<AI105,1,IF(Q105>#REF!,1,0))))","v":"0"},{"$f":"IF(R105=\"\",\"0\",(IF(R105<AI105,1,IF(R105>#REF!,1,0))))","v":"0"},{"$f":"IF(S105=\"\",\"0\",(IF(S105<AI105,1,IF(S105>#REF!,1,0))))","v":"0"},{"$f":"IF(T105=\"\",\"0\",(IF(T105<AI105,1,IF(T105>#REF!,1,0))))","v":"0"}]
[null,null,null,null,null,null,null,null,null,null,null,null,null,null,null,null,null,null,null,null,null,"X","",null,null,null,null,0,0,{"$error":"#DIV/0!"},{"$error":"#DIV/0!"},{"$error":"#DIV/0!"},{"$error":"#DIV/0!"},{"$error":"#DIV/0!"},{"$error":"#DIV/0!"},{"$f":"IF(Q106=\"\",\"0\",(IF(P106<AI106,1,IF(Q106>#REF!,1,0))))","v":"0"},{"$f":"IF(R106=\"\",\"0\",(IF(R106<AI106,1,IF(R106>#REF!,1,0))))","v":"0"},{"$f":"IF(S106=\"\",\"0\",(IF(S106<AI106,1,IF(S106>#REF!,1,0))))","v":"0"},{"$f":"IF(T106=\"\",\"0\",(IF(T106<AI106,1,IF(T106>#REF!,1,0))))","v":"0"}]
[null,null,null,null,null,null,null,null,null,null,null,null,null,null,null,null,null,null,null,null,null,"X","",null,null,null,null,0,0,{"$error":"#DIV/0!"},{"$error":"#DIV/0!"},{"$error":"#DIV/0!"},{"$error":"#DIV/0!"},{"$error":"#DIV/0!"},{"$error":"#DIV/0!"},{"$f":"IF(Q107=\"\",\"0\",(IF(P107<AI107,1,IF(Q107>#REF!,1,0))))","v":"0"},{"$f":"IF(R107=\"\",\"0\",(IF(R107<AI107,1,IF(R107>#REF!,1,0))))","v":"0"},{"$f":"IF(S107=\"\",\"0\",(IF(S107<AI107,1,IF(S107>#REF!,1,0))))","v":"0"},{"$f":"IF(T107=\"\",\"0\",(IF(T107<AI107,1,IF(T107>#REF!,1,0))))","v":"0"}]
[null,null,null,null,null,null,null,null,null,null,null,null,null,null,null,null,null,null,null,null,null,"X","",null,null,null,null,0,0,{"$error":"#DIV/0!"},{"$error":"#DIV/0!"},{"$error":"#DIV/0!"},{"$error":"#DIV/0!"},{"$error":"#DIV/0!"},{"$error":"#DIV/0!"},{"$f":"IF(Q108=\"\",\"0\",(IF(P108<AI108,1,IF(Q108>#REF!,1,0))))","v":"0"},{"$f":"IF(R108=\"\",\"0\",(IF(R108<AI108,1,IF(R108>#REF!,1,0))))","v":"0"},{"$f":"IF(S108=\"\",\"0\",(IF(S108<AI108,1,IF(S108>#REF!,1,0))))","v":"0"},{"$f":"IF(T108=\"\",\"0\",(IF(T108<AI108,1,IF(T108>#REF!,1,0))))","v":"0"}]
[null,null,null,null,null,null,null,null,null,null,null,null,null,null,null,null,null,null,null,null,null,"X","",null,null,null,null,0,0,{"$error":"#DIV/0!"},{"$error":"#DIV/0!"},{"$error":"#DIV/0!"},{"$error":"#DIV/0!"},{"$error":"#DIV/0!"},{"$error":"#DIV/0!"},{"$f":"IF(Q109=\"\",\"0\",(IF(P109<AI109,1,IF(Q109>#REF!,1,0))))","v":"0"},{"$f":"IF(R109=\"\",\"0\",(IF(R109<AI109,1,IF(R109>#REF!,1,0))))","v":"0"},{"$f":"IF(S109=\"\",\"0\",(IF(S109<AI109,1,IF(S109>#REF!,1,0))))","v":"0"},{"$f":"IF(T109=\"\",\"0\",(IF(T109<AI109,1,IF(T109>#REF!,1,0))))","v":"0"}]
[null,null,null,null,null,null,null,null,null,null,null,null,null,null,null,null,null,null,null,null,null,"X","",null,null,null,null,0,0,{"$error":"#DIV/0!"},{"$error":"#DIV/0!"},{"$error":"#DIV/0!"},{"$error":"#DIV/0!"},{"$error":"#DIV/0!"},{"$error":"#DIV/0!"},{"$f":"IF(Q110=\"\",\"0\",(IF(P110<AI110,1,IF(Q110>#REF!,1,0))))","v":"0"},{"$f":"IF(R110=\"\",\"0\",(IF(R110<AI110,1,IF(R110>#REF!,1,0))))","v":"0"},{"$f":"IF(S110=\"\",\"0\",(IF(S110<AI110,1,IF(S110>#REF!,1,0))))","v":"0"},{"$f":"IF(T110=\"\",\"0\",(IF(T110<AI110,1,IF(T110>#REF!,1,0))))","v":"0"}]
[null,null,null,null,null,null,null,null,null,null,null,null,null,null,null,null,null,null,null,null,null,"X","",null,null,null,null,0,0,{"$error":"#DIV/0!"},{"$error":"#DIV/0!"},{"$error":"#DIV/0!"},{"$error":"#DIV/0!"},{"$error":"#DIV/0!"},{"$error":"#DIV/0!"},{"$f":"IF(Q111=\"\",\"0\",(IF(P111<AI111,1,IF(Q111>#REF!,1,0))))","v":"0"},{"$f":"IF(R111=\"\",\"0\",(IF(R111<AI111,1,IF(R111>#REF!,1,0))))","v":"0"},{"$f":"IF(S111=\"\",\"0\",(IF(S111<AI111,1,IF(S111>#REF!,1,0))))","v":"0"},{"$f":"IF(T111=\"\",\"0\",(IF(T111<AI111,1,IF(T111>#REF!,1,0))))","v":"0"}]
[null,null,null,null,null,null,null,null,null,null,null,null,null,null,null,null,null,null,null,null,null,"X","",null,null,null,null,0,0,{"$error":"#DIV/0!"},{"$error":"#DIV/0!"},{"$error":"#DIV/0!"},{"$error":"#DIV/0!"},{"$error":"#DIV/0!"},{"$error":"#DIV/0!"},{"$f":"IF(Q112=\"\",\"0\",(IF(P112<AI112,1,IF(Q112>#REF!,1,0))))","v":"0"},{"$f":"IF(R112=\"\",\"0\",(IF(R112<AI112,1,IF(R112>#REF!,1,0))))","v":"0"},{"$f":"IF(S112=\"\",\"0\",(IF(S112<AI112,1,IF(S112>#REF!,1,0))))","v":"0"},{"$f":"IF(T112=\"\",\"0\",(IF(T112<AI112,1,IF(T112>#REF!,1,0))))","v":"0"}]
[null,null,null,null,null,null,null,null,null,null,null,null,null,null,null,null,null,null,null,null,null,"X","",null,null,null,null,0,0,{"$error":"#DIV/0!"},{"$error":"#DIV/0!"},{"$error":"#DIV/0!"},{"$error":"#DIV/0!"},{"$error":"#DIV/0!"},{"$error":"#DIV/0!"},{"$f":"IF(Q113=\"\",\"0\",(IF(P113<AI113,1,IF(Q113>#REF!,1,0))))","v":"0"},{"$f":"IF(R113=\"\",\"0\",(IF(R113<AI113,1,IF(R113>#REF!,1,0))))","v":"0"},{"$f":"IF(S113=\"\",\"0\",(IF(S113<AI113,1,IF(S113>#REF!,1,0))))","v":"0"},{"$f":"IF(T113=\"\",\"0\",(IF(T113<AI113,1,IF(T113>#REF!,1,0))))","v":"0"}]
[null,null,null,null,null,null,null,null,null,null,null,null,null,null,null,null,null,null,null,null,null,"X","",null,null,null,null,0,0,{"$error":"#DIV/0!"},{"$error":"#DIV/0!"},{"$error":"#DIV/0!"},{"$error":"#DIV/0!"},{"$error":"#DIV/0!"},{"$error":"#DIV/0!"},{"$f":"IF(Q114=\"\",\"0\",(IF(P114<AI114,1,IF(Q114>#REF!,1,0))))","v":"0"},{"$f":"IF(R114=\"\",\"0\",(IF(R114<AI114,1,IF(R114>#REF!,1,0))))","v":"0"},{"$f":"IF(S114=\"\",\"0\",(IF(S114<AI114,1,IF(S114>#REF!,1,0))))","v":"0"},{"$f":"IF(T114=\"\",\"0\",(IF(T114<AI114,1,IF(T114>#REF!,1,0))))","v":"0"}]
[null,null,null,null,null,null,null,null,null,null,null,null,null,null,null,null,null,null,null,null,null,"X","",null,null,null,null,0,0,{"$error":"#DIV/0!"},{"$error":"#DIV/0!"},{"$error":"#DIV/0!"},{"$error":"#DIV/0!"},{"$error":"#DIV/0!"},{"$error":"#DIV/0!"},{"$f":"IF(Q115=\"\",\"0\",(IF(P115<AI115,1,IF(Q115>#REF!,1,0))))","v":"0"},{"$f":"IF(R115=\"\",\"0\",(IF(R115<AI115,1,IF(R115>#REF!,1,0))))","v":"0"},{"$f":"IF(S115=\"\",\"0\",(IF(S115<AI115,1,IF(S115>#REF!,1,0))))","v":"0"},{"$f":"IF(T115=\"\",\"0\",(IF(T115<AI115,1,IF(T115>#REF!,1,0))))","v":"0"}]
[null,null,null,null,null,null,null,null,null,null,null,null,null,null,null,null,null,null,null,null,null,"X","",null,null,null,null,0,0,{"$error":"#DIV/0!"},{"$error":"#DIV/0!"},{"$error":"#DIV/0!"},{"$error":"#DIV/0!"},{"$error":"#DIV/0!"},{"$error":"#DIV/0!"},{"$f":"IF(Q116=\"\",\"0\",(IF(P116<AI116,1,IF(Q116>#REF!,1,0))))","v":"0"},{"$f":"IF(R116=\"\",\"0\",(IF(R116<AI116,1,IF(R116>#REF!,1,0))))","v":"0"},{"$f":"IF(S116=\"\",\"0\",(IF(S116<AI116,1,IF(S116>#REF!,1,0))))","v":"0"},{"$f":"IF(T116=\"\",\"0\",(IF(T116<AI116,1,IF(T116>#REF!,1,0))))","v":"0"}]
[null,null,null,null,null,null,null,null,null,null,null,null,null,null,null,null,null,null,null,null,null,"X","",null,null,null,null,0,0,{"$error":"#DIV/0!"},{"$error":"#DIV/0!"},{"$error":"#DIV/0!"},{"$error":"#DIV/0!"},{"$error":"#DIV/0!"},{"$error":"#DIV/0!"},{"$f":"IF(Q117=\"\",\"0\",(IF(P117<AI117,1,IF(Q117>#REF!,1,0))))","v":"0"},{"$f":"IF(R117=\"\",\"0\",(IF(R117<AI117,1,IF(R117>#REF!,1,0))))","v":"0"},{"$f":"IF(S117=\"\",\"0\",(IF(S117<AI117,1,IF(S117>#REF!,1,0))))","v":"0"},{"$f":"IF(T117=\"\",\"0\",(IF(T117<AI117,1,IF(T117>#REF!,1,0))))","v":"0"}]
[null,null,null,null,null,null,null,null,null,null,null,null,null,null,null,null,null,null,null,null,null,"X","",null,null,null,null,0,0,{"$error":"#DIV/0!"},{"$error":"#DIV/0!"},{"$error":"#DIV/0!"},{"$error":"#DIV/0!"},{"$error":"#DIV/0!"},{"$error":"#DIV/0!"},{"$f":"IF(Q118=\"\",\"0\",(IF(P118<AI118,1,IF(Q118>#REF!,1,0))))","v":"0"},{"$f":"IF(R118=\"\",\"0\",(IF(R118<AI118,1,IF(R118>#REF!,1,0))))","v":"0"},{"$f":"IF(S118=\"\",\"0\",(IF(S118<AI118,1,IF(S118>#REF!,1,0))))","v":"0"},{"$f":"IF(T118=\"\",\"0\",(IF(T118<AI118,1,IF(T118>#REF!,1,0))))","v":"0"}]
[null,null,null,null,null,null,null,null,null,null,null,null,null,null,null,null,null,null,null,null,null,"X","",null,null,null,null,0,0,{"$error":"#DIV/0!"},{"$error":"#DIV/0!"},{"$error":"#DIV/0!"},{"$error":"#DIV/0!"},{"$error":"#DIV/0!"},{"$error":"#DIV/0!"},{"$f":"IF(Q119=\"\",\"0\",(IF(P119<AI119,1,IF(Q119>#REF!,1,0))))","v":"0"},{"$f":"IF(R119=\"\",\"0\",(IF(R119<AI119,1,IF(R119>#REF!,1,0))))","v":"0"},{"$f":"IF(S119=\"\",\"0\",(IF(S119<AI119,1,IF(S119>#REF!,1,0))))","v":"0"},{"$f":"IF(T119=\"\",\"0\",(IF(T119<AI119,1,IF(T119>#REF!,1,0))))","v":"0"}]
[null,null,null,null,null,null,null,null,null,null,null,null,null,null,null,null,null,null,null,null,null,"X","",null,null,null,null,0,0,{"$error":"#DIV/0!"},{"$error":"#DIV/0!"},{"$error":"#DIV/0!"},{"$error":"#DIV/0!"},{"$error":"#DIV/0!"},{"$error":"#DIV/0!"},{"$f":"IF(Q120=\"\",\"0\",(IF(P120<AI120,1,IF(Q120>#REF!,1,0))))","v":"0"},{"$f":"IF(R120=\"\",\"0\",(IF(R120<AI120,1,IF(R120>#REF!,1,0))))","v":"0"},{"$f":"IF(S120=\"\",\"0\",(IF(S120<AI120,1,IF(S120>#REF!,1,0))))","v":"0"},{"$f":"IF(T120=\"\",\"0\",(IF(T120<AI120,1,IF(T120>#REF!,1,0))))","v":"0"}]
[null,null,null,null,null,null,null,null,null,null,null,null,null,null,null,null,null,null,null,null,null,"X","",null,null,null,null,0,0,{"$error":"#DIV/0!"},{"$error":"#DIV/0!"},{"$error":"#DIV/0!"},{"$error":"#DIV/0!"},{"$error":"#DIV/0!"},{"$error":"#DIV/0!"},{"$f":"IF(Q121=\"\",\"0\",(IF(P121<AI121,1,IF(Q121>#REF!,1,0))))","v":"0"},{"$f":"IF(R121=\"\",\"0\",(IF(R121<AI121,1,IF(R121>#REF!,1,0))))","v":"0"},{"$f":"IF(S121=\"\",\"0\",(IF(S121<AI121,1,IF(S121>#REF!,1,0))))","v":"0"},{"$f":"IF(T121=\"\",\"0\",(IF(T121<AI121,1,IF(T121>#REF!,1,0))))","v":"0"}]
[null,null,null,null,null,null,null,null,null,null,null,null,null,null,null,null,null,null,null,null,null,"X","",null,null,null,null,0,0,{"$error":"#DIV/0!"},{"$error":"#DIV/0!"},{"$error":"#DIV/0!"},{"$error":"#DIV/0!"},{"$error":"#DIV/0!"},{"$error":"#DIV/0!"},{"$f":"IF(Q122=\"\",\"0\",(IF(P122<AI122,1,IF(Q122>#REF!,1,0))))","v":"0"},{"$f":"IF(R122=\"\",\"0\",(IF(R122<AI122,1,IF(R122>#REF!,1,0))))","v":"0"},{"$f":"IF(S122=\"\",\"0\",(IF(S122<AI122,1,IF(S122>#REF!,1,0))))","v":"0"},{"$f":"IF(T122=\"\",\"0\",(IF(T122<AI122,1,IF(T122>#REF!,1,0))))","v":"0"}]
[null,null,null,null,null,null,null,null,null,null,null,null,null,null,null,null,null,null,null,null,null,"X","",null,null,null,null,0,0,{"$error":"#DIV/0!"},{"$error":"#DIV/0!"},{"$error":"#DIV/0!"},{"$error":"#DIV/0!"},{"$error":"#DIV/0!"},{"$error":"#DIV/0!"},{"$f":"IF(Q123=\"\",\"0\",(IF(P123<AI123,1,IF(Q123>#REF!,1,0))))","v":"0"},{"$f":"IF(R123=\"\",\"0\",(IF(R123<AI123,1,IF(R123>#REF!,1,0))))","v":"0"},{"$f":"IF(S123=\"\",\"0\",(IF(S123<AI123,1,IF(S123>#REF!,1,0))))","v":"0"},{"$f":"IF(T123=\"\",\"0\",(IF(T123<AI123,1,IF(T123>#REF!,1,0))))","v":"0"}]
[null,null,null,null,null,null,null,null,null,null,null,null,null,null,null,null,null,null,null,null,null,"X","",null,null,null,null,0,0,{"$error":"#DIV/0!"},{"$error":"#DIV/0!"},{"$error":"#DIV/0!"},{"$error":"#DIV/0!"},{"$error":"#DIV/0!"},{"$error":"#DIV/0!"},{"$f":"IF(Q124=\"\",\"0\",(IF(P124<AI124,1,IF(Q124>#REF!,1,0))))","v":"0"},{"$f":"IF(R124=\"\",\"0\",(IF(R124<AI124,1,IF(R124>#REF!,1,0))))","v":"0"},{"$f":"IF(S124=\"\",\"0\",(IF(S124<AI124,1,IF(S124>#REF!,1,0))))","v":"0"},{"$f":"IF(T124=\"\",\"0\",(IF(T124<AI124,1,IF(T124>#REF!,1,0))))","v":"0"}]
[null,null,null,null,null,null,null,null,null,null,null,null,null,null,null,null,null,null,null,null,null,"X","",null,null,null,null,0,0,{"$error":"#DIV/0!"},{"$error":"#DIV/0!"},{"$error":"#DIV/0!"},{"$error":"#DIV/0!"},{"$error":"#DIV/0!"},{"$error":"#DIV/0!"},{"$f":"IF(Q125=\"\",\"0\",(IF(P125<AI125,1,IF(Q125>#REF!,1,0))))","v":"0"},{"$f":"IF(R125=\"\",\"0\",(IF(R125<AI125,1,IF(R125>#REF!,1,0))))","v":"0"},{"$f":"IF(S125=\"\",\"0\",(IF(S125<AI125,1,IF(S125>#REF!,1,0))))","v":"0"},{"$f":"IF(T125=\"\",\"0\",(IF(T125<AI125,1,IF(T125>#REF!,1,0))))","v":"0"}]
[null,null,null,null,null,null,null,null,null,null,null,null,null,null,null,null,null,null,null,null,null,"X","",null,null,null,null,0,0,{"$error":"#DIV/0!"},{"$error":"#DIV/0!"},{"$error":"#DIV/0!"},{"$error":"#DIV/0!"},{"$error":"#DIV/0!"},{"$error":"#DIV/0!"},{"$f":"IF(Q126=\"\",\"0\",(IF(P126<AI126,1,IF(Q126>#REF!,1,0))))","v":"0"},{"$f":"IF(R126=\"\",\"0\",(IF(R126<AI126,1,IF(R126>#REF!,1,0))))","v":"0"},{"$f":"IF(S126=\"\",\"0\",(IF(S126<AI126,1,IF(S126>#REF!,1,0))))","v":"0"},{"$f":"IF(T126=\"\",\"0\",(IF(T126<AI126,1,IF(T126>#REF!,1,0))))","v":"0"}]
[null,null,null,null,null,null,null,null,null,null,null,null,null,null,null,null,null,null,null,null,null,"X","",null,null,null,null,0,0,{"$error":"#DIV/0!"},{"$error":"#DIV/0!"},{"$error":"#DIV/0!"},{"$error":"#DIV/0!"},{"$error":"#DIV/0!"},{"$error":"#DIV/0!"},{"$f":"IF(Q127=\"\",\"0\",(IF(P127<AI127,1,IF(Q127>#REF!,1,0))))","v":"0"},{"$f":"IF(R127=\"\",\"0\",(IF(R127<AI127,1,IF(R127>#REF!,1,0))))","v":"0"},{"$f":"IF(S127=\"\",\"0\",(IF(S127<AI127,1,IF(S127>#REF!,1,0))))","v":"0"},{"$f":"IF(T127=\"\",\"0\",(IF(T127<AI127,1,IF(T127>#REF!,1,0))))","v":"0"}]
[null,null,null,null,null,null,null,null,null,null,null,null,null,null,null,null,null,null,null,null,null,"X","",null,null,null,null,0,0,{"$error":"#DIV/0!"},{"$error":"#DIV/0!"},{"$error":"#DIV/0!"},{"$error":"#DIV/0!"},{"$error":"#DIV/0!"},{"$error":"#DIV/0!"},{"$f":"IF(Q128=\"\",\"0\",(IF(P128<AI128,1,IF(Q128>#REF!,1,0))))","v":"0"},{"$f":"IF(R128=\"\",\"0\",(IF(R128<AI128,1,IF(R128>#REF!,1,0))))","v":"0"},{"$f":"IF(S128=\"\",\"0\",(IF(S128<AI128,1,IF(S128>#REF!,1,0))))","v":"0"},{"$f":"IF(T128=\"\",\"0\",(IF(T128<AI128,1,IF(T128>#REF!,1,0))))","v":"0"}]
[null,null,null,null,null,null,null,null,null,null,null,null,null,null,null,null,null,null,null,null,null,"X","",null,null,null,null,0,0,{"$error":"#DIV/0!"},{"$error":"#DIV/0!"},{"$error":"#DIV/0!"},{"$error":"#DIV/0!"},{"$error":"#DIV/0!"},{"$error":"#DIV/0!"},{"$f":"IF(Q129=\"\",\"0\",(IF(P129<AI129,1,IF(Q129>#REF!,1,0))))","v":"0"},{"$f":"IF(R129=\"\",\"0\",(IF(R129<AI129,1,IF(R129>#REF!,1,0))))","v":"0"},{"$f":"IF(S129=\"\",\"0\",(IF(S129<AI129,1,IF(S129>#REF!,1,0))))","v":"0"},{"$f":"IF(T129=\"\",\"0\",(IF(T129<AI129,1,IF(T129>#REF!,1,0))))","v":"0"}]
[null,null,null,null,null,null,null,null,null,null,null,null,null,null,null,null,null,null,null,null,null,"X","",null,null,null,null,0,0,{"$error":"#DIV/0!"},{"$error":"#DIV/0!"},{"$error":"#DIV/0!"},{"$error":"#DIV/0!"},{"$error":"#DIV/0!"},{"$error":"#DIV/0!"},{"$f":"IF(Q130=\"\",\"0\",(IF(P130<AI130,1,IF(Q130>#REF!,1,0))))","v":"0"},{"$f":"IF(R130=\"\",\"0\",(IF(R130<AI130,1,IF(R130>#REF!,1,0))))","v":"0"},{"$f":"IF(S130=\"\",\"0\",(IF(S130<AI130,1,IF(S130>#REF!,1,0))))","v":"0"},{"$f":"IF(T130=\"\",\"0\",(IF(T130<AI130,1,IF(T130>#REF!,1,0))))","v":"0"}]
[null,null,null,null,null,null,null,null,null,null,null,null,null,null,null,null,null,null,null,null,null,"X","",null,null,null,null,0,0,{"$error":"#DIV/0!"},{"$error":"#DIV/0!"},{"$error":"#DIV/0!"},{"$error":"#DIV/0!"},{"$error":"#DIV/0!"},{"$error":"#DIV/0!"},{"$f":"IF(Q131=\"\",\"0\",(IF(P131<AI131,1,IF(Q131>#REF!,1,0))))","v":"0"},{"$f":"IF(R131=\"\",\"0\",(IF(R131<AI131,1,IF(R131>#REF!,1,0))))","v":"0"},{"$f":"IF(S131=\"\",\"0\",(IF(S131<AI131,1,IF(S131>#REF!,1,0))))","v":"0"},{"$f":"IF(T131=\"\",\"0\",(IF(T131<AI131,1,IF(T131>#REF!,1,0))))","v":"0"}]
[null,null,null,null,null,null,null,null,null,null,null,null,null,null,null,null,null,null,null,null,null,"X","",null,null,null,null,0,0,{"$error":"#DIV/0!"},{"$error":"#DIV/0!"},{"$error":"#DIV/0!"},{"$error":"#DIV/0!"},{"$error":"#DIV/0!"},{"$error":"#DIV/0!"},{"$f":"IF(Q132=\"\",\"0\",(IF(P132<AI132,1,IF(Q132>#REF!,1,0))))","v":"0"},{"$f":"IF(R132=\"\",\"0\",(IF(R132<AI132,1,IF(R132>#REF!,1,0))))","v":"0"},{"$f":"IF(S132=\"\",\"0\",(IF(S132<AI132,1,IF(S132>#REF!,1,0))))","v":"0"},{"$f":"IF(T132=\"\",\"0\",(IF(T132<AI132,1,IF(T132>#REF!,1,0))))","v":"0"}]
[null,null,null,null,null,null,null,null,null,null,null,null,null,null,null,null,null,null,null,null,null,"X","",null,null,null,null,0,0,{"$error":"#DIV/0!"},{"$error":"#DIV/0!"},{"$error":"#DIV/0!"},{"$error":"#DIV/0!"},{"$error":"#DIV/0!"},{"$error":"#DIV/0!"},{"$f":"IF(Q133=\"\",\"0\",(IF(P133<AI133,1,IF(Q133>#REF!,1,0))))","v":"0"},{"$f":"IF(R133=\"\",\"0\",(IF(R133<AI133,1,IF(R133>#REF!,1,0))))","v":"0"},{"$f":"IF(S133=\"\",\"0\",(IF(S133<AI133,1,IF(S133>#REF!,1,0))))","v":"0"},{"$f":"IF(T133=\"\",\"0\",(IF(T133<AI133,1,IF(T133>#REF!,1,0))))","v":"0"}]
[null,null,null,null,null,null,null,null,null,null,null,null,null,null,null,null,null,null,null,null,null,"X","",null,null,null,null,0,0,{"$error":"#DIV/0!"},{"$error":"#DIV/0!"},{"$error":"#DIV/0!"},{"$error":"#DIV/0!"},{"$error":"#DIV/0!"},{"$error":"#DIV/0!"},{"$f":"IF(Q134=\"\",\"0\",(IF(P134<AI134,1,IF(Q134>#REF!,1,0))))","v":"0"},{"$f":"IF(R134=\"\",\"0\",(IF(R134<AI134,1,IF(R134>#REF!,1,0))))","v":"0"},{"$f":"IF(S134=\"\",\"0\",(IF(S134<AI134,1,IF(S134>#REF!,1,0))))","v":"0"},{"$f":"IF(T134=\"\",\"0\",(IF(T134<AI134,1,IF(T134>#REF!,1,0))))","v":"0"}]
[null,null,null,null,null,null,null,null,null,null,null,null,null,null,null,null,null,null,null,null,null,"X","",null,null,null,null,0,0,{"$error":"#DIV/0!"},{"$error":"#DIV/0!"},{"$error":"#DIV/0!"},{"$error":"#DIV/0!"},{"$error":"#DIV/0!"},{"$error":"#DIV/0!"},{"$f":"IF(Q135=\"\",\"0\",(IF(P135<AI135,1,IF(Q135>#REF!,1,0))))","v":"0"},{"$f":"IF(R135=\"\",\"0\",(IF(R135<AI135,1,IF(R135>#REF!,1,0))))","v":"0"},{"$f":"IF(S135=\"\",\"0\",(IF(S135<AI135,1,IF(S135>#REF!,1,0))))","v":"0"},{"$f":"IF(T135=\"\",\"0\",(IF(T135<AI135,1,IF(T135>#REF!,1,0))))","v":"0"}]
[null,null,null,null,null,null,null,null,null,null,null,null,null,null,null,null,null,null,null,null,null,"X","",null,null,null,null,0,0,{"$error":"#DIV/0!"},{"$error":"#DIV/0!"},{"$error":"#DIV/0!"},{"$error":"#DIV/0!"},{"$error":"#DIV/0!"},{"$error":"#DIV/0!"},{"$f":"IF(Q136=\"\",\"0\",(IF(P136<AI136,1,IF(Q136>#REF!,1,0))))","v":"0"},{"$f":"IF(R136=\"\",\"0\",(IF(R136<AI136,1,IF(R136>#REF!,1,0))))","v":"0"},{"$f":"IF(S136=\"\",\"0\",(IF(S136<AI136,1,IF(S136>#REF!,1,0))))","v":"0"},{"$f":"IF(T136=\"\",\"0\",(IF(T136<AI136,1,IF(T136>#REF!,1,0))))","v":"0"}]
[null,null,null,null,null,null,null,null,null,null,null,null,null,null,null,null,null,null,null,null,null,"X","",null,null,null,null,0,0,{"$error":"#DIV/0!"},{"$error":"#DIV/0!"},{"$error":"#DIV/0!"},{"$error":"#DIV/0!"},{"$error":"#DIV/0!"},{"$error":"#DIV/0!"},{"$f":"IF(Q137=\"\",\"0\",(IF(P137<AI137,1,IF(Q137>#REF!,1,0))))","v":"0"},{"$f":"IF(R137=\"\",\"0\",(IF(R137<AI137,1,IF(R137>#REF!,1,0))))","v":"0"},{"$f":"IF(S137=\"\",\"0\",(IF(S137<AI137,1,IF(S137>#REF!,1,0))))","v":"0"},{"$f":"IF(T137=\"\",\"0\",(IF(T137<AI137,1,IF(T137>#REF!,1,0))))","v":"0"}]
[null,null,null,null,null,null,null,null,null,null,null,null,null,null,null,null,null,null,null,null,null,"X","",null,null,null,null,0,0,{"$error":"#DIV/0!"},{"$error":"#DIV/0!"},{"$error":"#DIV/0!"},{"$error":"#DIV/0!"},{"$error":"#DIV/0!"},{"$error":"#DIV/0!"},{"$f":"IF(Q138=\"\",\"0\",(IF(P138<AI138,1,IF(Q138>#REF!,1,0))))","v":"0"},{"$f":"IF(R138=\"\",\"0\",(IF(R138<AI138,1,IF(R138>#REF!,1,0))))","v":"0"},{"$f":"IF(S138=\"\",\"0\",(IF(S138<AI138,1,IF(S138>#REF!,1,0))))","v":"0"},{"$f":"IF(T138=\"\",\"0\",(IF(T138<AI138,1,IF(T138>#REF!,1,0))))","v":"0"}]
[null,null,null,null,null,null,null,null,null,null,null,null,null,null,null,null,null,null,null,null,null,"X","",null,null,null,null,0,0,{"$error":"#DIV/0!"},{"$error":"#DIV/0!"},{"$error":"#DIV/0!"},{"$error":"#DIV/0!"},{"$error":"#DIV/0!"},{"$error":"#DIV/0!"},{"$f":"IF(Q139=\"\",\"0\",(IF(P139<AI139,1,IF(Q139>#REF!,1,0))))","v":"0"},{"$f":"IF(R139=\"\",\"0\",(IF(R139<AI139,1,IF(R139>#REF!,1,0))))","v":"0"},{"$f":"IF(S139=\"\",\"0\",(IF(S139<AI139,1,IF(S139>#REF!,1,0))))","v":"0"},{"$f":"IF(T139=\"\",\"0\",(IF(T139<AI139,1,IF(T139>#REF!,1,0))))","v":"0"}]
[null,null,null,null,null,null,null,null,null,null,null,null,null,null,null,null,null,null,null,null,null,"X","",null,null,null,null,0,0,{"$error":"#DIV/0!"},{"$error":"#DIV/0!"},{"$error":"#DIV/0!"},{"$error":"#DIV/0!"},{"$error":"#DIV/0!"},{"$error":"#DIV/0!"},{"$f":"IF(Q140=\"\",\"0\",(IF(P140<AI140,1,IF(Q140>#REF!,1,0))))","v":"0"},{"$f":"IF(R140=\"\",\"0\",(IF(R140<AI140,1,IF(R140>#REF!,1,0))))","v":"0"},{"$f":"IF(S140=\"\",\"0\",(IF(S140<AI140,1,IF(S140>#REF!,1,0))))","v":"0"},{"$f":"IF(T140=\"\",\"0\",(IF(T140<AI140,1,IF(T140>#REF!,1,0))))","v":"0"}]
[null,null,null,null,null,null,null,null,null,null,null,null,null,null,null,null,null,null,null,null,null,"X","",null,null,null,null,0,0,{"$error":"#DIV/0!"},{"$error":"#DIV/0!"},{"$error":"#DIV/0!"},{"$error":"#DIV/0!"},{"$error":"#DIV/0!"},{"$error":"#DIV/0!"},{"$f":"IF(Q141=\"\",\"0\",(IF(P141<AI141,1,IF(Q141>#REF!,1,0))))","v":"0"},{"$f":"IF(R141=\"\",\"0\",(IF(R141<AI141,1,IF(R141>#REF!,1,0))))","v":"0"},{"$f":"IF(S141=\"\",\"0\",(IF(S141<AI141,1,IF(S141>#REF!,1,0))))","v":"0"},{"$f":"IF(T141=\"\",\"0\",(IF(T141<AI141,1,IF(T141>#REF!,1,0))))","v":"0"}]
[null,null,null,null,null,null,null,null,null,null,null,null,null,null,null,null,null,null,null,null,null,"X","",null,null,null,null,0,0,{"$error":"#DIV/0!"},{"$error":"#DIV/0!"},{"$error":"#DIV/0!"},{"$error":"#DIV/0!"},{"$error":"#DIV/0!"},{"$error":"#DIV/0!"},{"$f":"IF(Q142=\"\",\"0\",(IF(P142<AI142,1,IF(Q142>#REF!,1,0))))","v":"0"},{"$f":"IF(R142=\"\",\"0\",(IF(R142<AI142,1,IF(R142>#REF!,1,0))))","v":"0"},{"$f":"IF(S142=\"\",\"0\",(IF(S142<AI142,1,IF(S142>#REF!,1,0))))","v":"0"},{"$f":"IF(T142=\"\",\"0\",(IF(T142<AI142,1,IF(T142>#REF!,1,0))))","v":"0"}]
[null,null,null,null,null,null,null,null,null,null,null,null,null,null,null,null,null,null,null,null,null,{"$f":"IF(I143=\"Ref\",\"\",(IF(I143=\"Basic\",\"\",(IF(P143=\"P\",\"X\",(IF(P143=\"F\",\"\",IF(MAX(P143:T143)>(H143+J143),\"\",IF(MIN(P143:T143)<(H143+I143),\"\",\"X\")))))))))","v":"X"},{"$f":"IF(I143=\"Ref\",\"\",(IF(I143=\"Basic\",\"\",(IF(P143=\"P\",\"\",IF(P143=\"F\",\"X\",IF(MAX(P143:T143)>(H143+J143),\"X\",IF(MIN(P143:T143)<(H143+I143),\"X\",\"\"))))))))","v":""},null,null,null,null,0,0,{"$error":"#DIV/0!"},{"$error":"#DIV/0!"},{"$f":"(AB143-AD143)/(3*AE143)","v":{"$error":"#DIV/0!"}},{"$f":"(AD143-AC143)/(3*AE143)","v":{"$error":"#DIV/0!"}},{"$f":"(AB143-AC143)/(6*AE143)","v":{"$error":"#DIV/0!"}},{"$error":"#DIV/0!"},{"$f":"IF(Q143=\"\",\"0\",(IF(P143<AI143,1,IF(Q143>#REF!,1,0))))","v":"0"},{"$f":"IF(R143=\"\",\"0\",(IF(R143<AI143,1,IF(R143>#REF!,1,0))))","v":"0"},{"$f":"IF(S143=\"\",\"0\",(IF(S143<AI143,1,IF(S143>#REF!,1,0))))","v":"0"},{"$f":"IF(T143=\"\",\"0\",(IF(T143<AI143,1,IF(T143>#REF!,1,0))))","v":"0"}]
[null,null,null,null,null,null,null,null,null,null,null,null,null,null,null,null,null,null,null,null,null,"X","",null,null,null,null,{"$f":"H144+J144","v":0},{"$f":"H144+I144","v":0},{"$f":"AVERAGE(P144:T144)","v":{"$error":"#DIV/0!"}},{"$f":"_xlfn.STDEV.S(P144,Q144,R144,S144,T144)","v":{"$error":"#DIV/0!"}},{"$error":"#DIV/0!"},{"$error":"#DIV/0!"},{"$error":"#DIV/0!"},{"$f":"MIN(AF144, AG144)","v":{"$error":"#DIV/0!"}},{"$f":"IF(Q144=\"\",\"0\",(IF(P144<AI144,1,IF(Q144>#REF!,1,0))))","v":"0"},{"$f":"IF(R144=\"\",\"0\",(IF(R144<AI144,1,IF(R144>#REF!,1,0))))","v":"0"},{"$f":"IF(S144=\"\",\"0\",(IF(S144<AI144,1,IF(S144>#REF!,1,0))))","v":"0"},{"$f":"IF(T144=\"\",\"0\",(IF(T144<AI144,1,IF(T144>#REF!,1,0))))","v":"0"}]
[null,null,null,null,null,null,null,null,null,null,null,null,null,null,null,null,null,null,null,null,null,"X","",null,null,null,null,0,0,{"$error":"#DIV/0!"},{"$error":"#DIV/0!"},{"$error":"#DIV/0!"},{"$error":"#DIV/0!"},{"$error":"#DIV/0!"},{"$error":"#DIV/0!"},{"$f":"IF(Q145=\"\",\"0\",(IF(P145<AI145,1,IF(Q145>#REF!,1,0))))","v":"0"},{"$f":"IF(R145=\"\",\"0\",(IF(R145<AI145,1,IF(R145>#REF!,1,0))))","v":"0"},{"$f":"IF(S145=\"\",\"0\",(IF(S145<AI145,1,IF(S145>#REF!,1,0))))","v":"0"},{"$f":"IF(T145=\"\",\"0\",(IF(T145<AI145,1,IF(T145>#REF!,1,0))))","v":"0"}]
[null,null,null,null,null,null,null,null,null,null,null,null,null,null,null,null,null,null,null,null,null,"X","",null,null,null,null,0,0,{"$error":"#DIV/0!"},{"$error":"#DIV/0!"},{"$error":"#DIV/0!"},{"$error":"#DIV/0!"},{"$error":"#DIV/0!"},{"$error":"#DIV/0!"},{"$f":"IF(Q146=\"\",\"0\",(IF(P146<AI146,1,IF(Q146>#REF!,1,0))))","v":"0"},{"$f":"IF(R146=\"\",\"0\",(IF(R146<AI146,1,IF(R146>#REF!,1,0))))","v":"0"},{"$f":"IF(S146=\"\",\"0\",(IF(S146<AI146,1,IF(S146>#REF!,1,0))))","v":"0"},{"$f":"IF(T146=\"\",\"0\",(IF(T146<AI146,1,IF(T146>#REF!,1,0))))","v":"0"}]
[null,null,null,null,null,null,null,null,null,null,null,null,null,null,null,null,null,null,null,null,null,"X","",null,null,null,null,0,0,{"$error":"#DIV/0!"},{"$error":"#DIV/0!"},{"$error":"#DIV/0!"},{"$error":"#DIV/0!"},{"$error":"#DIV/0!"},{"$error":"#DIV/0!"},{"$f":"IF(Q147=\"\",\"0\",(IF(P147<AI147,1,IF(Q147>#REF!,1,0))))","v":"0"},{"$f":"IF(R147=\"\",\"0\",(IF(R147<AI147,1,IF(R147>#REF!,1,0))))","v":"0"},{"$f":"IF(S147=\"\",\"0\",(IF(S147<AI147,1,IF(S147>#REF!,1,0))))","v":"0"},{"$f":"IF(T147=\"\",\"0\",(IF(T147<AI147,1,IF(T147>#REF!,1,0))))","v":"0"}]
[null,null,null,null,null,null,null,null,null,null,null,null,null,null,null,null,null,null,null,null,null,"X","",null,null,null,null,0,0,{"$error":"#DIV/0!"},{"$error":"#DIV/0!"},{"$error":"#DIV/0!"},{"$error":"#DIV/0!"},{"$error":"#DIV/0!"},{"$error":"#DIV/0!"},{"$f":"IF(Q148=\"\",\"0\",(IF(P148<AI148,1,IF(Q148>#REF!,1,0))))","v":"0"},{"$f":"IF(R148=\"\",\"0\",(IF(R148<AI148,1,IF(R148>#REF!,1,0))))","v":"0"},{"$f":"IF(S148=\"\",\"0\",(IF(S148<AI148,1,IF(S148>#REF!,1,0))))","v":"0"},{"$f":"IF(T148=\"\",\"0\",(IF(T148<AI148,1,IF(T148>#REF!,1,0))))","v":"0"}]
[null,null,null,null,null,null,null,null,null,null,null,null,null,null,null,null,null,null,null,null,null,"X","",null,null,null,null,0,0,{"$error":"#DIV/0!"},{"$error":"#DIV/0!"},{"$error":"#DIV/0!"},{"$error":"#DIV/0!"},{"$error":"#DIV/0!"},{"$error":"#DIV/0!"},{"$f":"IF(Q149=\"\",\"0\",(IF(P149<AI149,1,IF(Q149>#REF!,1,0))))","v":"0"},{"$f":"IF(R149=\"\",\"0\",(IF(R149<AI149,1,IF(R149>#REF!,1,0))))","v":"0"},{"$f":"IF(S149=\"\",\"0\",(IF(S149<AI149,1,IF(S149>#REF!,1,0))))","v":"0"},{"$f":"IF(T149=\"\",\"0\",(IF(T149<AI149,1,IF(T149>#REF!,1,0))))","v":"0"}]
[null,null,null,null,null,null,null,null,null,null,null,null,null,null,null,null,null,null,null,null,null,"X","",null,null,null,null,0,0,{"$error":"#DIV/0!"},{"$error":"#DIV/0!"},{"$error":"#DIV/0!"},{"$error":"#DIV/0!"},{"$error":"#DIV/0!"},{"$error":"#DIV/0!"},{"$f":"IF(Q150=\"\",\"0\",(IF(P150<AI150,1,IF(Q150>#REF!,1,0))))","v":"0"},{"$f":"IF(R150=\"\",\"0\",(IF(R150<AI150,1,IF(R150>#REF!,1,0))))","v":"0"},{"$f":"IF(S150=\"\",\"0\",(IF(S150<AI150,1,IF(S150>#REF!,1,0))))","v":"0"},{"$f":"IF(T150=\"\",\"0\",(IF(T150<AI150,1,IF(T150>#REF!,1,0))))","v":"0"}]
[null,null,null,null,null,null,null,null,null,null,null,null,null,null,null,null,null,null,null,null,null,"X","",null,null,null,null,0,0,{"$error":"#DIV/0!"},{"$error":"#DIV/0!"},{"$error":"#DIV/0!"},{"$error":"#DIV/0!"},{"$error":"#DIV/0!"},{"$error":"#DIV/0!"},{"$f":"IF(Q151=\"\",\"0\",(IF(P151<AI151,1,IF(Q151>#REF!,1,0))))","v":"0"},{"$f":"IF(R151=\"\",\"0\",(IF(R151<AI151,1,IF(R151>#REF!,1,0))))","v":"0"},{"$f":"IF(S151=\"\",\"0\",(IF(S151<AI151,1,IF(S151>#REF!,1,0))))","v":"0"},{"$f":"IF(T151=\"\",\"0\",(IF(T151<AI151,1,IF(T151>#REF!,1,0))))","v":"0"}]
[null,null,null,null,null,null,null,null,null,null,null,null,null,null,null,null,null,null,null,null,null,"X","",null,null,null,null,0,0,{"$error":"#DIV/0!"},{"$error":"#DIV/0!"},{"$error":"#DIV/0!"},{"$error":"#DIV/0!"},{"$error":"#DIV/0!"},{"$error":"#DIV/0!"},{"$f":"IF(Q152=\"\",\"0\",(IF(P152<AI152,1,IF(Q152>#REF!,1,0))))","v":"0"},{"$f":"IF(R152=\"\",\"0\",(IF(R152<AI152,1,IF(R152>#REF!,1,0))))","v":"0"},{"$f":"IF(S152=\"\",\"0\",(IF(S152<AI152,1,IF(S152>#REF!,1,0))))","v":"0"},{"$f":"IF(T152=\"\",\"0\",(IF(T152<AI152,1,IF(T152>#REF!,1,0))))","v":"0"}]
[null,null,null,null,null,null,null,null,null,null,null,null,null,null,null,null,null,null,null,null,null,"X","",null,null,null,null,0,0,{"$error":"#DIV/0!"},{"$error":"#DIV/0!"},{"$error":"#DIV/0!"},{"$error":"#DIV/0!"},{"$error":"#DIV/0!"},{"$error":"#DIV/0!"},{"$f":"IF(Q153=\"\",\"0\",(IF(P153<AI153,1,IF(Q153>#REF!,1,0))))","v":"0"},{"$f":"IF(R153=\"\",\"0\",(IF(R153<AI153,1,IF(R153>#REF!,1,0))))","v":"0"},{"$f":"IF(S153=\"\",\"0\",(IF(S153<AI153,1,IF(S153>#REF!,1,0))))","v":"0"},{"$f":"IF(T153=\"\",\"0\",(IF(T153<AI153,1,IF(T153>#REF!,1,0))))","v":"0"}]
[null,null,null,null,null,null,null,null,null,null,null,null,null,null,null,null,null,null,null,null,null,"X","",null,null,null,null,0,0,{"$error":"#DIV/0!"},{"$error":"#DIV/0!"},{"$error":"#DIV/0!"},{"$error":"#DIV/0!"},{"$error":"#DIV/0!"},{"$error":"#DIV/0!"},{"$f":"IF(Q154=\"\",\"0\",(IF(P154<AI154,1,IF(Q154>#REF!,1,0))))","v":"0"},{"$f":"IF(R154=\"\",\"0\",(IF(R154<AI154,1,IF(R154>#REF!,1,0))))","v":"0"},{"$f":"IF(S154=\"\",\"0\",(IF(S154<AI154,1,IF(S154>#REF!,1,0))))","v":"0"},{"$f":"IF(T154=\"\",\"0\",(IF(T154<AI154,1,IF(T154>#REF!,1,0))))","v":"0"}]
[null,null,null,null,null,null,null,null,null,null,null,null,null,null,null,null,null,null,null,null,null,"X","",null,null,null,null,0,0,{"$error":"#DIV/0!"},{"$error":"#DIV/0!"},{"$error":"#DIV/0!"},{"$error":"#DIV/0!"},{"$error":"#DIV/0!"},{"$error":"#DIV/0!"},{"$f":"IF(Q155=\"\",\"0\",(IF(P155<AI155,1,IF(Q155>#REF!,1,0))))","v":"0"},{"$f":"IF(R155=\"\",\"0\",(IF(R155<AI155,1,IF(R155>#REF!,1,0))))","v":"0"},{"$f":"IF(S155=\"\",\"0\",(IF(S155<AI155,1,IF(S155>#REF!,1,0))))","v":"0"},{"$f":"IF(T155=\"\",\"0\",(IF(T155<AI155,1,IF(T155>#REF!,1,0))))","v":"0"}]
[null,null,null,null,null,null,null,null,null,null,null,null,null,null,null,null,null,null,null,null,null,"X","",null,null,null,null,0,0,{"$error":"#DIV/0!"},{"$error":"#DIV/0!"},{"$error":"#DIV/0!"},{"$error":"#DIV/0!"},{"$error":"#DIV/0!"},{"$error":"#DIV/0!"},{"$f":"IF(Q156=\"\",\"0\",(IF(P156<AI156,1,IF(Q156>#REF!,1,0))))","v":"0"},{"$f":"IF(R156=\"\",\"0\",(IF(R156<AI156,1,IF(R156>#REF!,1,0))))","v":"0"},{"$f":"IF(S156=\"\",\"0\",(IF(S156<AI156,1,IF(S156>#REF!,1,0))))","v":"0"},{"$f":"IF(T156=\"\",\"0\",(IF(T156<AI156,1,IF(T156>#REF!,1,0))))","v":"0"}]
[null,null,null,null,null,null,null,null,null,null,null,null,null,null,null,null,null,null,null,null,null,"X","",null,null,null,null,0,0,{"$error":"#DIV/0!"},{"$error":"#DIV/0!"},{"$error":"#DIV/0!"},{"$error":"#DIV/0!"},{"$error":"#DIV/0!"},{"$error":"#DIV/0!"},{"$f":"IF(Q157=\"\",\"0\",(IF(P157<AI157,1,IF(Q157>#REF!,1,0))))","v":"0"},{"$f":"IF(R157=\"\",\"0\",(IF(R157<AI157,1,IF(R157>#REF!,1,0))))","v":"0"},{"$f":"IF(S157=\"\",\"0\",(IF(S157<AI157,1,IF(S157>#REF!,1,0))))","v":"0"},{"$f":"IF(T157=\"\",\"0\",(IF(T157<AI157,1,IF(T157>#REF!,1,0))))","v":"0"}]
[null,null,null,null,null,null,null,null,null,null,null,null,null,null,null,null,null,null,null,null,null,"X","",null,null,null,null,0,0,{"$error":"#DIV/0!"},{"$error":"#DIV/0!"},{"$error":"#DIV/0!"},{"$error":"#DIV/0!"},{"$error":"#DIV/0!"},{"$error":"#DIV/0!"},{"$f":"IF(Q158=\"\",\"0\",(IF(P158<AI158,1,IF(Q158>#REF!,1,0))))","v":"0"},{"$f":"IF(R158=\"\",\"0\",(IF(R158<AI158,1,IF(R158>#REF!,1,0))))","v":"0"},{"$f":"IF(S158=\"\",\"0\",(IF(S158<AI158,1,IF(S158>#REF!,1,0))))","v":"0"},{"$f":"IF(T158=\"\",\"0\",(IF(T158<AI158,1,IF(T158>#REF!,1,0))))","v":"0"}]
[null,null,null,null,null,null,null,null,null,null,null,null,null,null,null,null,null,null,null,null,null,"X","",null,null,null,null,0,0,{"$error":"#DIV/0!"},{"$error":"#DIV/0!"},{"$error":"#DIV/0!"},{"$error":"#DIV/0!"},{"$error":"#DIV/0!"},{"$error":"#DIV/0!"},{"$f":"IF(Q159=\"\",\"0\",(IF(P159<AI159,1,IF(Q159>#REF!,1,0))))","v":"0"},{"$f":"IF(R159=\"\",\"0\",(IF(R159<AI159,1,IF(R159>#REF!,1,0))))","v":"0"},{"$f":"IF(S159=\"\",\"0\",(IF(S159<AI159,1,IF(S159>#REF!,1,0))))","v":"0"},{"$f":"IF(T159=\"\",\"0\",(IF(T159<AI159,1,IF(T159>#REF!,1,0))))","v":"0"}]
[null,null,null,null,null,null,null,null,null,null,null,null,null,null,null,null,null,null,null,null,null,"X","",null,null,null,null,0,0,{"$error":"#DIV/0!"},{"$error":"#DIV/0!"},{"$error":"#DIV/0!"},{"$error":"#DIV/0!"},{"$error":"#DIV/0!"},{"$error":"#DIV/0!"},{"$f":"IF(Q160=\"\",\"0\",(IF(P160<AI160,1,IF(Q160>#REF!,1,0))))","v":"0"},{"$f":"IF(R160=\"\",\"0\",(IF(R160<AI160,1,IF(R160>#REF!,1,0))))","v":"0"},{"$f":"IF(S160=\"\",\"0\",(IF(S160<AI160,1,IF(S160>#REF!,1,0))))","v":"0"},{"$f":"IF(T160=\"\",\"0\",(IF(T160<AI160,1,IF(T160>#REF!,1,0))))","v":"0"}]
[null,null,null,null,null,null,null,null,null,null,null,null,null,null,null,null,null,null,null,null,null,"X","",null,null,null,null,0,0,{"$error":"#DIV/0!"},{"$error":"#DIV/0!"},{"$error":"#DIV/0!"},{"$error":"#DIV/0!"},{"$error":"#DIV/0!"},{"$error":"#DIV/0!"},{"$f":"IF(Q161=\"\",\"0\",(IF(P161<AI161,1,IF(Q161>#REF!,1,0))))","v":"0"},{"$f":"IF(R161=\"\",\"0\",(IF(R161<AI161,1,IF(R161>#REF!,1,0))))","v":"0"},{"$f":"IF(S161=\"\",\"0\",(IF(S161<AI161,1,IF(S161>#REF!,1,0))))","v":"0"},{"$f":"IF(T161=\"\",\"0\",(IF(T161<AI161,1,IF(T161>#REF!,1,0))))","v":"0"}]
[null,null,null,null,null,null,null,null,null,null,null,null,null,null,null,null,null,null,null,null,null,"X","",null,null,null,null,0,0,{"$error":"#DIV/0!"},{"$error":"#DIV/0!"},{"$error":"#DIV/0!"},{"$error":"#DIV/0!"},{"$error":"#DIV/0!"},{"$error":"#DIV/0!"},{"$f":"IF(Q162=\"\",\"0\",(IF(P162<AI162,1,IF(Q162>#REF!,1,0))))","v":"0"},{"$f":"IF(R162=\"\",\"0\",(IF(R162<AI162,1,IF(R162>#REF!,1,0))))","v":"0"},{"$f":"IF(S162=\"\",\"0\",(IF(S162<AI162,1,IF(S162>#REF!,1,0))))","v":"0"},{"$f":"IF(T162=\"\",\"0\",(IF(T162<AI162,1,IF(T162>#REF!,1,0))))","v":"0"}]
[null,null,null,null,null,null,null,null,null,null,null,null,null,null,null,null,null,null,null,null,null,"X","",null,null,null,null,0,0,{"$error":"#DIV/0!"},{"$error":"#DIV/0!"},{"$error":"#DIV/0!"},{"$error":"#DIV/0!"},{"$error":"#DIV/0!"},{"$error":"#DIV/0!"},{"$f":"IF(Q163=\"\",\"0\",(IF(P163<AI163,1,IF(Q163>#REF!,1,0))))","v":"0"},{"$f":"IF(R163=\"\",\"0\",(IF(R163<AI163,1,IF(R163>#REF!,1,0))))","v":"0"},{"$f":"IF(S163=\"\",\"0\",(IF(S163<AI163,1,IF(S163>#REF!,1,0))))","v":"0"},{"$f":"IF(T163=\"\",\"0\",(IF(T163<AI163,1,IF(T163>#REF!,1,0))))","v":"0"}]
[null,null,null,null,null,null,null,null,null,null,null,null,null,null,null,null,null,null,null,null,null,"X","",null,null,null,null,0,0,{"$error":"#DIV/0!"},{"$error":"#DIV/0!"},{"$error":"#DIV/0!"},{"$error":"#DIV/0!"},{"$error":"#DIV/0!"},{"$error":"#DIV/0!"},{"$f":"IF(Q164=\"\",\"0\",(IF(P164<AI164,1,IF(Q164>#REF!,1,0))))","v":"0"},{"$f":"IF(R164=\"\",\"0\",(IF(R164<AI164,1,IF(R164>#REF!,1,0))))","v":"0"},{"$f":"IF(S164=\"\",\"0\",(IF(S164<AI164,1,IF(S164>#REF!,1,0))))","v":"0"},{"$f":"IF(T164=\"\",\"0\",(IF(T164<AI164,1,IF(T164>#REF!,1,0))))","v":"0"}]
[null,null,null,null,null,null,null,null,null,null,null,null,null,null,null,null,null,null,null,null,null,"X","",null,null,null,null,0,0,{"$error":"#DIV/0!"},{"$error":"#DIV/0!"},{"$error":"#DIV/0!"},{"$error":"#DIV/0!"},{"$error":"#DIV/0!"},{"$error":"#DIV/0!"},{"$f":"IF(Q165=\"\",\"0\",(IF(P165<AI165,1,IF(Q165>#REF!,1,0))))","v":"0"},{"$f":"IF(R165=\"\",\"0\",(IF(R165<AI165,1,IF(R165>#REF!,1,0))))","v":"0"},{"$f":"IF(S165=\"\",\"0\",(IF(S165<AI165,1,IF(S165>#REF!,1,0))))","v":"0"},{"$f":"IF(T165=\"\",\"0\",(IF(T165<AI165,1,IF(T165>#REF!,1,0))))","v":"0"}]
[null,null,null,null,null,null,null,null,null,null,null,null,null,null,null,null,null,null,null,null,null,"X","",null,null,null,null,0,0,{"$error":"#DIV/0!"},{"$error":"#DIV/0!"},{"$error":"#DIV/0!"},{"$error":"#DIV/0!"},{"$error":"#DIV/0!"},{"$error":"#DIV/0!"},{"$f":"IF(Q166=\"\",\"0\",(IF(P166<AI166,1,IF(Q166>#REF!,1,0))))","v":"0"},{"$f":"IF(R166=\"\",\"0\",(IF(R166<AI166,1,IF(R166>#REF!,1,0))))","v":"0"},{"$f":"IF(S166=\"\",\"0\",(IF(S166<AI166,1,IF(S166>#REF!,1,0))))","v":"0"},{"$f":"IF(T166=\"\",\"0\",(IF(T166<AI166,1,IF(T166>#REF!,1,0))))","v":"0"}]
[null,null,null,null,null,null,null,null,null,null,null,null,null,null,null,null,null,null,null,null,null,"X","",null,null,null,null,0,0,{"$error":"#DIV/0!"},{"$error":"#DIV/0!"},{"$error":"#DIV/0!"},{"$error":"#DIV/0!"},{"$error":"#DIV/0!"},{"$error":"#DIV/0!"},{"$f":"IF(Q167=\"\",\"0\",(IF(P167<AI167,1,IF(Q167>#REF!,1,0))))","v":"0"},{"$f":"IF(R167=\"\",\"0\",(IF(R167<AI167,1,IF(R167>#REF!,1,0))))","v":"0"},{"$f":"IF(S167=\"\",\"0\",(IF(S167<AI167,1,IF(S167>#REF!,1,0))))","v":"0"},{"$f":"IF(T167=\"\",\"0\",(IF(T167<AI167,1,IF(T167>#REF!,1,0))))","v":"0"}]
[null,null,null,null,null,null,null,null,null,null,null,null,null,null,null,null,null,null,null,null,null,"X","",null,null,null,null,0,0,{"$error":"#DIV/0!"},{"$error":"#DIV/0!"},{"$error":"#DIV/0!"},{"$error":"#DIV/0!"},{"$error":"#DIV/0!"},{"$error":"#DIV/0!"},{"$f":"IF(Q168=\"\",\"0\",(IF(P168<AI168,1,IF(Q168>#REF!,1,0))))","v":"0"},{"$f":"IF(R168=\"\",\"0\",(IF(R168<AI168,1,IF(R168>#REF!,1,0))))","v":"0"},{"$f":"IF(S168=\"\",\"0\",(IF(S168<AI168,1,IF(S168>#REF!,1,0))))","v":"0"},{"$f":"IF(T168=\"\",\"0\",(IF(T168<AI168,1,IF(T168>#REF!,1,0))))","v":"0"}]
[null,null,null,null,null,null,null,null,null,null,null,null,null,null,null,null,null,null,null,null,null,"X","",null,null,null,null,0,0,{"$error":"#DIV/0!"},{"$error":"#DIV/0!"},{"$error":"#DIV/0!"},{"$error":"#DIV/0!"},{"$error":"#DIV/0!"},{"$error":"#DIV/0!"},{"$f":"IF(Q169=\"\",\"0\",(IF(P169<AI169,1,IF(Q169>#REF!,1,0))))","v":"0"},{"$f":"IF(R169=\"\",\"0\",(IF(R169<AI169,1,IF(R169>#REF!,1,0))))","v":"0"},{"$f":"IF(S169=\"\",\"0\",(IF(S169<AI169,1,IF(S169>#REF!,1,0))))","v":"0"},{"$f":"IF(T169=\"\",\"0\",(IF(T169<AI169,1,IF(T169>#REF!,1,0))))","v":"0"}]
[null,null,null,null,null,null,null,null,null,null,null,null,null,null,null,null,null,null,null,null,null,"X","",null,null,null,null,0,0,{"$error":"#DIV/0!"},{"$error":"#DIV/0!"},{"$error":"#DIV/0!"},{"$error":"#DIV/0!"},{"$error":"#DIV/0!"},{"$error":"#DIV/0!"},{"$f":"IF(Q170=\"\",\"0\",(IF(P170<AI170,1,IF(Q170>#REF!,1,0))))","v":"0"},{"$f":"IF(R170=\"\",\"0\",(IF(R170<AI170,1,IF(R170>#REF!,1,0))))","v":"0"},{"$f":"IF(S170=\"\",\"0\",(IF(S170<AI170,1,IF(S170>#REF!,1,0))))","v":"0"},{"$f":"IF(T170=\"\",\"0\",(IF(T170<AI170,1,IF(T170>#REF!,1,0))))","v":"0"}]
[null,null,null,null,null,null,null,null,null,null,null,null,null,null,null,null,null,null,null,null,null,"X","",null,null,null,null,0,0,{"$error":"#DIV/0!"},{"$error":"#DIV/0!"},{"$error":"#DIV/0!"},{"$error":"#DIV/0!"},{"$error":"#DIV/0!"},{"$error":"#DIV/0!"},{"$f":"IF(Q171=\"\",\"0\",(IF(P171<AI171,1,IF(Q171>#REF!,1,0))))","v":"0"},{"$f":"IF(R171=\"\",\"0\",(IF(R171<AI171,1,IF(R171>#REF!,1,0))))","v":"0"},{"$f":"IF(S171=\"\",\"0\",(IF(S171<AI171,1,IF(S171>#REF!,1,0))))","v":"0"},{"$f":"IF(T171=\"\",\"0\",(IF(T171<AI171,1,IF(T171>#REF!,1,0))))","v":"0"}]
[null,null,null,null,null,null,null,null,null,null,null,null,null,null,null,null,null,null,null,null,null,"X","",null,null,null,null,0,0,{"$error":"#DIV/0!"},{"$error":"#DIV/0!"},{"$error":"#DIV/0!"},{"$error":"#DIV/0!"},{"$error":"#DIV/0!"},{"$error":"#DIV/0!"},{"$f":"IF(Q172=\"\",\"0\",(IF(P172<AI172,1,IF(Q172>#REF!,1,0))))","v":"0"},{"$f":"IF(R172=\"\",\"0\",(IF(R172<AI172,1,IF(R172>#REF!,1,0))))","v":"0"},{"$f":"IF(S172=\"\",\"0\",(IF(S172<AI172,1,IF(S172>#REF!,1,0))))","v":"0"},{"$f":"IF(T172=\"\",\"0\",(IF(T172<AI172,1,IF(T172>#REF!,1,0))))","v":"0"}]
[null,null,null,null,null,null,null,null,null,null,null,null,null,null,null,null,null,null,null,null,null,"X","",null,null,null,null,0,0,{"$error":"#DIV/0!"},{"$error":"#DIV/0!"},{"$error":"#DIV/0!"},{"$error":"#DIV/0!"},{"$error":"#DIV/0!"},{"$error":"#DIV/0!"},{"$f":"IF(Q173=\"\",\"0\",(IF(P173<AI173,1,IF(Q173>#REF!,1,0))))","v":"0"},{"$f":"IF(R173=\"\",\"0\",(IF(R173<AI173,1,IF(R173>#REF!,1,0))))","v":"0"},{"$f":"IF(S173=\"\",\"0\",(IF(S173<AI173,1,IF(S173>#REF!,1,0))))","v":"0"},{"$f":"IF(T173=\"\",\"0\",(IF(T173<AI173,1,IF(T173>#REF!,1,0))))","v":"0"}]
[null,null,null,null,null,null,null,null,null,null,null,null,null,null,null,null,null,null,null,null,null,"X","",null,null,null,null,0,0,{"$error":"#DIV/0!"},{"$error":"#DIV/0!"},{"$error":"#DIV/0!"},{"$error":"#DIV/0!"},{"$error":"#DIV/0!"},{"$error":"#DIV/0!"},{"$f":"IF(Q174=\"\",\"0\",(IF(P174<AI174,1,IF(Q174>#REF!,1,0))))","v":"0"},{"$f":"IF(R174=\"\",\"0\",(IF(R174<AI174,1,IF(R174>#REF!,1,0))))","v":"0"},{"$f":"IF(S174=\"\",\"0\",(IF(S174<AI174,1,IF(S174>#REF!,1,0))))","v":"0"},{"$f":"IF(T174=\"\",\"0\",(IF(T174<AI174,1,IF(T174>#REF!,1,0))))","v":"0"}]
[null,null,null,null,null,null,null,null,null,null,null,null,null,null,null,null,null,null,null,null,null,"X","",null,null,null,null,0,0,{"$error":"#DIV/0!"},{"$error":"#DIV/0!"},{"$error":"#DIV/0!"},{"$error":"#DIV/0!"},{"$error":"#DIV/0!"},{"$error":"#DIV/0!"},{"$f":"IF(Q175=\"\",\"0\",(IF(P175<AI175,1,IF(Q175>#REF!,1,0))))","v":"0"},{"$f":"IF(R175=\"\",\"0\",(IF(R175<AI175,1,IF(R175>#REF!,1,0))))","v":"0"},{"$f":"IF(S175=\"\",\"0\",(IF(S175<AI175,1,IF(S175>#REF!,1,0))))","v":"0"},{"$f":"IF(T175=\"\",\"0\",(IF(T175<AI175,1,IF(T175>#REF!,1,0))))","v":"0"}]
[null,null,null,null,null,null,null,null,null,null,null,null,null,null,null,null,null,null,null,null,null,"X","",null,null,null,null,0,0,{"$error":"#DIV/0!"},{"$error":"#DIV/0!"},{"$error":"#DIV/0!"},{"$error":"#DIV/0!"},{"$error":"#DIV/0!"},{"$error":"#DIV/0!"},{"$f":"IF(Q176=\"\",\"0\",(IF(P176<AI176,1,IF(Q176>#REF!,1,0))))","v":"0"},{"$f":"IF(R176=\"\",\"0\",(IF(R176<AI176,1,IF(R176>#REF!,1,0))))","v":"0"},{"$f":"IF(S176=\"\",\"0\",(IF(S176<AI176,1,IF(S176>#REF!,1,0))))","v":"0"},{"$f":"IF(T176=\"\",\"0\",(IF(T176<AI176,1,IF(T176>#REF!,1,0))))","v":"0"}]
[null,null,null,null,null,null,null,null,null,null,null,null,null,null,null,null,null,null,null,null,null,"X","",null,null,null,null,0,0,{"$error":"#DIV/0!"},{"$error":"#DIV/0!"},{"$error":"#DIV/0!"},{"$error":"#DIV/0!"},{"$error":"#DIV/0!"},{"$error":"#DIV/0!"},{"$f":"IF(Q177=\"\",\"0\",(IF(P177<AI177,1,IF(Q177>#REF!,1,0))))","v":"0"},{"$f":"IF(R177=\"\",\"0\",(IF(R177<AI177,1,IF(R177>#REF!,1,0))))","v":"0"},{"$f":"IF(S177=\"\",\"0\",(IF(S177<AI177,1,IF(S177>#REF!,1,0))))","v":"0"},{"$f":"IF(T177=\"\",\"0\",(IF(T177<AI177,1,IF(T177>#REF!,1,0))))","v":"0"}]
[null,null,null,null,null,null,null,null,null,null,null,null,null,null,null,null,null,null,null,null,null,"X","",null,null,null,null,0,0,{"$error":"#DIV/0!"},{"$error":"#DIV/0!"},{"$error":"#DIV/0!"},{"$error":"#DIV/0!"},{"$error":"#DIV/0!"},{"$error":"#DIV/0!"},{"$f":"IF(Q178=\"\",\"0\",(IF(P178<AI178,1,IF(Q178>#REF!,1,0))))","v":"0"},{"$f":"IF(R178=\"\",\"0\",(IF(R178<AI178,1,IF(R178>#REF!,1,0))))","v":"0"},{"$f":"IF(S178=\"\",\"0\",(IF(S178<AI178,1,IF(S178>#REF!,1,0))))","v":"0"},{"$f":"IF(T178=\"\",\"0\",(IF(T178<AI178,1,IF(T178>#REF!,1,0))))","v":"0"}]
[null,null,null,null,null,null,null,null,null,null,null,null,null,null,null,null,null,null,null,null,null,"X","",null,null,null,null,0,0,{"$error":"#DIV/0!"},{"$error":"#DIV/0!"},{"$error":"#DIV/0!"},{"$error":"#DIV/0!"},{"$error":"#DIV/0!"},{"$error":"#DIV/0!"},{"$f":"IF(Q179=\"\",\"0\",(IF(P179<AI179,1,IF(Q179>#REF!,1,0))))","v":"0"},{"$f":"IF(R179=\"\",\"0\",(IF(R179<AI179,1,IF(R179>#REF!,1,0))))","v":"0"},{"$f":"IF(S179=\"\",\"0\",(IF(S179<AI179,1,IF(S179>#REF!,1,0))))","v":"0"},{"$f":"IF(T179=\"\",\"0\",(IF(T179<AI179,1,IF(T179>#REF!,1,0))))","v":"0"}]
[null,null,null,null,null,null,null,null,null,null,null,null,null,null,null,null,null,null,null,null,null,"X","",null,null,null,null,0,0,{"$error":"#DIV/0!"},{"$error":"#DIV/0!"},{"$error":"#DIV/0!"},{"$error":"#DIV/0!"},{"$error":"#DIV/0!"},{"$error":"#DIV/0!"},{"$f":"IF(Q180=\"\",\"0\",(IF(P180<AI180,1,IF(Q180>#REF!,1,0))))","v":"0"},{"$f":"IF(R180=\"\",\"0\",(IF(R180<AI180,1,IF(R180>#REF!,1,0))))","v":"0"},{"$f":"IF(S180=\"\",\"0\",(IF(S180<AI180,1,IF(S180>#REF!,1,0))))","v":"0"},{"$f":"IF(T180=\"\",\"0\",(IF(T180<AI180,1,IF(T180>#REF!,1,0))))","v":"0"}]
[null,null,null,null,null,null,null,null,null,null,null,null,null,null,null,null,null,null,null,null,null,"X","",null,null,null,null,0,0,{"$error":"#DIV/0!"},{"$error":"#DIV/0!"},{"$error":"#DIV/0!"},{"$error":"#DIV/0!"},{"$error":"#DIV/0!"},{"$error":"#DIV/0!"},{"$f":"IF(Q181=\"\",\"0\",(IF(P181<AI181,1,IF(Q181>#REF!,1,0))))","v":"0"},{"$f":"IF(R181=\"\",\"0\",(IF(R181<AI181,1,IF(R181>#REF!,1,0))))","v":"0"},{"$f":"IF(S181=\"\",\"0\",(IF(S181<AI181,1,IF(S181>#REF!,1,0))))","v":"0"},{"$f":"IF(T181=\"\",\"0\",(IF(T181<AI181,1,IF(T181>#REF!,1,0))))","v":"0"}]
[null,null,null,null,null,null,null,null,null,null,null,null,null,null,null,null,null,null,null,null,null,"X","",null,null,null,null,0,0,{"$error":"#DIV/0!"},{"$error":"#DIV/0!"},{"$error":"#DIV/0!"},{"$error":"#DIV/0!"},{"$error":"#DIV/0!"},{"$error":"#DIV/0!"},{"$f":"IF(Q182=\"\",\"0\",(IF(P182<AI182,1,IF(Q182>#REF!,1,0))))","v":"0"},{"$f":"IF(R182=\"\",\"0\",(IF(R182<AI182,1,IF(R182>#REF!,1,0))))","v":"0"},{"$f":"IF(S182=\"\",\"0\",(IF(S182<AI182,1,IF(S182>#REF!,1,0))))","v":"0"},{"$f":"IF(T182=\"\",\"0\",(IF(T182<AI182,1,IF(T182>#REF!,1,0))))","v":"0"}]
[null,null,null,null,null,null,null,null,null,null,null,null,null,null,null,null,null,null,null,null,null,"X","",null,null,null,null,0,0,{"$error":"#DIV/0!"},{"$error":"#DIV/0!"},{"$error":"#DIV/0!"},{"$error":"#DIV/0!"},{"$error":"#DIV/0!"},{"$error":"#DIV/0!"},{"$f":"IF(Q183=\"\",\"0\",(IF(P183<AI183,1,IF(Q183>#REF!,1,0))))","v":"0"},{"$f":"IF(R183=\"\",\"0\",(IF(R183<AI183,1,IF(R183>#REF!,1,0))))","v":"0"},{"$f":"IF(S183=\"\",\"0\",(IF(S183<AI183,1,IF(S183>#REF!,1,0))))","v":"0"},{"$f":"IF(T183=\"\",\"0\",(IF(T183<AI183,1,IF(T183>#REF!,1,0))))","v":"0"}]
[null,null,null,null,null,null,null,null,null,null,null,null,null,null,null,null,null,null,null,null,null,"X","",null,null,null,null,0,0,{"$error":"#DIV/0!"},{"$error":"#DIV/0!"},{"$error":"#DIV/0!"},{"$error":"#DIV/0!"},{"$error":"#DIV/0!"},{"$error":"#DIV/0!"},{"$f":"IF(Q184=\"\",\"0\",(IF(P184<AI184,1,IF(Q184>#REF!,1,0))))","v":"0"},{"$f":"IF(R184=\"\",\"0\",(IF(R184<AI184,1,IF(R184>#REF!,1,0))))","v":"0"},{"$f":"IF(S184=\"\",\"0\",(IF(S184<AI184,1,IF(S184>#REF!,1,0))))","v":"0"},{"$f":"IF(T184=\"\",\"0\",(IF(T184<AI184,1,IF(T184>#REF!,1,0))))","v":"0"}]
[null,null,null,null,null,null,null,null,null,null,null,null,null,null,null,null,null,null,null,null,null,"X","",null,null,null,null,0,0,{"$error":"#DIV/0!"},{"$error":"#DIV/0!"},{"$error":"#DIV/0!"},{"$error":"#DIV/0!"},{"$error":"#DIV/0!"},{"$error":"#DIV/0!"},{"$f":"IF(Q185=\"\",\"0\",(IF(P185<AI185,1,IF(Q185>#REF!,1,0))))","v":"0"},{"$f":"IF(R185=\"\",\"0\",(IF(R185<AI185,1,IF(R185>#REF!,1,0))))","v":"0"},{"$f":"IF(S185=\"\",\"0\",(IF(S185<AI185,1,IF(S185>#REF!,1,0))))","v":"0"},{"$f":"IF(T185=\"\",\"0\",(IF(T185<AI185,1,IF(T185>#REF!,1,0))))","v":"0"}]
[null,null,null,null,null,null,null,null,null,null,null,null,null,null,null,null,null,null,null,null,null,"X","",null,null,null,null,0,0,{"$error":"#DIV/0!"},{"$error":"#DIV/0!"},{"$error":"#DIV/0!"},{"$error":"#DIV/0!"},{"$error":"#DIV/0!"},{"$error":"#DIV/0!"},{"$f":"IF(Q186=\"\",\"0\",(IF(P186<AI186,1,IF(Q186>#REF!,1,0))))","v":"0"},{"$f":"IF(R186=\"\",\"0\",(IF(R186<AI186,1,IF(R186>#REF!,1,0))))","v":"0"},{"$f":"IF(S186=\"\",\"0\",(IF(S186<AI186,1,IF(S186>#REF!,1,0))))","v":"0"},{"$f":"IF(T186=\"\",\"0\",(IF(T186<AI186,1,IF(T186>#REF!,1,0))))","v":"0"}]
[null,null,null,null,null,null,null,null,null,null,null,null,null,null,null,null,null,null,null,null,null,"X","",null,null,null,null,0,0,{"$error":"#DIV/0!"},{"$error":"#DIV/0!"},{"$error":"#DIV/0!"},{"$error":"#DIV/0!"},{"$error":"#DIV/0!"},{"$error":"#DIV/0!"},{"$f":"IF(Q187=\"\",\"0\",(IF(P187<AI187,1,IF(Q187>#REF!,1,0))))","v":"0"},{"$f":"IF(R187=\"\",\"0\",(IF(R187<AI187,1,IF(R187>#REF!,1,0))))","v":"0"},{"$f":"IF(S187=\"\",\"0\",(IF(S187<AI187,1,IF(S187>#REF!,1,0))))","v":"0"},{"$f":"IF(T187=\"\",\"0\",(IF(T187<AI187,1,IF(T187>#REF!,1,0))))","v":"0"}]
[null,null,null,null,null,null,null,null,null,null,null,null,null,null,null,null,null,null,null,null,null,"X","",null,null,null,null,0,0,{"$error":"#DIV/0!"},{"$error":"#DIV/0!"},{"$error":"#DIV/0!"},{"$error":"#DIV/0!"},{"$error":"#DIV/0!"},{"$error":"#DIV/0!"},{"$f":"IF(Q188=\"\",\"0\",(IF(P188<AI188,1,IF(Q188>#REF!,1,0))))","v":"0"},{"$f":"IF(R188=\"\",\"0\",(IF(R188<AI188,1,IF(R188>#REF!,1,0))))","v":"0"},{"$f":"IF(S188=\"\",\"0\",(IF(S188<AI188,1,IF(S188>#REF!,1,0))))","v":"0"},{"$f":"IF(T188=\"\",\"0\",(IF(T188<AI188,1,IF(T188>#REF!,1,0))))","v":"0"}]
[null,null,null,null,null,null,null,null,null,null,null,null,null,null,null,null,null,null,null,null,null,"X","",null,null,null,null,0,0,{"$error":"#DIV/0!"},{"$error":"#DIV/0!"},{"$error":"#DIV/0!"},{"$error":"#DIV/0!"},{"$error":"#DIV/0!"},{"$error":"#DIV/0!"},{"$f":"IF(Q189=\"\",\"0\",(IF(P189<AI189,1,IF(Q189>#REF!,1,0))))","v":"0"},{"$f":"IF(R189=\"\",\"0\",(IF(R189<AI189,1,IF(R189>#REF!,1,0))))","v":"0"},{"$f":"IF(S189=\"\",\"0\",(IF(S189<AI189,1,IF(S189>#REF!,1,0))))","v":"0"},{"$f":"IF(T189=\"\",\"0\",(IF(T189<AI189,1,IF(T189>#REF!,1,0))))","v":"0"}]
[null,null,null,null,null,null,null,null,null,null,null,null,null,null,null,null,null,null,null,null,null,"X","",null,null,null,null,0,0,{"$error":"#DIV/0!"},{"$error":"#DIV/0!"},{"$error":"#DIV/0!"},{"$error":"#DIV/0!"},{"$error":"#DIV/0!"},{"$error":"#DIV/0!"},{"$f":"IF(Q190=\"\",\"0\",(IF(P190<AI190,1,IF(Q190>#REF!,1,0))))","v":"0"},{"$f":"IF(R190=\"\",\"0\",(IF(R190<AI190,1,IF(R190>#REF!,1,0))))","v":"0"},{"$f":"IF(S190=\"\",\"0\",(IF(S190<AI190,1,IF(S190>#REF!,1,0))))","v":"0"},{"$f":"IF(T190=\"\",\"0\",(IF(T190<AI190,1,IF(T190>#REF!,1,0))))","v":"0"}]
[null,null,null,null,null,null,null,null,null,null,null,null,null,null,null,null,null,null,null,null,null,"X","",null,null,null,null,0,0,{"$error":"#DIV/0!"},{"$error":"#DIV/0!"},{"$error":"#DIV/0!"},{"$error":"#DIV/0!"},{"$error":"#DIV/0!"},{"$error":"#DIV/0!"},{"$f":"IF(Q191=\"\",\"0\",(IF(P191<AI191,1,IF(Q191>#REF!,1,0))))","v":"0"},{"$f":"IF(R191=\"\",\"0\",(IF(R191<AI191,1,IF(R191>#REF!,1,0))))","v":"0"},{"$f":"IF(S191=\"\",\"0\",(IF(S191<AI191,1,IF(S191>#REF!,1,0))))","v":"0"},{"$f":"IF(T191=\"\",\"0\",(IF(T191<AI191,1,IF(T191>#REF!,1,0))))","v":"0"}]
[null,null,null,null,null,null,null,null,null,null,null,null,null,null,null,null,null,null,null,null,null,"X","",null,null,null,null,0,0,{"$error":"#DIV/0!"},{"$error":"#DIV/0!"},{"$error":"#DIV/0!"},{"$error":"#DIV/0!"},{"$error":"#DIV/0!"},{"$error":"#DIV/0!"},{"$f":"IF(Q192=\"\",\"0\",(IF(P192<AI192,1,IF(Q192>#REF!,1,0))))","v":"0"},{"$f":"IF(R192=\"\",\"0\",(IF(R192<AI192,1,IF(R192>#REF!,1,0))))","v":"0"},{"$f":"IF(S192=\"\",\"0\",(IF(S192<AI192,1,IF(S192>#REF!,1,0))))","v":"0"},{"$f":"IF(T192=\"\",\"0\",(IF(T192<AI192,1,IF(T192>#REF!,1,0))))","v":"0"}]
[null,null,null,null,null,null,null,null,null,null,null,null,null,null,null,null,null,null,null,null,null,"X","",null,null,null,null,0,0,{"$error":"#DIV/0!"},{"$error":"#DIV/0!"},{"$error":"#DIV/0!"},{"$error":"#DIV/0!"},{"$error":"#DIV/0!"},{"$error":"#DIV/0!"},{"$f":"IF(Q193=\"\",\"0\",(IF(P193<AI193,1,IF(Q193>#REF!,1,0))))","v":"0"},{"$f":"IF(R193=\"\",\"0\",(IF(R193<AI193,1,IF(R193>#REF!,1,0))))","v":"0"},{"$f":"IF(S193=\"\",\"0\",(IF(S193<AI193,1,IF(S193>#REF!,1,0))))","v":"0"},{"$f":"IF(T193=\"\",\"0\",(IF(T193<AI193,1,IF(T193>#REF!,1,0))))","v":"0"}]
[null,null,null,null,null,null,null,null,null,null,null,null,null,null,null,null,null,null,null,null,null,"X","",null,null,null,null,0,0,{"$error":"#DIV/0!"},{"$error":"#DIV/0!"},{"$error":"#DIV/0!"},{"$error":"#DIV/0!"},{"$error":"#DIV/0!"},{"$error":"#DIV/0!"},{"$f":"IF(Q194=\"\",\"0\",(IF(P194<AI194,1,IF(Q194>#REF!,1,0))))","v":"0"},{"$f":"IF(R194=\"\",\"0\",(IF(R194<AI194,1,IF(R194>#REF!,1,0))))","v":"0"},{"$f":"IF(S194=\"\",\"0\",(IF(S194<AI194,1,IF(S194>#REF!,1,0))))","v":"0"},{"$f":"IF(T194=\"\",\"0\",(IF(T194<AI194,1,IF(T194>#REF!,1,0))))","v":"0"}]
[null,null,null,null,null,null,null,null,null,null,null,null,null,null,null,null,null,null,null,null,null,"X","",null,null,null,null,0,0,{"$error":"#DIV/0!"},{"$error":"#DIV/0!"},{"$error":"#DIV/0!"},{"$error":"#DIV/0!"},{"$error":"#DIV/0!"},{"$error":"#DIV/0!"},{"$f":"IF(Q195=\"\",\"0\",(IF(P195<AI195,1,IF(Q195>#REF!,1,0))))","v":"0"},{"$f":"IF(R195=\"\",\"0\",(IF(R195<AI195,1,IF(R195>#REF!,1,0))))","v":"0"},{"$f":"IF(S195=\"\",\"0\",(IF(S195<AI195,1,IF(S195>#REF!,1,0))))","v":"0"},{"$f":"IF(T195=\"\",\"0\",(IF(T195<AI195,1,IF(T195>#REF!,1,0))))","v":"0"}]
[null,null,null,null,null,null,null,null,null,null,null,null,null,null,null,null,null,null,null,null,null,"X","",null,null,null,null,0,0,{"$error":"#DIV/0!"},{"$error":"#DIV/0!"},{"$error":"#DIV/0!"},{"$error":"#DIV/0!"},{"$error":"#DIV/0!"},{"$error":"#DIV/0!"},{"$f":"IF(Q196=\"\",\"0\",(IF(P196<AI196,1,IF(Q196>#REF!,1,0))))","v":"0"},{"$f":"IF(R196=\"\",\"0\",(IF(R196<AI196,1,IF(R196>#REF!,1,0))))","v":"0"},{"$f":"IF(S196=\"\",\"0\",(IF(S196<AI196,1,IF(S196>#REF!,1,0))))","v":"0"},{"$f":"IF(T196=\"\",\"0\",(IF(T196<AI196,1,IF(T196>#REF!,1,0))))","v":"0"}]
[null,null,null,null,null,null,null,null,null,null,null,null,null,null,null,null,null,null,null,null,null,"X","",null,null,null,null,0,0,{"$error":"#DIV/0!"},{"$error":"#DIV/0!"},{"$error":"#DIV/0!"},{"$error":"#DIV/0!"},{"$error":"#DIV/0!"},{"$error":"#DIV/0!"},{"$f":"IF(Q197=\"\",\"0\",(IF(P197<AI197,1,IF(Q197>#REF!,1,0))))","v":"0"},{"$f":"IF(R197=\"\",\"0\",(IF(R197<AI197,1,IF(R197>#REF!,1,0))))","v":"0"},{"$f":"IF(S197=\"\",\"0\",(IF(S197<AI197,1,IF(S197>#REF!,1,0))))","v":"0"},{"$f":"IF(T197=\"\",\"0\",(IF(T197<AI197,1,IF(T197>#REF!,1,0))))","v":"0"}]
[null,null,null,null,null,null,null,null,null,null,null,null,null,null,null,null,null,null,null,null,null,"X","",null,null,null,null,0,0,{"$error":"#DIV/0!"},{"$error":"#DIV/0!"},{"$error":"#DIV/0!"},{"$error":"#DIV/0!"},{"$error":"#DIV/0!"},{"$error":"#DIV/0!"},{"$f":"IF(Q198=\"\",\"0\",(IF(P198<AI198,1,IF(Q198>#REF!,1,0))))","v":"0"},{"$f":"IF(R198=\"\",\"0\",(IF(R198<AI198,1,IF(R198>#REF!,1,0))))","v":"0"},{"$f":"IF(S198=\"\",\"0\",(IF(S198<AI198,1,IF(S198>#REF!,1,0))))","v":"0"},{"$f":"IF(T198=\"\",\"0\",(IF(T198<AI198,1,IF(T198>#REF!,1,0))))","v":"0"}]
[null,null,null,null,null,null,null,null,null,null,null,null,null,null,null,null,null,null,null,null,null,"X","",null,null,null,null,0,0,{"$error":"#DIV/0!"},{"$error":"#DIV/0!"},{"$error":"#DIV/0!"},{"$error":"#DIV/0!"},{"$error":"#DIV/0!"},{"$error":"#DIV/0!"},{"$f":"IF(Q199=\"\",\"0\",(IF(P199<AI199,1,IF(Q199>#REF!,1,0))))","v":"0"},{"$f":"IF(R199=\"\",\"0\",(IF(R199<AI199,1,IF(R199>#REF!,1,0))))","v":"0"},{"$f":"IF(S199=\"\",\"0\",(IF(S199<AI199,1,IF(S199>#REF!,1,0))))","v":"0"},{"$f":"IF(T199=\"\",\"0\",(IF(T199<AI199,1,IF(T199>#REF!,1,0))))","v":"0"}]
[null,null,null,null,null,null,null,null,null,null,null,null,null,null,null,null,null,null,null,null,null,"X","",null,null,null,null,0,0,{"$error":"#DIV/0!"},{"$error":"#DIV/0!"},{"$error":"#DIV/0!"},{"$error":"#DIV/0!"},{"$error":"#DIV/0!"},{"$error":"#DIV/0!"},{"$f":"IF(Q200=\"\",\"0\",(IF(P200<AI200,1,IF(Q200>#REF!,1,0))))","v":"0"},{"$f":"IF(R200=\"\",\"0\",(IF(R200<AI200,1,IF(R200>#REF!,1,0))))","v":"0"},{"$f":"IF(S200=\"\",\"0\",(IF(S200<AI200,1,IF(S200>#REF!,1,0))))","v":"0"},{"$f":"IF(T200=\"\",\"0\",(IF(T200<AI200,1,IF(T200>#REF!,1,0))))","v":"0"}]
[null,null,null,null,null,null,null,null,null,null,null,null,null,null,null,null,null,null,null,null,null,"X","",null,null,null,null,0,0,{"$error":"#DIV/0!"},{"$error":"#DIV/0!"},{"$error":"#DIV/0!"},{"$error":"#DIV/0!"},{"$error":"#DIV/0!"},{"$error":"#DIV/0!"},{"$f":"IF(Q201=\"\",\"0\",(IF(P201<AI201,1,IF(Q201>#REF!,1,0))))","v":"0"},{"$f":"IF(R201=\"\",\"0\",(IF(R201<AI201,1,IF(R201>#REF!,1,0))))","v":"0"},{"$f":"IF(S201=\"\",\"0\",(IF(S201<AI201,1,IF(S201>#REF!,1,0))))","v":"0"},{"$f":"IF(T201=\"\",\"0\",(IF(T201<AI201,1,IF(T201>#REF!,1,0))))","v":"0"}]
[null,null,null,null,null,null,null,null,null,null,null,null,null,null,null,null,null,null,null,null,null,"X","",null,null,null,null,0,0,{"$error":"#DIV/0!"},{"$error":"#DIV/0!"},{"$error":"#DIV/0!"},{"$error":"#DIV/0!"},{"$error":"#DIV/0!"},{"$error":"#DIV/0!"},{"$f":"IF(Q202=\"\",\"0\",(IF(P202<AI202,1,IF(Q202>#REF!,1,0))))","v":"0"},{"$f":"IF(R202=\"\",\"0\",(IF(R202<AI202,1,IF(R202>#REF!,1,0))))","v":"0"},{"$f":"IF(S202=\"\",\"0\",(IF(S202<AI202,1,IF(S202>#REF!,1,0))))","v":"0"},{"$f":"IF(T202=\"\",\"0\",(IF(T202<AI202,1,IF(T202>#REF!,1,0))))","v":"0"}]
[null,null,null,null,null,null,null,null,null,null,null,null,null,null,null,null,null,null,null,null,null,"X","",null,null,null,null,0,0,{"$error":"#DIV/0!"},{"$error":"#DIV/0!"},{"$error":"#DIV/0!"},{"$error":"#DIV/0!"},{"$error":"#DIV/0!"},{"$error":"#DIV/0!"},{"$f":"IF(Q203=\"\",\"0\",(IF(P203<AI203,1,IF(Q203>#REF!,1,0))))","v":"0"},{"$f":"IF(R203=\"\",\"0\",(IF(R203<AI203,1,IF(R203>#REF!,1,0))))","v":"0"},{"$f":"IF(S203=\"\",\"0\",(IF(S203<AI203,1,IF(S203>#REF!,1,0))))","v":"0"},{"$f":"IF(T203=\"\",\"0\",(IF(T203<AI203,1,IF(T203>#REF!,1,0))))","v":"0"}]
[null,null,null,null,null,null,null,null,null,null,null,null,null,null,null,null,null,null,null,null,null,"X","",null,null,null,null,0,0,{"$error":"#DIV/0!"},{"$error":"#DIV/0!"},{"$error":"#DIV/0!"},{"$error":"#DIV/0!"},{"$error":"#DIV/0!"},{"$error":"#DIV/0!"},{"$f":"IF(Q204=\"\",\"0\",(IF(P204<AI204,1,IF(Q204>#REF!,1,0))))","v":"0"},{"$f":"IF(R204=\"\",\"0\",(IF(R204<AI204,1,IF(R204>#REF!,1,0))))","v":"0"},{"$f":"IF(S204=\"\",\"0\",(IF(S204<AI204,1,IF(S204>#REF!,1,0))))","v":"0"},{"$f":"IF(T204=\"\",\"0\",(IF(T204<AI204,1,IF(T204>#REF!,1,0))))","v":"0"}]
[null,null,null,null,null,null,null,null,null,null,null,null,null,null,null,null,null,null,null,null,null,"X","",null,null,null,null,0,0,{"$error":"#DIV/0!"},{"$error":"#DIV/0!"},{"$error":"#DIV/0!"},{"$error":"#DIV/0!"},{"$error":"#DIV/0!"},{"$error":"#DIV/0!"},{"$f":"IF(Q205=\"\",\"0\",(IF(P205<AI205,1,IF(Q205>#REF!,1,0))))","v":"0"},{"$f":"IF(R205=\"\",\"0\",(IF(R205<AI205,1,IF(R205>#REF!,1,0))))","v":"0"},{"$f":"IF(S205=\"\",\"0\",(IF(S205<AI205,1,IF(S205>#REF!,1,0))))","v":"0"},{"$f":"IF(T205=\"\",\"0\",(IF(T205<AI205,1,IF(T205>#REF!,1,0))))","v":"0"}]
[null,null,null,null,null,null,null,null,null,null,null,null,null,null,null,null,null,null,null,null,null,"X","",null,null,null,null,0,0,{"$error":"#DIV/0!"},{"$error":"#DIV/0!"},{"$error":"#DIV/0!"},{"$error":"#DIV/0!"},{"$error":"#DIV/0!"},{"$error":"#DIV/0!"},{"$f":"IF(Q206=\"\",\"0\",(IF(P206<AI206,1,IF(Q206>#REF!,1,0))))","v":"0"},{"$f":"IF(R206=\"\",\"0\",(IF(R206<AI206,1,IF(R206>#REF!,1,0))))","v":"0"},{"$f":"IF(S206=\"\",\"0\",(IF(S206<AI206,1,IF(S206>#REF!,1,0))))","v":"0"},{"$f":"IF(T206=\"\",\"0\",(IF(T206<AI206,1,IF(T206>#REF!,1,0))))","v":"0"}]
[null,null,null,null,null,null,null,null,null,null,null,null,null,null,null,null,null,null,null,null,null,{"$f":"IF(I207=\"Ref\",\"\",(IF(I207=\"Basic\",\"\",(IF(P207=\"P\",\"X\",(IF(P207=\"F\",\"\",IF(MAX(P207:T207)>(H207+J207),\"\",IF(MIN(P207:T207)<(H207+I207),\"\",\"X\")))))))))","v":"X"},{"$f":"IF(I207=\"Ref\",\"\",(IF(I207=\"Basic\",\"\",(IF(P207=\"P\",\"\",IF(P207=\"F\",\"X\",IF(MAX(P207:T207)>(H207+J207),\"X\",IF(MIN(P207:T207)<(H207+I207),\"X\",\"\"))))))))","v":""},null,null,null,null,0,0,{"$error":"#DIV/0!"},{"$error":"#DIV/0!"},{"$f":"(AB207-AD207)/(3*AE207)","v":{"$error":"#DIV/0!"}},{"$f":"(AD207-AC207)/(3*AE207)","v":{"$error":"#DIV/0!"}},{"$f":"(AB207-AC207)/(6*AE207)","v":{"$error":"#DIV/0!"}},{"$error":"#DIV/0!"},{"$f":"IF(Q207=\"\",\"0\",(IF(P207<AI207,1,IF(Q207>#REF!,1,0))))","v":"0"},{"$f":"IF(R207=\"\",\"0\",(IF(R207<AI207,1,IF(R207>#REF!,1,0))))","v":"0"},{"$f":"IF(S207=\"\",\"0\",(IF(S207<AI207,1,IF(S207>#REF!,1,0))))","v":"0"},{"$f":"IF(T207=\"\",\"0\",(IF(T207<AI207,1,IF(T207>#REF!,1,0))))","v":"0"}]
[null,null,null,null,null,null,null,null,null,null,null,null,null,null,null,null,null,null,null,null,null,"X","",null,null,null,null,{"$f":"H208+J208","v":0},{"$f":"H208+I208","v":0},{"$f":"AVERAGE(P208:T208)","v":{"$error":"#DIV/0!"}},{"$f":"_xlfn.STDEV.S(P208,Q208,R208,S208,T208)","v":{"$error":"#DIV/0!"}},{"$error":"#DIV/0!"},{"$error":"#DIV/0!"},{"$error":"#DIV/0!"},{"$f":"MIN(AF208, AG208)","v":{"$error":"#DIV/0!"}},{"$f":"IF(Q208=\"\",\"0\",(IF(P208<AI208,1,IF(Q208>#REF!,1,0))))","v":"0"},{"$f":"IF(R208=\"\",\"0\",(IF(R208<AI208,1,IF(R208>#REF!,1,0))))","v":"0"},{"$f":"IF(S208=\"\",\"0\",(IF(S208<AI208,1,IF(S208>#REF!,1,0))))","v":"0"},{"$f":"IF(T208=\"\",\"0\",(IF(T208<AI208,1,IF(T208>#REF!,1,0))))","v":"0"}]
[null,null,null,null,null,null,null,null,null,null,null,null,null,null,null,null,null,null,null,null,null,"X","",null,null,null,null,0,0,{"$error":"#DIV/0!"},{"$error":"#DIV/0!"},{"$error":"#DIV/0!"},{"$error":"#DIV/0!"},{"$error":"#DIV/0!"},{"$error":"#DIV/0!"},{"$f":"IF(Q209=\"\",\"0\",(IF(P209<AI209,1,IF(Q209>#REF!,1,0))))","v":"0"},{"$f":"IF(R209=\"\",\"0\",(IF(R209<AI209,1,IF(R209>#REF!,1,0))))","v":"0"},{"$f":"IF(S209=\"\",\"0\",(IF(S209<AI209,1,IF(S209>#REF!,1,0))))","v":"0"},{"$f":"IF(T209=\"\",\"0\",(IF(T209<AI209,1,IF(T209>#REF!,1,0))))","v":"0"}]
[null,null,null,null,null,null,null,null,null,null,null,null,null,null,null,null,null,null,null,null,null,"X","",null,null,null,null,0,0,{"$error":"#DIV/0!"},{"$error":"#DIV/0!"},{"$error":"#DIV/0!"},{"$error":"#DIV/0!"},{"$error":"#DIV/0!"},{"$error":"#DIV/0!"},{"$f":"IF(Q210=\"\",\"0\",(IF(P210<AI210,1,IF(Q210>#REF!,1,0))))","v":"0"},{"$f":"IF(R210=\"\",\"0\",(IF(R210<AI210,1,IF(R210>#REF!,1,0))))","v":"0"},{"$f":"IF(S210=\"\",\"0\",(IF(S210<AI210,1,IF(S210>#REF!,1,0))))","v":"0"},{"$f":"IF(T210=\"\",\"0\",(IF(T210<AI210,1,IF(T210>#REF!,1,0))))","v":"0"}]
[null,null,null,null,null,null,null,null,null,null,null,null,null,null,null,null,null,null,null,null,null,"X","",null,null,null,null,0,0,{"$error":"#DIV/0!"},{"$error":"#DIV/0!"},{"$error":"#DIV/0!"},{"$error":"#DIV/0!"},{"$error":"#DIV/0!"},{"$error":"#DIV/0!"},{"$f":"IF(Q211=\"\",\"0\",(IF(P211<AI211,1,IF(Q211>#REF!,1,0))))","v":"0"},{"$f":"IF(R211=\"\",\"0\",(IF(R211<AI211,1,IF(R211>#REF!,1,0))))","v":"0"},{"$f":"IF(S211=\"\",\"0\",(IF(S211<AI211,1,IF(S211>#REF!,1,0))))","v":"0"},{"$f":"IF(T211=\"\",\"0\",(IF(T211<AI211,1,IF(T211>#REF!,1,0))))","v":"0"}]
[null,null,null,null,null,null,null,null,null,null,null,null,null,null,null,null,null,null,null,null,null,"X","",null,null,null,null,0,0,{"$error":"#DIV/0!"},{"$error":"#DIV/0!"},{"$error":"#DIV/0!"},{"$error":"#DIV/0!"},{"$error":"#DIV/0!"},{"$error":"#DIV/0!"},{"$f":"IF(Q212=\"\",\"0\",(IF(P212<AI212,1,IF(Q212>#REF!,1,0))))","v":"0"},{"$f":"IF(R212=\"\",\"0\",(IF(R212<AI212,1,IF(R212>#REF!,1,0))))","v":"0"},{"$f":"IF(S212=\"\",\"0\",(IF(S212<AI212,1,IF(S212>#REF!,1,0))))","v":"0"},{"$f":"IF(T212=\"\",\"0\",(IF(T212<AI212,1,IF(T212>#REF!,1,0))))","v":"0"}]
[null,null,null,null,null,null,null,null,null,null,null,null,null,null,null,null,null,null,null,null,null,"X","",null,null,null,null,0,0,{"$error":"#DIV/0!"},{"$error":"#DIV/0!"},{"$error":"#DIV/0!"},{"$error":"#DIV/0!"},{"$error":"#DIV/0!"},{"$error":"#DIV/0!"},{"$f":"IF(Q213=\"\",\"0\",(IF(P213<AI213,1,IF(Q213>#REF!,1,0))))","v":"0"},{"$f":"IF(R213=\"\",\"0\",(IF(R213<AI213,1,IF(R213>#REF!,1,0))))","v":"0"},{"$f":"IF(S213=\"\",\"0\",(IF(S213<AI213,1,IF(S213>#REF!,1,0))))","v":"0"},{"$f":"IF(T213=\"\",\"0\",(IF(T213<AI213,1,IF(T213>#REF!,1,0))))","v":"0"}]
[null,null,null,null,null,null,null,null,null,null,null,null,null,null,null,null,null,null,null,null,null,"X","",null,null,null,null,0,0,{"$error":"#DIV/0!"},{"$error":"#DIV/0!"},{"$error":"#DIV/0!"},{"$error":"#DIV/0!"},{"$error":"#DIV/0!"},{"$error":"#DIV/0!"},{"$f":"IF(Q214=\"\",\"0\",(IF(P214<AI214,1,IF(Q214>#REF!,1,0))))","v":"0"},{"$f":"IF(R214=\"\",\"0\",(IF(R214<AI214,1,IF(R214>#REF!,1,0))))","v":"0"},{"$f":"IF(S214=\"\",\"0\",(IF(S214<AI214,1,IF(S214>#REF!,1,0))))","v":"0"},{"$f":"IF(T214=\"\",\"0\",(IF(T214<AI214,1,IF(T214>#REF!,1,0))))","v":"0"}]
[null,null,null,null,null,null,null,null,null,null,null,null,null,null,null,null,null,null,null,null,null,"X","",null,null,null,null,0,0,{"$error":"#DIV/0!"},{"$error":"#DIV/0!"},{"$error":"#DIV/0!"},{"$error":"#DIV/0!"},{"$error":"#DIV/0!"},{"$error":"#DIV/0!"},{"$f":"IF(Q215=\"\",\"0\",(IF(P215<AI215,1,IF(Q215>#REF!,1,0))))","v":"0"},{"$f":"IF(R215=\"\",\"0\",(IF(R215<AI215,1,IF(R215>#REF!,1,0))))","v":"0"},{"$f":"IF(S215=\"\",\"0\",(IF(S215<AI215,1,IF(S215>#REF!,1,0))))","v":"0"},{"$f":"IF(T215=\"\",\"0\",(IF(T215<AI215,1,IF(T215>#REF!,1,0))))","v":"0"}]
[null,null,null,null,null,null,null,null,null,null,null,null,null,null,null,null,null,null,null,null,null,"X","",null,null,null,null,0,0,{"$error":"#DIV/0!"},{"$error":"#DIV/0!"},{"$error":"#DIV/0!"},{"$error":"#DIV/0!"},{"$error":"#DIV/0!"},{"$error":"#DIV/0!"},{"$f":"IF(Q216=\"\",\"0\",(IF(P216<AI216,1,IF(Q216>#REF!,1,0))))","v":"0"},{"$f":"IF(R216=\"\",\"0\",(IF(R216<AI216,1,IF(R216>#REF!,1,0))))","v":"0"},{"$f":"IF(S216=\"\",\"0\",(IF(S216<AI216,1,IF(S216>#REF!,1,0))))","v":"0"},{"$f":"IF(T216=\"\",\"0\",(IF(T216<AI216,1,IF(T216>#REF!,1,0))))","v":"0"}]
[null,null,null,null,null,null,null,null,null,null,null,null,null,null,null,null,null,null,null,null,null,"X","",null,null,null,null,0,0,{"$error":"#DIV/0!"},{"$error":"#DIV/0!"},{"$error":"#DIV/0!"},{"$error":"#DIV/0!"},{"$error":"#DIV/0!"},{"$error":"#DIV/0!"},{"$f":"IF(Q217=\"\",\"0\",(IF(P217<AI217,1,IF(Q217>#REF!,1,0))))","v":"0"},{"$f":"IF(R217=\"\",\"0\",(IF(R217<AI217,1,IF(R217>#REF!,1,0))))","v":"0"},{"$f":"IF(S217=\"\",\"0\",(IF(S217<AI217,1,IF(S217>#REF!,1,0))))","v":"0"},{"$f":"IF(T217=\"\",\"0\",(IF(T217<AI217,1,IF(T217>#REF!,1,0))))","v":"0"}]
[null,null,null,null,null,null,null,null,null,null,null,null,null,null,null,null,null,null,null,null,null,"X","",null,null,null,null,0,0,{"$error":"#DIV/0!"},{"$error":"#DIV/0!"},{"$error":"#DIV/0!"},{"$error":"#DIV/0!"},{"$error":"#DIV/0!"},{"$error":"#DIV/0!"},{"$f":"IF(Q218=\"\",\"0\",(IF(P218<AI218,1,IF(Q218>#REF!,1,0))))","v":"0"},{"$f":"IF(R218=\"\",\"0\",(IF(R218<AI218,1,IF(R218>#REF!,1,0))))","v":"0"},{"$f":"IF(S218=\"\",\"0\",(IF(S218<AI218,1,IF(S218>#REF!,1,0))))","v":"0"},{"$f":"IF(T218=\"\",\"0\",(IF(T218<AI218,1,IF(T218>#REF!,1,0))))","v":"0"}]
[null,null,null,null,null,null,null,null,null,null,null,null,null,null,null,null,null,null,null,null,null,"X","",null,null,null,null,0,0,{"$error":"#DIV/0!"},{"$error":"#DIV/0!"},{"$error":"#DIV/0!"},{"$error":"#DIV/0!"},{"$error":"#DIV/0!"},{"$error":"#DIV/0!"},{"$f":"IF(Q219=\"\",\"0\",(IF(P219<AI219,1,IF(Q219>#REF!,1,0))))","v":"0"},{"$f":"IF(R219=\"\",\"0\",(IF(R219<AI219,1,IF(R219>#REF!,1,0))))","v":"0"},{"$f":"IF(S219=\"\",\"0\",(IF(S219<AI219,1,IF(S219>#REF!,1,0))))","v":"0"},{"$f":"IF(T219=\"\",\"0\",(IF(T219<AI219,1,IF(T219>#REF!,1,0))))","v":"0"}]
[null,null,null,null,null,null,null,null,null,null,null,null,null,null,null,null,null,null,null,null,null,"X","",null,null,null,null,0,0,{"$error":"#DIV/0!"},{"$error":"#DIV/0!"},{"$error":"#DIV/0!"},{"$error":"#DIV/0!"},{"$error":"#DIV/0!"},{"$error":"#DIV/0!"},{"$f":"IF(Q220=\"\",\"0\",(IF(P220<AI220,1,IF(Q220>#REF!,1,0))))","v":"0"},{"$f":"IF(R220=\"\",\"0\",(IF(R220<AI220,1,IF(R220>#REF!,1,0))))","v":"0"},{"$f":"IF(S220=\"\",\"0\",(IF(S220<AI220,1,IF(S220>#REF!,1,0))))","v":"0"},{"$f":"IF(T220=\"\",\"0\",(IF(T220<AI220,1,IF(T220>#REF!,1,0))))","v":"0"}]
[null,null,null,null,null,null,null,null,null,null,null,null,null,null,null,null,null,null,null,null,null,"X","",null,null,null,null,0,0,{"$error":"#DIV/0!"},{"$error":"#DIV/0!"},{"$error":"#DIV/0!"},{"$error":"#DIV/0!"},{"$error":"#DIV/0!"},{"$error":"#DIV/0!"},{"$f":"IF(Q221=\"\",\"0\",(IF(P221<AI221,1,IF(Q221>#REF!,1,0))))","v":"0"},{"$f":"IF(R221=\"\",\"0\",(IF(R221<AI221,1,IF(R221>#REF!,1,0))))","v":"0"},{"$f":"IF(S221=\"\",\"0\",(IF(S221<AI221,1,IF(S221>#REF!,1,0))))","v":"0"},{"$f":"IF(T221=\"\",\"0\",(IF(T221<AI221,1,IF(T221>#REF!,1,0))))","v":"0"}]
[null,null,null,null,null,null,null,null,null,null,null,null,null,null,null,null,null,null,null,null,null,"X","",null,null,null,null,0,0,{"$error":"#DIV/0!"},{"$error":"#DIV/0!"},{"$error":"#DIV/0!"},{"$error":"#DIV/0!"},{"$error":"#DIV/0!"},{"$error":"#DIV/0!"},{"$f":"IF(Q222=\"\",\"0\",(IF(P222<AI222,1,IF(Q222>#REF!,1,0))))","v":"0"},{"$f":"IF(R222=\"\",\"0\",(IF(R222<AI222,1,IF(R222>#REF!,1,0))))","v":"0"},{"$f":"IF(S222=\"\",\"0\",(IF(S222<AI222,1,IF(S222>#REF!,1,0))))","v":"0"},{"$f":"IF(T222=\"\",\"0\",(IF(T222<AI222,1,IF(T222>#REF!,1,0))))","v":"0"}]
[null,null,null,null,null,null,null,null,null,null,null,null,null,null,null,null,null,null,null,null,null,"X","",null,null,null,null,0,0,{"$error":"#DIV/0!"},{"$error":"#DIV/0!"},{"$error":"#DIV/0!"},{"$error":"#DIV/0!"},{"$error":"#DIV/0!"},{"$error":"#DIV/0!"},{"$f":"IF(Q223=\"\",\"0\",(IF(P223<AI223,1,IF(Q223>#REF!,1,0))))","v":"0"},{"$f":"IF(R223=\"\",\"0\",(IF(R223<AI223,1,IF(R223>#REF!,1,0))))","v":"0"},{"$f":"IF(S223=\"\",\"0\",(IF(S223<AI223,1,IF(S223>#REF!,1,0))))","v":"0"},{"$f":"IF(T223=\"\",\"0\",(IF(T223<AI223,1,IF(T223>#REF!,1,0))))","v":"0"}]
[null,null,null,null,null,null,null,null,null,null,null,null,null,null,null,null,null,null,null,null,null,"X","",null,null,null,null,0,0,{"$error":"#DIV/0!"},{"$error":"#DIV/0!"},{"$error":"#DIV/0!"},{"$error":"#DIV/0!"},{"$error":"#DIV/0!"},{"$error":"#DIV/0!"},{"$f":"IF(Q224=\"\",\"0\",(IF(P224<AI224,1,IF(Q224>#REF!,1,0))))","v":"0"},{"$f":"IF(R224=\"\",\"0\",(IF(R224<AI224,1,IF(R224>#REF!,1,0))))","v":"0"},{"$f":"IF(S224=\"\",\"0\",(IF(S224<AI224,1,IF(S224>#REF!,1,0))))","v":"0"},{"$f":"IF(T224=\"\",\"0\",(IF(T224<AI224,1,IF(T224>#REF!,1,0))))","v":"0"}]
[null,null,null,null,null,null,null,null,null,null,null,null,null,null,null,null,null,null,null,null,null,"X","",null,null,null,null,0,0,{"$error":"#DIV/0!"},{"$error":"#DIV/0!"},{"$error":"#DIV/0!"},{"$error":"#DIV/0!"},{"$error":"#DIV/0!"},{"$error":"#DIV/0!"},{"$f":"IF(Q225=\"\",\"0\",(IF(P225<AI225,1,IF(Q225>#REF!,1,0))))","v":"0"},{"$f":"IF(R225=\"\",\"0\",(IF(R225<AI225,1,IF(R225>#REF!,1,0))))","v":"0"},{"$f":"IF(S225=\"\",\"0\",(IF(S225<AI225,1,IF(S225>#REF!,1,0))))","v":"0"},{"$f":"IF(T225=\"\",\"0\",(IF(T225<AI225,1,IF(T225>#REF!,1,0))))","v":"0"}]
[null,null,null,null,null,null,null,null,null,null,null,null,null,null,null,null,null,null,null,null,null,"X","",null,null,null,null,0,0,{"$error":"#DIV/0!"},{"$error":"#DIV/0!"},{"$error":"#DIV/0!"},{"$error":"#DIV/0!"},{"$error":"#DIV/0!"},{"$error":"#DIV/0!"},{"$f":"IF(Q226=\"\",\"0\",(IF(P226<AI226,1,IF(Q226>#REF!,1,0))))","v":"0"},{"$f":"IF(R226=\"\",\"0\",(IF(R226<AI226,1,IF(R226>#REF!,1,0))))","v":"0"},{"$f":"IF(S226=\"\",\"0\",(IF(S226<AI226,1,IF(S226>#REF!,1,0))))","v":"0"},{"$f":"IF(T226=\"\",\"0\",(IF(T226<AI226,1,IF(T226>#REF!,1,0))))","v":"0"}]
[null,null,null,null,null,null,null,null,null,null,null,null,null,null,null,null,null,null,null,null,null,"X","",null,null,null,null,0,0,{"$error":"#DIV/0!"},{"$error":"#DIV/0!"},{"$error":"#DIV/0!"},{"$error":"#DIV/0!"},{"$error":"#DIV/0!"},{"$error":"#DIV/0!"},{"$f":"IF(Q227=\"\",\"0\",(IF(P227<AI227,1,IF(Q227>#REF!,1,0))))","v":"0"},{"$f":"IF(R227=\"\",\"0\",(IF(R227<AI227,1,IF(R227>#REF!,1,0))))","v":"0"},{"$f":"IF(S227=\"\",\"0\",(IF(S227<AI227,1,IF(S227>#REF!,1,0))))","v":"0"},{"$f":"IF(T227=\"\",\"0\",(IF(T227<AI227,1,IF(T227>#REF!,1,0))))","v":"0"}]
[null,null,null,null,null,null,null,null,null,null,null,null,null,null,null,null,null,null,null,null,null,"X","",null,null,null,null,0,0,{"$error":"#DIV/0!"},{"$error":"#DIV/0!"},{"$error":"#DIV/0!"},{"$error":"#DIV/0!"},{"$error":"#DIV/0!"},{"$error":"#DIV/0!"},{"$f":"IF(Q228=\"\",\"0\",(IF(P228<AI228,1,IF(Q228>#REF!,1,0))))","v":"0"},{"$f":"IF(R228=\"\",\"0\",(IF(R228<AI228,1,IF(R228>#REF!,1,0))))","v":"0"},{"$f":"IF(S228=\"\",\"0\",(IF(S228<AI228,1,IF(S228>#REF!,1,0))))","v":"0"},{"$f":"IF(T228=\"\",\"0\",(IF(T228<AI228,1,IF(T228>#REF!,1,0))))","v":"0"}]
[null,null,null,null,null,null,null,null,null,null,null,null,null,null,null,null,null,null,null,null,null,"X","",null,null,null,null,0,0,{"$error":"#DIV/0!"},{"$error":"#DIV/0!"},{"$error":"#DIV/0!"},{"$error":"#DIV/0!"},{"$error":"#DIV/0!"},{"$error":"#DIV/0!"},{"$f":"IF(Q229=\"\",\"0\",(IF(P229<AI229,1,IF(Q229>#REF!,1,0))))","v":"0"},{"$f":"IF(R229=\"\",\"0\",(IF(R229<AI229,1,IF(R229>#REF!,1,0))))","v":"0"},{"$f":"IF(S229=\"\",\"0\",(IF(S229<AI229,1,IF(S229>#REF!,1,0))))","v":"0"},{"$f":"IF(T229=\"\",\"0\",(IF(T229<AI229,1,IF(T229>#REF!,1,0))))","v":"0"}]
[null,null,null,null,null,null,null,null,null,null,null,null,null,null,null,null,null,null,null,null,null,"X","",null,null,null,null,0,0,{"$error":"#DIV/0!"},{"$error":"#DIV/0!"},{"$error":"#DIV/0!"},{"$error":"#DIV/0!"},{"$error":"#DIV/0!"},{"$error":"#DIV/0!"},{"$f":"IF(Q230=\"\",\"0\",(IF(P230<AI230,1,IF(Q230>#REF!,1,0))))","v":"0"},{"$f":"IF(R230=\"\",\"0\",(IF(R230<AI230,1,IF(R230>#REF!,1,0))))","v":"0"},{"$f":"IF(S230=\"\",\"0\",(IF(S230<AI230,1,IF(S230>#REF!,1,0))))","v":"0"},{"$f":"IF(T230=\"\",\"0\",(IF(T230<AI230,1,IF(T230>#REF!,1,0))))","v":"0"}]
[null,null,null,null,null,null,null,null,null,null,null,null,null,null,null,null,null,null,null,null,null,"X","",null,null,null,null,0,0,{"$error":"#DIV/0!"},{"$error":"#DIV/0!"},{"$error":"#DIV/0!"},{"$error":"#DIV/0!"},{"$error":"#DIV/0!"},{"$error":"#DIV/0!"},{"$f":"IF(Q231=\"\",\"0\",(IF(P231<AI231,1,IF(Q231>#REF!,1,0))))","v":"0"},{"$f":"IF(R231=\"\",\"0\",(IF(R231<AI231,1,IF(R231>#REF!,1,0))))","v":"0"},{"$f":"IF(S231=\"\",\"0\",(IF(S231<AI231,1,IF(S231>#REF!,1,0))))","v":"0"},{"$f":"IF(T231=\"\",\"0\",(IF(T231<AI231,1,IF(T231>#REF!,1,0))))","v":"0"}]
[null,null,null,null,null,null,null,null,null,null,null,null,null,null,null,null,null,null,null,null,null,"X","",null,null,null,null,null,null,{"$f":"IF(COUNTIFS(P232:T232,\"=P\")+(COUNTIFS(P232:T232,\"=F\")=0),IF(MAX(P232:T232)>(H232+J232),\"A\",IF(MIN(P232:T232)<(H232+I232),\"B\",\"X\")))","v":"X"},null,null,null,null,{"$f":"H232+I232","v":0},{"$f":"IF(Q232=\"\",\"0\",(IF(P232<AI232,1,IF(Q232>#REF!,1,0))))","v":"0"},{"$f":"IF(R232=\"\",\"0\",(IF(R232<AI232,1,IF(R232>#REF!,1,0))))","v":"0"},{"$f":"IF(S232=\"\",\"0\",(IF(S232<AI232,1,IF(S232>#REF!,1,0))))","v":"0"},{"$f":"IF(T232=\"\",\"0\",(IF(T232<AI232,1,IF(T232>#REF!,1,0))))","v":"0"}]
[null,null,null,null,null,null,null,null,null,null,null,null,null,null,null,null,null,null,null,null,null,"X","",null,null,null,null,null,null,"X",null,null,null,null,0,{"$f":"IF(Q233=\"\",\"0\",(IF(P233<AI233,1,IF(Q233>#REF!,1,0))))","v":"0"},{"$f":"IF(R233=\"\",\"0\",(IF(R233<AI233,1,IF(R233>#REF!,1,0))))","v":"0"},{"$f":"IF(S233=\"\",\"0\",(IF(S233<AI233,1,IF(S233>#REF!,1,0))))","v":"0"},{"$f":"IF(T233=\"\",\"0\",(IF(T233<AI233,1,IF(T233>#REF!,1,0))))","v":"0"}]
[null,null,null,null,null,null,null,null,null,null,null,null,null,null,null,null,null,null,null,null,null,"X","",null,null,null,null,null,null,"X",null,null,null,null,0,{"$f":"IF(Q234=\"\",\"0\",(IF(P234<AI234,1,IF(Q234>#REF!,1,0))))","v":"0"},{"$f":"IF(R234=\"\",\"0\",(IF(R234<AI234,1,IF(R234>#REF!,1,0))))","v":"0"},{"$f":"IF(S234=\"\",\"0\",(IF(S234<AI234,1,IF(S234>#REF!,1,0))))","v":"0"},{"$f":"IF(T234=\"\",\"0\",(IF(T234<AI234,1,IF(T234>#REF!,1,0))))","v":"0"}]
[null,null,null,null,null,null,null,null,null,null,null,null,null,null,null,null,null,null,null,null,null,"X","",null,null,null,null,null,null,"X",null,null,null,null,0,{"$f":"IF(Q235=\"\",\"0\",(IF(P235<AI235,1,IF(Q235>#REF!,1,0))))","v":"0"},{"$f":"IF(R235=\"\",\"0\",(IF(R235<AI235,1,IF(R235>#REF!,1,0))))","v":"0"},{"$f":"IF(S235=\"\",\"0\",(IF(S235<AI235,1,IF(S235>#REF!,1,0))))","v":"0"},{"$f":"IF(T235=\"\",\"0\",(IF(T235<AI235,1,IF(T235>#REF!,1,0))))","v":"0"}]
[null,null,null,null,null,null,null,null,null,null,null,null,null,null,null,null,null,null,null,null,null,"X","",null,null,null,null,null,null,"X",null,null,null,null,0,{"$f":"IF(Q236=\"\",\"0\",(IF(P236<AI236,1,IF(Q236>#REF!,1,0))))","v":"0"},{"$f":"IF(R236=\"\",\"0\",(IF(R236<AI236,1,IF(R236>#REF!,1,0))))","v":"0"},{"$f":"IF(S236=\"\",\"0\",(IF(S236<AI236,1,IF(S236>#REF!,1,0))))","v":"0"},{"$f":"IF(T236=\"\",\"0\",(IF(T236<AI236,1,IF(T236>#REF!,1,0))))","v":"0"}]
[null,null,null,null,null,null,null,null,null,null,null,null,null,null,null,null,null,null,null,null,null,"X","",null,null,null,null,null,null,"X",null,null,null,null,0,{"$f":"IF(Q237=\"\",\"0\",(IF(P237<AI237,1,IF(Q237>#REF!,1,0))))","v":"0"},{"$f":"IF(R237=\"\",\"0\",(IF(R237<AI237,1,IF(R237>#REF!,1,0))))","v":"0"},{"$f":"IF(S237=\"\",\"0\",(IF(S237<AI237,1,IF(S237>#REF!,1,0))))","v":"0"},{"$f":"IF(T237=\"\",\"0\",(IF(T237<AI237,1,IF(T237>#REF!,1,0))))","v":"0"}]
[null,null,null,null,null,null,null,null,null,null,null,null,null,null,null,null,null,null,null,null,null,"X","",null,null,null,null,null,null,"X",null,null,null,null,0,{"$f":"IF(Q238=\"\",\"0\",(IF(P238<AI238,1,IF(Q238>#REF!,1,0))))","v":"0"},{"$f":"IF(R238=\"\",\"0\",(IF(R238<AI238,1,IF(R238>#REF!,1,0))))","v":"0"},{"$f":"IF(S238=\"\",\"0\",(IF(S238<AI238,1,IF(S238>#REF!,1,0))))","v":"0"},{"$f":"IF(T238=\"\",\"0\",(IF(T238<AI238,1,IF(T238>#REF!,1,0))))","v":"0"}]
[null,null,null,null,null,null,null,null,null,null,null,null,null,null,null,null,null,null,null,null,null,"X","",null,null,null,null,null,null,"X",null,null,null,null,0,{"$f":"IF(Q239=\"\",\"0\",(IF(P239<AI239,1,IF(Q239>#REF!,1,0))))","v":"0"},{"$f":"IF(R239=\"\",\"0\",(IF(R239<AI239,1,IF(R239>#REF!,1,0))))","v":"0"},{"$f":"IF(S239=\"\",\"0\",(IF(S239<AI239,1,IF(S239>#REF!,1,0))))","v":"0"},{"$f":"IF(T239=\"\",\"0\",(IF(T239<AI239,1,IF(T239>#REF!,1,0))))","v":"0"}]
[null,null,null,null,null,null,null,null,null,null,null,null,null,null,null,null,null,null,null,null,null,"X","",null,null,null,null,null,null,"X",null,null,null,null,0,{"$f":"IF(Q240=\"\",\"0\",(IF(P240<AI240,1,IF(Q240>#REF!,1,0))))","v":"0"},{"$f":"IF(R240=\"\",\"0\",(IF(R240<AI240,1,IF(R240>#REF!,1,0))))","v":"0"},{"$f":"IF(S240=\"\",\"0\",(IF(S240<AI240,1,IF(S240>#REF!,1,0))))","v":"0"},{"$f":"IF(T240=\"\",\"0\",(IF(T240<AI240,1,IF(T240>#REF!,1,0))))","v":"0"}]
[null,null,null,null,null,null,null,null,null,null,null,null,null,null,null,null,null,null,null,null,null,"X","",null,null,null,null,null,null,"X",null,null,null,null,0,{"$f":"IF(Q241=\"\",\"0\",(IF(P241<AI241,1,IF(Q241>#REF!,1,0))))","v":"0"},{"$f":"IF(R241=\"\",\"0\",(IF(R241<AI241,1,IF(R241>#REF!,1,0))))","v":"0"},{"$f":"IF(S241=\"\",\"0\",(IF(S241<AI241,1,IF(S241>#REF!,1,0))))","v":"0"},{"$f":"IF(T241=\"\",\"0\",(IF(T241<AI241,1,IF(T241>#REF!,1,0))))","v":"0"}]
[null,null,null,null,null,null,null,null,null,null,null,null,null,null,null,null,null,null,null,null,null,"X","",null,null,null,null,null,null,"X",null,null,null,null,0,{"$f":"IF(Q242=\"\",\"0\",(IF(P242<AI242,1,IF(Q242>#REF!,1,0))))","v":"0"},{"$f":"IF(R242=\"\",\"0\",(IF(R242<AI242,1,IF(R242>#REF!,1,0))))","v":"0"},{"$f":"IF(S242=\"\",\"0\",(IF(S242<AI242,1,IF(S242>#REF!,1,0))))","v":"0"},{"$f":"IF(T242=\"\",\"0\",(IF(T242<AI242,1,IF(T242>#REF!,1,0))))","v":"0"}]
[null,null,null,null,null,null,null,null,null,null,null,null,null,null,null,null,null,null,null,null,null,"X","",null,null,null,null,null,null,"X",null,null,null,null,0,{"$f":"IF(Q243=\"\",\"0\",(IF(P243<AI243,1,IF(Q243>#REF!,1,0))))","v":"0"},{"$f":"IF(R243=\"\",\"0\",(IF(R243<AI243,1,IF(R243>#REF!,1,0))))","v":"0"},{"$f":"IF(S243=\"\",\"0\",(IF(S243<AI243,1,IF(S243>#REF!,1,0))))","v":"0"},{"$f":"IF(T243=\"\",\"0\",(IF(T243<AI243,1,IF(T243>#REF!,1,0))))","v":"0"}]
[null,null,null,null,null,null,null,null,null,null,null,null,null,null,null,null,null,null,null,null,null,"X","",null,null,null,null,null,null,"X",null,null,null,null,0,{"$f":"IF(Q244=\"\",\"0\",(IF(P244<AI244,1,IF(Q244>#REF!,1,0))))","v":"0"},{"$f":"IF(R244=\"\",\"0\",(IF(R244<AI244,1,IF(R244>#REF!,1,0))))","v":"0"},{"$f":"IF(S244=\"\",\"0\",(IF(S244<AI244,1,IF(S244>#REF!,1,0))))","v":"0"},{"$f":"IF(T244=\"\",\"0\",(IF(T244<AI244,1,IF(T244>#REF!,1,0))))","v":"0"}]
[null,null,null,null,null,null,null,null,null,null,null,null,null,null,null,null,null,null,null,null,null,"X","",null,null,null,null,null,null,"X",null,null,null,null,0,{"$f":"IF(Q245=\"\",\"0\",(IF(P245<AI245,1,IF(Q245>#REF!,1,0))))","v":"0"},{"$f":"IF(R245=\"\",\"0\",(IF(R245<AI245,1,IF(R245>#REF!,1,0))))","v":"0"},{"$f":"IF(S245=\"\",\"0\",(IF(S245<AI245,1,IF(S245>#REF!,1,0))))","v":"0"},{"$f":"IF(T245=\"\",\"0\",(IF(T245<AI245,1,IF(T245>#REF!,1,0))))","v":"0"}]
[null,null,null,null,null,null,null,null,null,null,null,null,null,null,null,null,null,null,null,null,null,"X","",null,null,null,null,null,null,"X",null,null,null,null,0,{"$f":"IF(Q246=\"\",\"0\",(IF(P246<AI246,1,IF(Q246>#REF!,1,0))))","v":"0"},{"$f":"IF(R246=\"\",\"0\",(IF(R246<AI246,1,IF(R246>#REF!,1,0))))","v":"0"},{"$f":"IF(S246=\"\",\"0\",(IF(S246<AI246,1,IF(S246>#REF!,1,0))))","v":"0"},{"$f":"IF(T246=\"\",\"0\",(IF(T246<AI246,1,IF(T246>#REF!,1,0))))","v":"0"}]
[null,null,null,null,null,null,null,null,null,null,null,null,null,null,null,null,null,null,null,null,null,"X","",null,null,null,null,null,null,"X",null,null,null,null,0,{"$f":"IF(Q247=\"\",\"0\",(IF(P247<AI247,1,IF(Q247>#REF!,1,0))))","v":"0"},{"$f":"IF(R247=\"\",\"0\",(IF(R247<AI247,1,IF(R247>#REF!,1,0))))","v":"0"},{"$f":"IF(S247=\"\",\"0\",(IF(S247<AI247,1,IF(S247>#REF!,1,0))))","v":"0"},{"$f":"IF(T247=\"\",\"0\",(IF(T247<AI247,1,IF(T247>#REF!,1,0))))","v":"0"}]
[null,null,null,null,null,null,null,null,null,null,null,null,null,null,null,null,null,null,null,null,null,"X","",null,null,null,null,null,null,"X",null,null,null,null,0,{"$f":"IF(Q248=\"\",\"0\",(IF(P248<AI248,1,IF(Q248>#REF!,1,0))))","v":"0"},{"$f":"IF(R248=\"\",\"0\",(IF(R248<AI248,1,IF(R248>#REF!,1,0))))","v":"0"},{"$f":"IF(S248=\"\",\"0\",(IF(S248<AI248,1,IF(S248>#REF!,1,0))))","v":"0"},{"$f":"IF(T248=\"\",\"0\",(IF(T248<AI248,1,IF(T248>#REF!,1,0))))","v":"0"}]
[null,null,null,null,null,null,null,null,null,null,null,null,null,null,null,null,null,null,null,null,null,"X","",null,null,null,null,null,null,"X",null,null,null,null,0,{"$f":"IF(Q249=\"\",\"0\",(IF(P249<AI249,1,IF(Q249>#REF!,1,0))))","v":"0"},{"$f":"IF(R249=\"\",\"0\",(IF(R249<AI249,1,IF(R249>#REF!,1,0))))","v":"0"},{"$f":"IF(S249=\"\",\"0\",(IF(S249<AI249,1,IF(S249>#REF!,1,0))))","v":"0"},{"$f":"IF(T249=\"\",\"0\",(IF(T249<AI249,1,IF(T249>#REF!,1,0))))","v":"0"}]
[null,null,null,null,null,null,null,null,null,null,null,null,null,null,null,null,null,null,null,null,null,"X","",null,null,null,null,null,null,"X",null,null,null,null,0,{"$f":"IF(Q250=\"\",\"0\",(IF(P250<AI250,1,IF(Q250>#REF!,1,0))))","v":"0"},{"$f":"IF(R250=\"\",\"0\",(IF(R250<AI250,1,IF(R250>#REF!,1,0))))","v":"0"},{"$f":"IF(S250=\"\",\"0\",(IF(S250<AI250,1,IF(S250>#REF!,1,0))))","v":"0"},{"$f":"IF(T250=\"\",\"0\",(IF(T250<AI250,1,IF(T250>#REF!,1,0))))","v":"0"}]
[null,null,null,null,null,null,null,null,null,null,null,null,null,null,null,null,null,null,null,null,null,"X","",null,null,null,null,null,null,"X",null,null,null,null,0,{"$f":"IF(Q251=\"\",\"0\",(IF(P251<AI251,1,IF(Q251>#REF!,1,0))))","v":"0"},{"$f":"IF(R251=\"\",\"0\",(IF(R251<AI251,1,IF(R251>#REF!,1,0))))","v":"0"},{"$f":"IF(S251=\"\",\"0\",(IF(S251<AI251,1,IF(S251>#REF!,1,0))))","v":"0"},{"$f":"IF(T251=\"\",\"0\",(IF(T251<AI251,1,IF(T251>#REF!,1,0))))","v":"0"}]
[null,null,null,null,null,null,null,null,null,null,null,null,null,null,null,null,null,null,null,null,null,"X","",null,null,null,null,null,null,"X",null,null,null,null,0,{"$f":"IF(Q252=\"\",\"0\",(IF(P252<AI252,1,IF(Q252>#REF!,1,0))))","v":"0"},{"$f":"IF(R252=\"\",\"0\",(IF(R252<AI252,1,IF(R252>#REF!,1,0))))","v":"0"},{"$f":"IF(S252=\"\",\"0\",(IF(S252<AI252,1,IF(S252>#REF!,1,0))))","v":"0"},{"$f":"IF(T252=\"\",\"0\",(IF(T252<AI252,1,IF(T252>#REF!,1,0))))","v":"0"}]
[null,null,null,null,null,null,null,null,null,null,null,null,null,null,null,null,null,null,null,null,null,"X","",null,null,null,null,null,null,"X",null,null,null,null,0,{"$f":"IF(Q253=\"\",\"0\",(IF(P253<AI253,1,IF(Q253>#REF!,1,0))))","v":"0"},{"$f":"IF(R253=\"\",\"0\",(IF(R253<AI253,1,IF(R253>#REF!,1,0))))","v":"0"},{"$f":"IF(S253=\"\",\"0\",(IF(S253<AI253,1,IF(S253>#REF!,1,0))))","v":"0"},{"$f":"IF(T253=\"\",\"0\",(IF(T253<AI253,1,IF(T253>#REF!,1,0))))","v":"0"}]
[null,null,null,null,null,null,null,null,null,null,null,null,null,null,null,null,null,null,null,null,null,"X","",null,null,null,null,null,null,"X",null,null,null,null,0,{"$f":"IF(Q254=\"\",\"0\",(IF(P254<AI254,1,IF(Q254>#REF!,1,0))))","v":"0"},{"$f":"IF(R254=\"\",\"0\",(IF(R254<AI254,1,IF(R254>#REF!,1,0))))","v":"0"},{"$f":"IF(S254=\"\",\"0\",(IF(S254<AI254,1,IF(S254>#REF!,1,0))))","v":"0"},{"$f":"IF(T254=\"\",\"0\",(IF(T254<AI254,1,IF(T254>#REF!,1,0))))","v":"0"}]
[null,null,null,null,null,null,null,null,null,null,null,null,null,null,null,null,null,null,null,null,null,"X","",null,null,null,null,null,null,"X",null,null,null,null,0,{"$f":"IF(Q255=\"\",\"0\",(IF(P255<AI255,1,IF(Q255>#REF!,1,0))))","v":"0"},{"$f":"IF(R255=\"\",\"0\",(IF(R255<AI255,1,IF(R255>#REF!,1,0))))","v":"0"},{"$f":"IF(S255=\"\",\"0\",(IF(S255<AI255,1,IF(S255>#REF!,1,0))))","v":"0"},{"$f":"IF(T255=\"\",\"0\",(IF(T255<AI255,1,IF(T255>#REF!,1,0))))","v":"0"}]
[null,null,null,null,null,null,null,null,null,null,null,null,null,null,null,null,null,null,null,null,null,"X","",null,null,null,null,null,null,"X",null,null,null,null,0,{"$f":"IF(Q256=\"\",\"0\",(IF(P256<AI256,1,IF(Q256>#REF!,1,0))))","v":"0"},{"$f":"IF(R256=\"\",\"0\",(IF(R256<AI256,1,IF(R256>#REF!,1,0))))","v":"0"},{"$f":"IF(S256=\"\",\"0\",(IF(S256<AI256,1,IF(S256>#REF!,1,0))))","v":"0"},{"$f":"IF(T256=\"\",\"0\",(IF(T256<AI256,1,IF(T256>#REF!,1,0))))","v":"0"}]
[null,null,null,null,null,null,null,null,null,null,null,null,null,null,null,null,null,null,null,null,null,"X","",null,null,null,null,null,null,"X",null,null,null,null,0,{"$f":"IF(Q257=\"\",\"0\",(IF(P257<AI257,1,IF(Q257>#REF!,1,0))))","v":"0"},{"$f":"IF(R257=\"\",\"0\",(IF(R257<AI257,1,IF(R257>#REF!,1,0))))","v":"0"},{"$f":"IF(S257=\"\",\"0\",(IF(S257<AI257,1,IF(S257>#REF!,1,0))))","v":"0"},{"$f":"IF(T257=\"\",\"0\",(IF(T257<AI257,1,IF(T257>#REF!,1,0))))","v":"0"}]
[null,null,null,null,null,null,null,null,null,null,null,null,null,null,null,null,null,null,null,null,null,"X","",null,null,null,null,null,null,"X",null,null,null,null,0,{"$f":"IF(Q258=\"\",\"0\",(IF(P258<AI258,1,IF(Q258>#REF!,1,0))))","v":"0"},{"$f":"IF(R258=\"\",\"0\",(IF(R258<AI258,1,IF(R258>#REF!,1,0))))","v":"0"},{"$f":"IF(S258=\"\",\"0\",(IF(S258<AI258,1,IF(S258>#REF!,1,0))))","v":"0"},{"$f":"IF(T258=\"\",\"0\",(IF(T258<AI258,1,IF(T258>#REF!,1,0))))","v":"0"}]
[null,null,null,null,null,null,null,null,null,null,null,null,null,null,null,null,null,null,null,null,null,"X","",null,null,null,null,null,null,"X",null,null,null,null,0,{"$f":"IF(Q259=\"\",\"0\",(IF(P259<AI259,1,IF(Q259>#REF!,1,0))))","v":"0"},{"$f":"IF(R259=\"\",\"0\",(IF(R259<AI259,1,IF(R259>#REF!,1,0))))","v":"0"},{"$f":"IF(S259=\"\",\"0\",(IF(S259<AI259,1,IF(S259>#REF!,1,0))))","v":"0"},{"$f":"IF(T259=\"\",\"0\",(IF(T259<AI259,1,IF(T259>#REF!,1,0))))","v":"0"}]
[null,null,null,null,null,null,null,null,null,null,null,null,null,null,null,null,null,null,null,null,null,"X","",null,null,null,null,null,null,"X",null,null,null,null,0,{"$f":"IF(Q260=\"\",\"0\",(IF(P260<AI260,1,IF(Q260>#REF!,1,0))))","v":"0"},{"$f":"IF(R260=\"\",\"0\",(IF(R260<AI260,1,IF(R260>#REF!,1,0))))","v":"0"},{"$f":"IF(S260=\"\",\"0\",(IF(S260<AI260,1,IF(S260>#REF!,1,0))))","v":"0"},{"$f":"IF(T260=\"\",\"0\",(IF(T260<AI260,1,IF(T260>#REF!,1,0))))","v":"0"}]
[null,null,null,null,null,null,null,null,null,null,null,null,null,null,null,null,null,null,null,null,null,"X","",null,null,null,null,null,null,"X",null,null,null,null,0,{"$f":"IF(Q261=\"\",\"0\",(IF(P261<AI261,1,IF(Q261>#REF!,1,0))))","v":"0"},{"$f":"IF(R261=\"\",\"0\",(IF(R261<AI261,1,IF(R261>#REF!,1,0))))","v":"0"},{"$f":"IF(S261=\"\",\"0\",(IF(S261<AI261,1,IF(S261>#REF!,1,0))))","v":"0"},{"$f":"IF(T261=\"\",\"0\",(IF(T261<AI261,1,IF(T261>#REF!,1,0))))","v":"0"}]
[null,null,null,null,null,null,null,null,null,null,null,null,null,null,null,null,null,null,null,null,null,"X","",null,null,null,null,null,null,"X",null,null,null,null,0,{"$f":"IF(Q262=\"\",\"0\",(IF(P262<AI262,1,IF(Q262>#REF!,1,0))))","v":"0"},{"$f":"IF(R262=\"\",\"0\",(IF(R262<AI262,1,IF(R262>#REF!,1,0))))","v":"0"},{"$f":"IF(S262=\"\",\"0\",(IF(S262<AI262,1,IF(S262>#REF!,1,0))))","v":"0"},{"$f":"IF(T262=\"\",\"0\",(IF(T262<AI262,1,IF(T262>#REF!,1,0))))","v":"0"}]
[null,null,null,null,null,null,null,null,null,null,null,null,null,null,null,null,null,null,null,null,null,"X","",null,null,null,null,null,null,"X",null,null,null,null,0,{"$f":"IF(Q263=\"\",\"0\",(IF(P263<AI263,1,IF(Q263>#REF!,1,0))))","v":"0"},{"$f":"IF(R263=\"\",\"0\",(IF(R263<AI263,1,IF(R263>#REF!,1,0))))","v":"0"},{"$f":"IF(S263=\"\",\"0\",(IF(S263<AI263,1,IF(S263>#REF!,1,0))))","v":"0"},{"$f":"IF(T263=\"\",\"0\",(IF(T263<AI263,1,IF(T263>#REF!,1,0))))","v":"0"}]
[null,null,null,null,null,null,null,null,null,null,null,null,null,null,null,null,null,null,null,null,null,"X","",null,null,null,null,null,null,"X",null,null,null,null,0,{"$f":"IF(Q264=\"\",\"0\",(IF(P264<AI264,1,IF(Q264>#REF!,1,0))))","v":"0"},{"$f":"IF(R264=\"\",\"0\",(IF(R264<AI264,1,IF(R264>#REF!,1,0))))","v":"0"},{"$f":"IF(S264=\"\",\"0\",(IF(S264<AI264,1,IF(S264>#REF!,1,0))))","v":"0"},{"$f":"IF(T264=\"\",\"0\",(IF(T264<AI264,1,IF(T264>#REF!,1,0))))","v":"0"}]
[null,null,null,null,null,null,null,null,null,null,null,null,null,null,null,null,null,null,null,null,null,"X","",null,null,null,null,null,null,"X",null,null,null,null,0,{"$f":"IF(Q265=\"\",\"0\",(IF(P265<AI265,1,IF(Q265>#REF!,1,0))))","v":"0"},{"$f":"IF(R265=\"\",\"0\",(IF(R265<AI265,1,IF(R265>#REF!,1,0))))","v":"0"},{"$f":"IF(S265=\"\",\"0\",(IF(S265<AI265,1,IF(S265>#REF!,1,0))))","v":"0"},{"$f":"IF(T265=\"\",\"0\",(IF(T265<AI265,1,IF(T265>#REF!,1,0))))","v":"0"}]
[null,null,null,null,null,null,null,null,null,null,null,null,null,null,null,null,null,null,null,null,null,"X","",null,null,null,null,null,null,"X",null,null,null,null,0,{"$f":"IF(Q266=\"\",\"0\",(IF(P266<AI266,1,IF(Q266>#REF!,1,0))))","v":"0"},{"$f":"IF(R266=\"\",\"0\",(IF(R266<AI266,1,IF(R266>#REF!,1,0))))","v":"0"},{"$f":"IF(S266=\"\",\"0\",(IF(S266<AI266,1,IF(S266>#REF!,1,0))))","v":"0"},{"$f":"IF(T266=\"\",\"0\",(IF(T266<AI266,1,IF(T266>#REF!,1,0))))","v":"0"}]
[null,null,null,null,null,null,null,null,null,null,null,null,null,null,null,null,null,null,null,null,null,"X","",null,null,null,null,null,null,"X",null,null,null,null,0,{"$f":"IF(Q267=\"\",\"0\",(IF(P267<AI267,1,IF(Q267>#REF!,1,0))))","v":"0"},{"$f":"IF(R267=\"\",\"0\",(IF(R267<AI267,1,IF(R267>#REF!,1,0))))","v":"0"},{"$f":"IF(S267=\"\",\"0\",(IF(S267<AI267,1,IF(S267>#REF!,1,0))))","v":"0"},{"$f":"IF(T267=\"\",\"0\",(IF(T267<AI267,1,IF(T267>#REF!,1,0))))","v":"0"}]
[null,null,null,null,null,null,null,null,null,null,null,null,null,null,null,null,null,null,null,null,null,"X","",null,null,null,null,null,null,"X",null,null,null,null,0,{"$f":"IF(Q268=\"\",\"0\",(IF(P268<AI268,1,IF(Q268>#REF!,1,0))))","v":"0"},{"$f":"IF(R268=\"\",\"0\",(IF(R268<AI268,1,IF(R268>#REF!,1,0))))","v":"0"},{"$f":"IF(S268=\"\",\"0\",(IF(S268<AI268,1,IF(S268>#REF!,1,0))))","v":"0"},{"$f":"IF(T268=\"\",\"0\",(IF(T268<AI268,1,IF(T268>#REF!,1,0))))","v":"0"}]
[null,null,null,null,null,null,null,null,null,null,null,null,null,null,null,null,null,null,null,null,null,"X","",null,null,null,null,null,null,"X",null,null,null,null,0,{"$f":"IF(Q269=\"\",\"0\",(IF(P269<AI269,1,IF(Q269>#REF!,1,0))))","v":"0"},{"$f":"IF(R269=\"\",\"0\",(IF(R269<AI269,1,IF(R269>#REF!,1,0))))","v":"0"},{"$f":"IF(S269=\"\",\"0\",(IF(S269<AI269,1,IF(S269>#REF!,1,0))))","v":"0"},{"$f":"IF(T269=\"\",\"0\",(IF(T269<AI269,1,IF(T269>#REF!,1,0))))","v":"0"}]
[null,null,null,null,null,null,null,null,null,null,null,null,null,null,null,null,null,null,null,null,null,"X","",null,null,null,null,null,null,"X",null,null,null,null,0,{"$f":"IF(Q270=\"\",\"0\",(IF(P270<AI270,1,IF(Q270>#REF!,1,0))))","v":"0"},{"$f":"IF(R270=\"\",\"0\",(IF(R270<AI270,1,IF(R270>#REF!,1,0))))","v":"0"},{"$f":"IF(S270=\"\",\"0\",(IF(S270<AI270,1,IF(S270>#REF!,1,0))))","v":"0"},{"$f":"IF(T270=\"\",\"0\",(IF(T270<AI270,1,IF(T270>#REF!,1,0))))","v":"0"}]
[null,null,null,null,null,null,null,null,null,null,null,null,null,null,null,null,null,null,null,null,null,{"$f":"IF(I271=\"Ref\",\"\",(IF(I271=\"Basic\",\"\",(IF(P271=\"P\",\"X\",(IF(P271=\"F\",\"\",IF(MAX(P271:T271)>(H271+J271),\"\",IF(MIN(P271:T271)<(H271+I271),\"\",\"X\")))))))))","v":"X"},{"$f":"IF(I271=\"Ref\",\"\",(IF(I271=\"Basic\",\"\",(IF(P271=\"P\",\"\",IF(P271=\"F\",\"X\",IF(MAX(P271:T271)>(H271+J271),\"X\",IF(MIN(P271:T271)<(H271+I271),\"X\",\"\"))))))))","v":""},null,null,null,null,null,null,"X",null,null,null,null,0,{"$f":"IF(Q271=\"\",\"0\",(IF(P271<AI271,1,IF(Q271>#REF!,1,0))))","v":"0"},{"$f":"IF(R271=\"\",\"0\",(IF(R271<AI271,1,IF(R271>#REF!,1,0))))","v":"0"},{"$f":"IF(S271=\"\",\"0\",(IF(S271<AI271,1,IF(S271>#REF!,1,0))))","v":"0"},{"$f":"IF(T271=\"\",\"0\",(IF(T271<AI271,1,IF(T271>#REF!,1,0))))","v":"0"}]
[null,null,null,null,null,null,null,null,null,null,null,null,null,null,null,null,null,null,null,null,null,"X","",null,null,null,null,null,null,"X",null,null,null,null,0,{"$f":"IF(Q272=\"\",\"0\",(IF(P272<AI272,1,IF(Q272>#REF!,1,0))))","v":"0"},{"$f":"IF(R272=\"\",\"0\",(IF(R272<AI272,1,IF(R272>#REF!,1,0))))","v":"0"},{"$f":"IF(S272=\"\",\"0\",(IF(S272<AI272,1,IF(S272>#REF!,1,0))))","v":"0"},{"$f":"IF(T272=\"\",\"0\",(IF(T272<AI272,1,IF(T272>#REF!,1,0))))","v":"0"}]
[null,null,null,null,null,null,null,null,null,null,null,null,null,null,null,null,null,null,null,null,null,"X","",null,null,null,null,null,null,"X",null,null,null,null,0,{"$f":"IF(Q273=\"\",\"0\",(IF(P273<AI273,1,IF(Q273>#REF!,1,0))))","v":"0"},{"$f":"IF(R273=\"\",\"0\",(IF(R273<AI273,1,IF(R273>#REF!,1,0))))","v":"0"},{"$f":"IF(S273=\"\",\"0\",(IF(S273<AI273,1,IF(S273>#REF!,1,0))))","v":"0"},{"$f":"IF(T273=\"\",\"0\",(IF(T273<AI273,1,IF(T273>#REF!,1,0))))","v":"0"}]
[null,null,null,null,null,null,null,null,null,null,null,null,null,null,null,null,null,null,null,null,null,"X","",null,null,null,null,null,null,"X",null,null,null,null,0,{"$f":"IF(Q274=\"\",\"0\",(IF(P274<AI274,1,IF(Q274>#REF!,1,0))))","v":"0"},{"$f":"IF(R274=\"\",\"0\",(IF(R274<AI274,1,IF(R274>#REF!,1,0))))","v":"0"},{"$f":"IF(S274=\"\",\"0\",(IF(S274<AI274,1,IF(S274>#REF!,1,0))))","v":"0"},{"$f":"IF(T274=\"\",\"0\",(IF(T274<AI274,1,IF(T274>#REF!,1,0))))","v":"0"}]
[null,null,null,null,null,null,null,null,null,null,null,null,null,null,null,null,null,null,null,null,null,"X","",null,null,null,null,null,null,"X",null,null,null,null,0,{"$f":"IF(Q275=\"\",\"0\",(IF(P275<AI275,1,IF(Q275>#REF!,1,0))))","v":"0"},{"$f":"IF(R275=\"\",\"0\",(IF(R275<AI275,1,IF(R275>#REF!,1,0))))","v":"0"},{"$f":"IF(S275=\"\",\"0\",(IF(S275<AI275,1,IF(S275>#REF!,1,0))))","v":"0"},{"$f":"IF(T275=\"\",\"0\",(IF(T275<AI275,1,IF(T275>#REF!,1,0))))","v":"0"}]
[null,null,null,null,null,null,null,null,null,null,null,null,null,null,null,null,null,null,null,null,null,"X","",null,null,null,null,null,null,"X",null,null,null,null,0,{"$f":"IF(Q276=\"\",\"0\",(IF(P276<AI276,1,IF(Q276>#REF!,1,0))))","v":"0"},{"$f":"IF(R276=\"\",\"0\",(IF(R276<AI276,1,IF(R276>#REF!,1,0))))","v":"0"},{"$f":"IF(S276=\"\",\"0\",(IF(S276<AI276,1,IF(S276>#REF!,1,0))))","v":"0"},{"$f":"IF(T276=\"\",\"0\",(IF(T276<AI276,1,IF(T276>#REF!,1,0))))","v":"0"}]
[null,null,null,null,null,null,null,null,null,null,null,null,null,null,null,null,null,null,null,null,null,"X","",null,null,null,null,null,null,"X",null,null,null,null,0,{"$f":"IF(Q277=\"\",\"0\",(IF(P277<AI277,1,IF(Q277>#REF!,1,0))))","v":"0"},{"$f":"IF(R277=\"\",\"0\",(IF(R277<AI277,1,IF(R277>#REF!,1,0))))","v":"0"},{"$f":"IF(S277=\"\",\"0\",(IF(S277<AI277,1,IF(S277>#REF!,1,0))))","v":"0"},{"$f":"IF(T277=\"\",\"0\",(IF(T277<AI277,1,IF(T277>#REF!,1,0))))","v":"0"}]
[null,null,null,null,null,null,null,null,null,null,null,null,null,null,null,null,null,null,null,null,null,"X","",null,null,null,null,null,null,"X",null,null,null,null,0,{"$f":"IF(Q278=\"\",\"0\",(IF(P278<AI278,1,IF(Q278>#REF!,1,0))))","v":"0"},{"$f":"IF(R278=\"\",\"0\",(IF(R278<AI278,1,IF(R278>#REF!,1,0))))","v":"0"},{"$f":"IF(S278=\"\",\"0\",(IF(S278<AI278,1,IF(S278>#REF!,1,0))))","v":"0"},{"$f":"IF(T278=\"\",\"0\",(IF(T278<AI278,1,IF(T278>#REF!,1,0))))","v":"0"}]
[null,null,null,null,null,null,null,null,null,null,null,null,null,null,null,null,null,null,null,null,null,"X","",null,null,null,null,null,null,"X",null,null,null,null,0,{"$f":"IF(Q279=\"\",\"0\",(IF(P279<AI279,1,IF(Q279>#REF!,1,0))))","v":"0"},{"$f":"IF(R279=\"\",\"0\",(IF(R279<AI279,1,IF(R279>#REF!,1,0))))","v":"0"},{"$f":"IF(S279=\"\",\"0\",(IF(S279<AI279,1,IF(S279>#REF!,1,0))))","v":"0"},{"$f":"IF(T279=\"\",\"0\",(IF(T279<AI279,1,IF(T279>#REF!,1,0))))","v":"0"}]
[null,null,null,null,null,null,null,null,null,null,null,null,null,null,null,null,null,null,null,null,null,"X","",null,null,null,null,null,null,"X",null,null,null,null,0,{"$f":"IF(Q280=\"\",\"0\",(IF(P280<AI280,1,IF(Q280>#REF!,1,0))))","v":"0"},{"$f":"IF(R280=\"\",\"0\",(IF(R280<AI280,1,IF(R280>#REF!,1,0))))","v":"0"},{"$f":"IF(S280=\"\",\"0\",(IF(S280<AI280,1,IF(S280>#REF!,1,0))))","v":"0"},{"$f":"IF(T280=\"\",\"0\",(IF(T280<AI280,1,IF(T280>#REF!,1,0))))","v":"0"}]
[null,null,null,null,null,null,null,null,null,null,null,null,null,null,null,null,null,null,null,null,null,"X","",null,null,null,null,null,null,"X",null,null,null,null,0,{"$f":"IF(Q281=\"\",\"0\",(IF(P281<AI281,1,IF(Q281>#REF!,1,0))))","v":"0"},{"$f":"IF(R281=\"\",\"0\",(IF(R281<AI281,1,IF(R281>#REF!,1,0))))","v":"0"},{"$f":"IF(S281=\"\",\"0\",(IF(S281<AI281,1,IF(S281>#REF!,1,0))))","v":"0"},{"$f":"IF(T281=\"\",\"0\",(IF(T281<AI281,1,IF(T281>#REF!,1,0))))","v":"0"}]
[null,null,null,null,null,null,null,null,null,null,null,null,null,null,null,null,null,null,null,null,null,"X","",null,null,null,null,null,null,"X",null,null,null,null,0,{"$f":"IF(Q282=\"\",\"0\",(IF(P282<AI282,1,IF(Q282>#REF!,1,0))))","v":"0"},{"$f":"IF(R282=\"\",\"0\",(IF(R282<AI282,1,IF(R282>#REF!,1,0))))","v":"0"},{"$f":"IF(S282=\"\",\"0\",(IF(S282<AI282,1,IF(S282>#REF!,1,0))))","v":"0"},{"$f":"IF(T282=\"\",\"0\",(IF(T282<AI282,1,IF(T282>#REF!,1,0))))","v":"0"}]
[null,null,null,null,null,null,null,null,null,null,null,null,null,null,null,null,null,null,null,null,null,"X","",null,null,null,null,null,null,"X",null,null,null,null,0,{"$f":"IF(Q283=\"\",\"0\",(IF(P283<AI283,1,IF(Q283>#REF!,1,0))))","v":"0"},{"$f":"IF(R283=\"\",\"0\",(IF(R283<AI283,1,IF(R283>#REF!,1,0))))","v":"0"},{"$f":"IF(S283=\"\",\"0\",(IF(S283<AI283,1,IF(S283>#REF!,1,0))))","v":"0"},{"$f":"IF(T283=\"\",\"0\",(IF(T283<AI283,1,IF(T283>#REF!,1,0))))","v":"0"}]
[null,null,null,null,null,null,null,null,null,null,null,null,null,null,null,null,null,null,null,null,null,"X","",null,null,null,null,null,null,"X",null,null,null,null,0,{"$f":"IF(Q284=\"\",\"0\",(IF(P284<AI284,1,IF(Q284>#REF!,1,0))))","v":"0"},{"$f":"IF(R284=\"\",\"0\",(IF(R284<AI284,1,IF(R284>#REF!,1,0))))","v":"0"},{"$f":"IF(S284=\"\",\"0\",(IF(S284<AI284,1,IF(S284>#REF!,1,0))))","v":"0"},{"$f":"IF(T284=\"\",\"0\",(IF(T284<AI284,1,IF(T284>#REF!,1,0))))","v":"0"}]
[null,null,null,null,null,null,null,null,null,null,null,null,null,null,null,null,null,null,null,null,null,"X","",null,null,null,null,null,null,"X",null,null,null,null,0,{"$f":"IF(Q285=\"\",\"0\",(IF(P285<AI285,1,IF(Q285>#REF!,1,0))))","v":"0"},{"$f":"IF(R285=\"\",\"0\",(IF(R285<AI285,1,IF(R285>#REF!,1,0))))","v":"0"},{"$f":"IF(S285=\"\",\"0\",(IF(S285<AI285,1,IF(S285>#REF!,1,0))))","v":"0"},{"$f":"IF(T285=\"\",\"0\",(IF(T285<AI285,1,IF(T285>#REF!,1,0))))","v":"0"}]
[null,null,null,null,null,null,null,null,null,null,null,null,null,null,null,null,null,null,null,null,null,"X","",null,null,null,null,null,null,"X",null,null,null,null,0,{"$f":"IF(Q286=\"\",\"0\",(IF(P286<AI286,1,IF(Q286>#REF!,1,0))))","v":"0"},{"$f":"IF(R286=\"\",\"0\",(IF(R286<AI286,1,IF(R286>#REF!,1,0))))","v":"0"},{"$f":"IF(S286=\"\",\"0\",(IF(S286<AI286,1,IF(S286>#REF!,1,0))))","v":"0"},{"$f":"IF(T286=\"\",\"0\",(IF(T286<AI286,1,IF(T286>#REF!,1,0))))","v":"0"}]
[null,null,null,null,null,null,null,null,null,null,null,null,null,null,null,null,null,null,null,null,null,"X","",null,null,null,null,null,null,"X",null,null,null,null,0,{"$f":"IF(Q287=\"\",\"0\",(IF(P287<AI287,1,IF(Q287>#REF!,1,0))))","v":"0"},{"$f":"IF(R287=\"\",\"0\",(IF(R287<AI287,1,IF(R287>#REF!,1,0))))","v":"0"},{"$f":"IF(S287=\"\",\"0\",(IF(S287<AI287,1,IF(S287>#REF!,1,0))))","v":"0"},{"$f":"IF(T287=\"\",\"0\",(IF(T287<AI287,1,IF(T287>#REF!,1,0))))","v":"0"}]
[null,null,null,null,null,null,null,null,null,null,null,null,null,null,null,null,null,null,null,null,null,"X","",null,null,null,null,null,null,"X",null,null,null,null,0,{"$f":"IF(Q288=\"\",\"0\",(IF(P288<AI288,1,IF(Q288>#REF!,1,0))))","v":"0"},{"$f":"IF(R288=\"\",\"0\",(IF(R288<AI288,1,IF(R288>#REF!,1,0))))","v":"0"},{"$f":"IF(S288=\"\",\"0\",(IF(S288<AI288,1,IF(S288>#REF!,1,0))))","v":"0"},{"$f":"IF(T288=\"\",\"0\",(IF(T288<AI288,1,IF(T288>#REF!,1,0))))","v":"0"}]
[null,null,null,null,null,null,null,null,null,null,null,null,null,null,null,null,null,null,null,null,null,"X","",null,null,null,null,null,null,"X",null,null,null,null,0,{"$f":"IF(Q289=\"\",\"0\",(IF(P289<AI289,1,IF(Q289>#REF!,1,0))))","v":"0"},{"$f":"IF(R289=\"\",\"0\",(IF(R289<AI289,1,IF(R289>#REF!,1,0))))","v":"0"},{"$f":"IF(S289=\"\",\"0\",(IF(S289<AI289,1,IF(S289>#REF!,1,0))))","v":"0"},{"$f":"IF(T289=\"\",\"0\",(IF(T289<AI289,1,IF(T289>#REF!,1,0))))","v":"0"}]
[null,null,null,null,null,null,null,null,null,null,null,null,null,null,null,null,null,null,null,null,null,"X","",null,null,null,null,null,null,"X",null,null,null,null,0,{"$f":"IF(Q290=\"\",\"0\",(IF(P290<AI290,1,IF(Q290>#REF!,1,0))))","v":"0"},{"$f":"IF(R290=\"\",\"0\",(IF(R290<AI290,1,IF(R290>#REF!,1,0))))","v":"0"},{"$f":"IF(S290=\"\",\"0\",(IF(S290<AI290,1,IF(S290>#REF!,1,0))))","v":"0"},{"$f":"IF(T290=\"\",\"0\",(IF(T290<AI290,1,IF(T290>#REF!,1,0))))","v":"0"}]
[null,null,null,null,null,null,null,null,null,null,null,null,null,null,null,null,null,null,null,null,null,"X","",null,null,null,null,null,null,"X",null,null,null,null,0,{"$f":"IF(Q291=\"\",\"0\",(IF(P291<AI291,1,IF(Q291>#REF!,1,0))))","v":"0"},{"$f":"IF(R291=\"\",\"0\",(IF(R291<AI291,1,IF(R291>#REF!,1,0))))","v":"0"},{"$f":"IF(S291=\"\",\"0\",(IF(S291<AI291,1,IF(S291>#REF!,1,0))))","v":"0"},{"$f":"IF(T291=\"\",\"0\",(IF(T291<AI291,1,IF(T291>#REF!,1,0))))","v":"0"}]
[null,null,null,null,null,null,null,null,null,null,null,null,null,null,null,null,null,null,null,null,null,"X","",null,null,null,null,null,null,"X",null,null,null,null,0,{"$f":"IF(Q292=\"\",\"0\",(IF(P292<AI292,1,IF(Q292>#REF!,1,0))))","v":"0"},{"$f":"IF(R292=\"\",\"0\",(IF(R292<AI292,1,IF(R292>#REF!,1,0))))","v":"0"},{"$f":"IF(S292=\"\",\"0\",(IF(S292<AI292,1,IF(S292>#REF!,1,0))))","v":"0"},{"$f":"IF(T292=\"\",\"0\",(IF(T292<AI292,1,IF(T292>#REF!,1,0))))","v":"0"}]
[null,null,null,null,null,null,null,null,null,null,null,null,null,null,null,null,null,null,null,null,null,"X","",null,null,null,null,null,null,"X",null,null,null,null,0,{"$f":"IF(Q293=\"\",\"0\",(IF(P293<AI293,1,IF(Q293>#REF!,1,0))))","v":"0"},{"$f":"IF(R293=\"\",\"0\",(IF(R293<AI293,1,IF(R293>#REF!,1,0))))","v":"0"},{"$f":"IF(S293=\"\",\"0\",(IF(S293<AI293,1,IF(S293>#REF!,1,0))))","v":"0"},{"$f":"IF(T293=\"\",\"0\",(IF(T293<AI293,1,IF(T293>#REF!,1,0))))","v":"0"}]
[null,null,null,null,null,null,null,null,null,null,null,null,null,null,null,null,null,null,null,null,null,"X","",null,null,null,null,null,null,"X",null,null,null,null,0,{"$f":"IF(Q294=\"\",\"0\",(IF(P294<AI294,1,IF(Q294>#REF!,1,0))))","v":"0"},{"$f":"IF(R294=\"\",\"0\",(IF(R294<AI294,1,IF(R294>#REF!,1,0))))","v":"0"},{"$f":"IF(S294=\"\",\"0\",(IF(S294<AI294,1,IF(S294>#REF!,1,0))))","v":"0"},{"$f":"IF(T294=\"\",\"0\",(IF(T294<AI294,1,IF(T294>#REF!,1,0))))","v":"0"}]
[null,null,null,null,null,null,null,null,null,null,null,null,null,null,null,null,null,null,null,null,null,"X","",null,null,null,null,null,null,"X",null,null,null,null,0,{"$f":"IF(Q295=\"\",\"0\",(IF(P295<AI295,1,IF(Q295>#REF!,1,0))))","v":"0"},{"$f":"IF(R295=\"\",\"0\",(IF(R295<AI295,1,IF(R295>#REF!,1,0))))","v":"0"},{"$f":"IF(S295=\"\",\"0\",(IF(S295<AI295,1,IF(S295>#REF!,1,0))))","v":"0"},{"$f":"IF(T295=\"\",\"0\",(IF(T295<AI295,1,IF(T295>#REF!,1,0))))","v":"0"}]
[null,null,null,null,null,null,null,null,null,null,null,null,null,null,null,null,null,null,null,null,null,"X","",null,null,null,null,null,null,{"$f":"IF(COUNTIFS(P296:T296,\"=P\")+(COUNTIFS(P296:T296,\"=F\")=0),IF(MAX(P296:T296)>(H296+J296),\"A\",IF(MIN(P296:T296)<(H296+I296),\"B\",\"X\")))","v":"X"},null,null,null,null,{"$f":"H296+I296","v":0},{"$f":"IF(Q296=\"\",\"0\",(IF(P296<AI296,1,IF(Q296>#REF!,1,0))))","v":"0"},{"$f":"IF(R296=\"\",\"0\",(IF(R296<AI296,1,IF(R296>#REF!,1,0))))","v":"0"},{"$f":"IF(S296=\"\",\"0\",(IF(S296<AI296,1,IF(S296>#REF!,1,0))))","v":"0"},{"$f":"IF(T296=\"\",\"0\",(IF(T296<AI296,1,IF(T296>#REF!,1,0))))","v":"0"}]
[null,null,null,null,null,null,null,null,null,null,null,null,null,null,null,null,null,null,null,null,null,"X","",null,null,null,null,null,null,"X",null,null,null,null,0,{"$f":"IF(Q297=\"\",\"0\",(IF(P297<AI297,1,IF(Q297>#REF!,1,0))))","v":"0"},{"$f":"IF(R297=\"\",\"0\",(IF(R297<AI297,1,IF(R297>#REF!,1,0))))","v":"0"},{"$f":"IF(S297=\"\",\"0\",(IF(S297<AI297,1,IF(S297>#REF!,1,0))))","v":"0"},{"$f":"IF(T297=\"\",\"0\",(IF(T297<AI297,1,IF(T297>#REF!,1,0))))","v":"0"}]
[null,null,null,null,null,null,null,null,null,null,null,null,null,null,null,null,null,null,null,null,null,"X","",null,null,null,null,null,null,"X",null,null,null,null,0,{"$f":"IF(Q298=\"\",\"0\",(IF(P298<AI298,1,IF(Q298>#REF!,1,0))))","v":"0"},{"$f":"IF(R298=\"\",\"0\",(IF(R298<AI298,1,IF(R298>#REF!,1,0))))","v":"0"},{"$f":"IF(S298=\"\",\"0\",(IF(S298<AI298,1,IF(S298>#REF!,1,0))))","v":"0"},{"$f":"IF(T298=\"\",\"0\",(IF(T298<AI298,1,IF(T298>#REF!,1,0))))","v":"0"}]
[null,null,null,null,null,null,null,null,null,null,null,null,null,null,null,null,null,null,null,null,null,"X","",null,null,null,null,null,null,"X",null,null,null,null,0,{"$f":"IF(Q299=\"\",\"0\",(IF(P299<AI299,1,IF(Q299>#REF!,1,0))))","v":"0"},{"$f":"IF(R299=\"\",\"0\",(IF(R299<AI299,1,IF(R299>#REF!,1,0))))","v":"0"},{"$f":"IF(S299=\"\",\"0\",(IF(S299<AI299,1,IF(S299>#REF!,1,0))))","v":"0"},{"$f":"IF(T299=\"\",\"0\",(IF(T299<AI299,1,IF(T299>#REF!,1,0))))","v":"0"}]
[null,null,null,null,null,null,null,null,null,null,null,null,null,null,null,null,null,null,null,null,null,"X","",null,null,null,null,null,null,"X",null,null,null,null,0,{"$f":"IF(Q300=\"\",\"0\",(IF(P300<AI300,1,IF(Q300>#REF!,1,0))))","v":"0"},{"$f":"IF(R300=\"\",\"0\",(IF(R300<AI300,1,IF(R300>#REF!,1,0))))","v":"0"},{"$f":"IF(S300=\"\",\"0\",(IF(S300<AI300,1,IF(S300>#REF!,1,0))))","v":"0"},{"$f":"IF(T300=\"\",\"0\",(IF(T300<AI300,1,IF(T300>#REF!,1,0))))","v":"0"}]
[null,null,null,null,null,null,null,null,null,null,null,null,null,null,null,null,null,null,null,null,null,"X","",null,null,null,null,null,null,"X",null,null,null,null,0,{"$f":"IF(Q301=\"\",\"0\",(IF(P301<AI301,1,IF(Q301>#REF!,1,0))))","v":"0"},{"$f":"IF(R301=\"\",\"0\",(IF(R301<AI301,1,IF(R301>#REF!,1,0))))","v":"0"},{"$f":"IF(S301=\"\",\"0\",(IF(S301<AI301,1,IF(S301>#REF!,1,0))))","v":"0"},{"$f":"IF(T301=\"\",\"0\",(IF(T301<AI301,1,IF(T301>#REF!,1,0))))","v":"0"}]
[null,null,null,null,null,null,null,null,null,null,null,null,null,null,null,null,null,null,null,null,null,"X","",null,null,null,null,null,null,"X",null,null,null,null,0,{"$f":"IF(Q302=\"\",\"0\",(IF(P302<AI302,1,IF(Q302>#REF!,1,0))))","v":"0"},{"$f":"IF(R302=\"\",\"0\",(IF(R302<AI302,1,IF(R302>#REF!,1,0))))","v":"0"},{"$f":"IF(S302=\"\",\"0\",(IF(S302<AI302,1,IF(S302>#REF!,1,0))))","v":"0"},{"$f":"IF(T302=\"\",\"0\",(IF(T302<AI302,1,IF(T302>#REF!,1,0))))","v":"0"}]
[null,null,null,null,null,null,null,null,null,null,null,null,null,null,null,null,null,null,null,null,null,"X","",null,null,null,null,null,null,"X",null,null,null,null,0,{"$f":"IF(Q303=\"\",\"0\",(IF(P303<AI303,1,IF(Q303>#REF!,1,0))))","v":"0"},{"$f":"IF(R303=\"\",\"0\",(IF(R303<AI303,1,IF(R303>#REF!,1,0))))","v":"0"},{"$f":"IF(S303=\"\",\"0\",(IF(S303<AI303,1,IF(S303>#REF!,1,0))))","v":"0"},{"$f":"IF(T303=\"\",\"0\",(IF(T303<AI303,1,IF(T303>#REF!,1,0))))","v":"0"}]
[null,null,null,null,null,null,null,null,null,null,null,null,null,null,null,null,null,null,null,null,null,"X","",null,null,null,null,null,null,"X",null,null,null,null,0,{"$f":"IF(Q304=\"\",\"0\",(IF(P304<AI304,1,IF(Q304>#REF!,1,0))))","v":"0"},{"$f":"IF(R304=\"\",\"0\",(IF(R304<AI304,1,IF(R304>#REF!,1,0))))","v":"0"},{"$f":"IF(S304=\"\",\"0\",(IF(S304<AI304,1,IF(S304>#REF!,1,0))))","v":"0"},{"$f":"IF(T304=\"\",\"0\",(IF(T304<AI304,1,IF(T304>#REF!,1,0))))","v":"0"}]
[null,null,null,null,null,null,null,null,null,null,null,null,null,null,null,null,null,null,null,null,null,"X","",null,null,null,null,null,null,"X",null,null,null,null,0,{"$f":"IF(Q305=\"\",\"0\",(IF(P305<AI305,1,IF(Q305>#REF!,1,0))))","v":"0"},{"$f":"IF(R305=\"\",\"0\",(IF(R305<AI305,1,IF(R305>#REF!,1,0))))","v":"0"},{"$f":"IF(S305=\"\",\"0\",(IF(S305<AI305,1,IF(S305>#REF!,1,0))))","v":"0"},{"$f":"IF(T305=\"\",\"0\",(IF(T305<AI305,1,IF(T305>#REF!,1,0))))","v":"0"}]
[null,null,null,null,null,null,null,null,null,null,null,null,null,null,null,null,null,null,null,null,null,"X","",null,null,null,null,null,null,"X",null,null,null,null,0,{"$f":"IF(Q306=\"\",\"0\",(IF(P306<AI306,1,IF(Q306>#REF!,1,0))))","v":"0"},{"$f":"IF(R306=\"\",\"0\",(IF(R306<AI306,1,IF(R306>#REF!,1,0))))","v":"0"},{"$f":"IF(S306=\"\",\"0\",(IF(S306<AI306,1,IF(S306>#REF!,1,0))))","v":"0"},{"$f":"IF(T306=\"\",\"0\",(IF(T306<AI306,1,IF(T306>#REF!,1,0))))","v":"0"}]
[null,null,null,null,null,null,null,null,null,null,null,null,null,null,null,null,null,null,null,null,null,"X","",null,null,null,null,null,null,"X",null,null,null,null,0,{"$f":"IF(Q307=\"\",\"0\",(IF(P307<AI307,1,IF(Q307>#REF!,1,0))))","v":"0"},{"$f":"IF(R307=\"\",\"0\",(IF(R307<AI307,1,IF(R307>#REF!,1,0))))","v":"0"},{"$f":"IF(S307=\"\",\"0\",(IF(S307<AI307,1,IF(S307>#REF!,1,0))))","v":"0"},{"$f":"IF(T307=\"\",\"0\",(IF(T307<AI307,1,IF(T307>#REF!,1,0))))","v":"0"}]
[null,null,null,null,null,null,null,null,null,null,null,null,null,null,null,null,null,null,null,null,null,"X","",null,null,null,null,null,null,"X",null,null,null,null,0,{"$f":"IF(Q308=\"\",\"0\",(IF(P308<AI308,1,IF(Q308>#REF!,1,0))))","v":"0"},{"$f":"IF(R308=\"\",\"0\",(IF(R308<AI308,1,IF(R308>#REF!,1,0))))","v":"0"},{"$f":"IF(S308=\"\",\"0\",(IF(S308<AI308,1,IF(S308>#REF!,1,0))))","v":"0"},{"$f":"IF(T308=\"\",\"0\",(IF(T308<AI308,1,IF(T308>#REF!,1,0))))","v":"0"}]
[null,null,null,null,null,null,null,null,null,null,null,null,null,null,null,null,null,null,null,null,null,"X","",null,null,null,null,null,null,"X",null,null,null,null,0,{"$f":"IF(Q309=\"\",\"0\",(IF(P309<AI309,1,IF(Q309>#REF!,1,0))))","v":"0"},{"$f":"IF(R309=\"\",\"0\",(IF(R309<AI309,1,IF(R309>#REF!,1,0))))","v":"0"},{"$f":"IF(S309=\"\",\"0\",(IF(S309<AI309,1,IF(S309>#REF!,1,0))))","v":"0"},{"$f":"IF(T309=\"\",\"0\",(IF(T309<AI309,1,IF(T309>#REF!,1,0))))","v":"0"}]
[null,null,null,null,null,null,null,null,null,null,null,null,null,null,null,null,null,null,null,null,null,"X","",null,null,null,null,null,null,"X",null,null,null,null,0,{"$f":"IF(Q310=\"\",\"0\",(IF(P310<AI310,1,IF(Q310>#REF!,1,0))))","v":"0"},{"$f":"IF(R310=\"\",\"0\",(IF(R310<AI310,1,IF(R310>#REF!,1,0))))","v":"0"},{"$f":"IF(S310=\"\",\"0\",(IF(S310<AI310,1,IF(S310>#REF!,1,0))))","v":"0"},{"$f":"IF(T310=\"\",\"0\",(IF(T310<AI310,1,IF(T310>#REF!,1,0))))","v":"0"}]
[null,null,null,null,null,null,null,null,null,null,null,null,null,null,null,null,null,null,null,null,null,"X","",null,null,null,null,null,null,"X",null,null,null,null,0,{"$f":"IF(Q311=\"\",\"0\",(IF(P311<AI311,1,IF(Q311>#REF!,1,0))))","v":"0"},{"$f":"IF(R311=\"\",\"0\",(IF(R311<AI311,1,IF(R311>#REF!,1,0))))","v":"0"},{"$f":"IF(S311=\"\",\"0\",(IF(S311<AI311,1,IF(S311>#REF!,1,0))))","v":"0"},{"$f":"IF(T311=\"\",\"0\",(IF(T311<AI311,1,IF(T311>#REF!,1,0))))","v":"0"}]
[null,null,null,null,null,null,null,null,null,null,null,null,null,null,null,null,null,null,null,null,null,"X","",null,null,null,null,null,null,"X",null,null,null,null,0,{"$f":"IF(Q312=\"\",\"0\",(IF(P312<AI312,1,IF(Q312>#REF!,1,0))))","v":"0"},{"$f":"IF(R312=\"\",\"0\",(IF(R312<AI312,1,IF(R312>#REF!,1,0))))","v":"0"},{"$f":"IF(S312=\"\",\"0\",(IF(S312<AI312,1,IF(S312>#REF!,1,0))))","v":"0"},{"$f":"IF(T312=\"\",\"0\",(IF(T312<AI312,1,IF(T312>#REF!,1,0))))","v":"0"}]
[null,null,null,null,null,null,null,null,null,null,null,null,null,null,null,null,null,null,null,null,null,"X","",null,null,null,null,null,null,"X",null,null,null,null,0,{"$f":"IF(Q313=\"\",\"0\",(IF(P313<AI313,1,IF(Q313>#REF!,1,0))))","v":"0"},{"$f":"IF(R313=\"\",\"0\",(IF(R313<AI313,1,IF(R313>#REF!,1,0))))","v":"0"},{"$f":"IF(S313=\"\",\"0\",(IF(S313<AI313,1,IF(S313>#REF!,1,0))))","v":"0"},{"$f":"IF(T313=\"\",\"0\",(IF(T313<AI313,1,IF(T313>#REF!,1,0))))","v":"0"}]
[null,null,null,null,null,null,null,null,null,null,null,null,null,null,null,null,null,null,null,null,null,"X","",null,null,null,null,null,null,"X",null,null,null,null,0,{"$f":"IF(Q314=\"\",\"0\",(IF(P314<AI314,1,IF(Q314>#REF!,1,0))))","v":"0"},{"$f":"IF(R314=\"\",\"0\",(IF(R314<AI314,1,IF(R314>#REF!,1,0))))","v":"0"},{"$f":"IF(S314=\"\",\"0\",(IF(S314<AI314,1,IF(S314>#REF!,1,0))))","v":"0"},{"$f":"IF(T314=\"\",\"0\",(IF(T314<AI314,1,IF(T314>#REF!,1,0))))","v":"0"}]
[null,null,null,null,null,null,null,null,null,null,null,null,null,null,null,null,null,null,null,null,null,"X","",null,null,null,null,null,null,"X",null,null,null,null,0,{"$f":"IF(Q315=\"\",\"0\",(IF(P315<AI315,1,IF(Q315>#REF!,1,0))))","v":"0"},{"$f":"IF(R315=\"\",\"0\",(IF(R315<AI315,1,IF(R315>#REF!,1,0))))","v":"0"},{"$f":"IF(S315=\"\",\"0\",(IF(S315<AI315,1,IF(S315>#REF!,1,0))))","v":"0"},{"$f":"IF(T315=\"\",\"0\",(IF(T315<AI315,1,IF(T315>#REF!,1,0))))","v":"0"}]
[null,null,null,null,null,null,null,null,null,null,null,null,null,null,null,null,null,null,null,null,null,"X","",null,null,null,null,null,null,"X",null,null,null,null,0,{"$f":"IF(Q316=\"\",\"0\",(IF(P316<AI316,1,IF(Q316>#REF!,1,0))))","v":"0"},{"$f":"IF(R316=\"\",\"0\",(IF(R316<AI316,1,IF(R316>#REF!,1,0))))","v":"0"},{"$f":"IF(S316=\"\",\"0\",(IF(S316<AI316,1,IF(S316>#REF!,1,0))))","v":"0"},{"$f":"IF(T316=\"\",\"0\",(IF(T316<AI316,1,IF(T316>#REF!,1,0))))","v":"0"}]
[null,null,null,null,null,null,null,null,null,null,null,null,null,null,null,null,null,null,null,null,null,"X","",null,null,null,null,null,null,"X",null,null,null,null,0,{"$f":"IF(Q317=\"\",\"0\",(IF(P317<AI317,1,IF(Q317>#REF!,1,0))))","v":"0"},{"$f":"IF(R317=\"\",\"0\",(IF(R317<AI317,1,IF(R317>#REF!,1,0))))","v":"0"},{"$f":"IF(S317=\"\",\"0\",(IF(S317<AI317,1,IF(S317>#REF!,1,0))))","v":"0"},{"$f":"IF(T317=\"\",\"0\",(IF(T317<AI317,1,IF(T317>#REF!,1,0))))","v":"0"}]
[null,null,null,null,null,null,null,null,null,null,null,null,null,null,null,null,null,null,null,null,null,"X","",null,null,null,null,null,null,"X",null,null,null,null,0,{"$f":"IF(Q318=\"\",\"0\",(IF(P318<AI318,1,IF(Q318>#REF!,1,0))))","v":"0"},{"$f":"IF(R318=\"\",\"0\",(IF(R318<AI318,1,IF(R318>#REF!,1,0))))","v":"0"},{"$f":"IF(S318=\"\",\"0\",(IF(S318<AI318,1,IF(S318>#REF!,1,0))))","v":"0"},{"$f":"IF(T318=\"\",\"0\",(IF(T318<AI318,1,IF(T318>#REF!,1,0))))","v":"0"}]
[null,null,null,null,null,null,null,null,null,null,null,null,null,null,null,null,null,null,null,null,null,"X","",null,null,null,null,null,null,"X",null,null,null,null,0,{"$f":"IF(Q319=\"\",\"0\",(IF(P319<AI319,1,IF(Q319>#REF!,1,0))))","v":"0"},{"$f":"IF(R319=\"\",\"0\",(IF(R319<AI319,1,IF(R319>#REF!,1,0))))","v":"0"},{"$f":"IF(S319=\"\",\"0\",(IF(S319<AI319,1,IF(S319>#REF!,1,0))))","v":"0"},{"$f":"IF(T319=\"\",\"0\",(IF(T319<AI319,1,IF(T319>#REF!,1,0))))","v":"0"}]
[null,null,null,null,null,null,null,null,null,null,null,null,null,null,null,null,null,null,null,null,null,"X","",null,null,null,null,null,null,"X",null,null,null,null,0,{"$f":"IF(Q320=\"\",\"0\",(IF(P320<AI320,1,IF(Q320>#REF!,1,0))))","v":"0"},{"$f":"IF(R320=\"\",\"0\",(IF(R320<AI320,1,IF(R320>#REF!,1,0))))","v":"0"},{"$f":"IF(S320=\"\",\"0\",(IF(S320<AI320,1,IF(S320>#REF!,1,0))))","v":"0"},{"$f":"IF(T320=\"\",\"0\",(IF(T320<AI320,1,IF(T320>#REF!,1,0))))","v":"0"}]
[null,null,null,null,null,null,null,null,null,null,null,null,null,null,null,null,null,null,null,null,null,"X","",null,null,null,null,null,null,"X",null,null,null,null,0,{"$f":"IF(Q321=\"\",\"0\",(IF(P321<AI321,1,IF(Q321>#REF!,1,0))))","v":"0"},{"$f":"IF(R321=\"\",\"0\",(IF(R321<AI321,1,IF(R321>#REF!,1,0))))","v":"0"},{"$f":"IF(S321=\"\",\"0\",(IF(S321<AI321,1,IF(S321>#REF!,1,0))))","v":"0"},{"$f":"IF(T321=\"\",\"0\",(IF(T321<AI321,1,IF(T321>#REF!,1,0))))","v":"0"}]
[null,null,null,null,null,null,null,null,null,null,null,null,null,null,null,null,null,null,null,null,null,"X","",null,null,null,null,null,null,"X",null,null,null,null,0,{"$f":"IF(Q322=\"\",\"0\",(IF(P322<AI322,1,IF(Q322>#REF!,1,0))))","v":"0"},{"$f":"IF(R322=\"\",\"0\",(IF(R322<AI322,1,IF(R322>#REF!,1,0))))","v":"0"},{"$f":"IF(S322=\"\",\"0\",(IF(S322<AI322,1,IF(S322>#REF!,1,0))))","v":"0"},{"$f":"IF(T322=\"\",\"0\",(IF(T322<AI322,1,IF(T322>#REF!,1,0))))","v":"0"}]
[null,null,null,null,null,null,null,null,null,null,null,null,null,null,null,null,null,null,null,null,null,"X","",null,null,null,null,null,null,"X",null,null,null,null,0,{"$f":"IF(Q323=\"\",\"0\",(IF(P323<AI323,1,IF(Q323>#REF!,1,0))))","v":"0"},{"$f":"IF(R323=\"\",\"0\",(IF(R323<AI323,1,IF(R323>#REF!,1,0))))","v":"0"},{"$f":"IF(S323=\"\",\"0\",(IF(S323<AI323,1,IF(S323>#REF!,1,0))))","v":"0"},{"$f":"IF(T323=\"\",\"0\",(IF(T323<AI323,1,IF(T323>#REF!,1,0))))","v":"0"}]
[null,null,null,null,null,null,null,null,null,null,null,null,null,null,null,null,null,null,null,null,null,"X","",null,null,null,null,null,null,"X",null,null,null,null,0,{"$f":"IF(Q324=\"\",\"0\",(IF(P324<AI324,1,IF(Q324>#REF!,1,0))))","v":"0"},{"$f":"IF(R324=\"\",\"0\",(IF(R324<AI324,1,IF(R324>#REF!,1,0))))","v":"0"},{"$f":"IF(S324=\"\",\"0\",(IF(S324<AI324,1,IF(S324>#REF!,1,0))))","v":"0"},{"$f":"IF(T324=\"\",\"0\",(IF(T324<AI324,1,IF(T324>#REF!,1,0))))","v":"0"}]
[null,null,null,null,null,null,null,null,null,null,null,null,null,null,null,null,null,null,null,null,null,"X","",null,null,null,null,null,null,"X",null,null,null,null,0,{"$f":"IF(Q325=\"\",\"0\",(IF(P325<AI325,1,IF(Q325>#REF!,1,0))))","v":"0"},{"$f":"IF(R325=\"\",\"0\",(IF(R325<AI325,1,IF(R325>#REF!,1,0))))","v":"0"},{"$f":"IF(S325=\"\",\"0\",(IF(S325<AI325,1,IF(S325>#REF!,1,0))))","v":"0"},{"$f":"IF(T325=\"\",\"0\",(IF(T325<AI325,1,IF(T325>#REF!,1,0))))","v":"0"}]
[null,null,null,null,null,null,null,null,null,null,null,null,null,null,null,null,null,null,null,null,null,"X","",null,null,null,null,null,null,"X",null,null,null,null,0,{"$f":"IF(Q326=\"\",\"0\",(IF(P326<AI326,1,IF(Q326>#REF!,1,0))))","v":"0"},{"$f":"IF(R326=\"\",\"0\",(IF(R326<AI326,1,IF(R326>#REF!,1,0))))","v":"0"},{"$f":"IF(S326=\"\",\"0\",(IF(S326<AI326,1,IF(S326>#REF!,1,0))))","v":"0"},{"$f":"IF(T326=\"\",\"0\",(IF(T326<AI326,1,IF(T326>#REF!,1,0))))","v":"0"}]
[null,null,null,null,null,null,null,null,null,null,null,null,null,null,null,null,null,null,null,null,null,"X","",null,null,null,null,null,null,"X",null,null,null,null,0,{"$f":"IF(Q327=\"\",\"0\",(IF(P327<AI327,1,IF(Q327>#REF!,1,0))))","v":"0"},{"$f":"IF(R327=\"\",\"0\",(IF(R327<AI327,1,IF(R327>#REF!,1,0))))","v":"0"},{"$f":"IF(S327=\"\",\"0\",(IF(S327<AI327,1,IF(S327>#REF!,1,0))))","v":"0"},{"$f":"IF(T327=\"\",\"0\",(IF(T327<AI327,1,IF(T327>#REF!,1,0))))","v":"0"}]
[null,null,null,null,null,null,null,null,null,null,null,null,null,null,null,null,null,null,null,null,null,"X","",null,null,null,null,null,null,"X",null,null,null,null,0,{"$f":"IF(Q328=\"\",\"0\",(IF(P328<AI328,1,IF(Q328>#REF!,1,0))))","v":"0"},{"$f":"IF(R328=\"\",\"0\",(IF(R328<AI328,1,IF(R328>#REF!,1,0))))","v":"0"},{"$f":"IF(S328=\"\",\"0\",(IF(S328<AI328,1,IF(S328>#REF!,1,0))))","v":"0"},{"$f":"IF(T328=\"\",\"0\",(IF(T328<AI328,1,IF(T328>#REF!,1,0))))","v":"0"}]
[null,null,null,null,null,null,null,null,null,null,null,null,null,null,null,null,null,null,null,null,null,"X","",null,null,null,null,null,null,"X",null,null,null,null,0,{"$f":"IF(Q329=\"\",\"0\",(IF(P329<AI329,1,IF(Q329>#REF!,1,0))))","v":"0"},{"$f":"IF(R329=\"\",\"0\",(IF(R329<AI329,1,IF(R329>#REF!,1,0))))","v":"0"},{"$f":"IF(S329=\"\",\"0\",(IF(S329<AI329,1,IF(S329>#REF!,1,0))))","v":"0"},{"$f":"IF(T329=\"\",\"0\",(IF(T329<AI329,1,IF(T329>#REF!,1,0))))","v":"0"}]
[null,null,null,null,null,null,null,null,null,null,null,null,null,null,null,null,null,null,null,null,null,"X","",null,null,null,null,null,null,"X",null,null,null,null,0,{"$f":"IF(Q330=\"\",\"0\",(IF(P330<AI330,1,IF(Q330>#REF!,1,0))))","v":"0"},{"$f":"IF(R330=\"\",\"0\",(IF(R330<AI330,1,IF(R330>#REF!,1,0))))","v":"0"},{"$f":"IF(S330=\"\",\"0\",(IF(S330<AI330,1,IF(S330>#REF!,1,0))))","v":"0"},{"$f":"IF(T330=\"\",\"0\",(IF(T330<AI330,1,IF(T330>#REF!,1,0))))","v":"0"}]
[null,null,null,null,null,null,null,null,null,null,null,null,null,null,null,null,null,null,null,null,null,"X","",null,null,null,null,null,null,"X",null,null,null,null,0,{"$f":"IF(Q331=\"\",\"0\",(IF(P331<AI331,1,IF(Q331>#REF!,1,0))))","v":"0"},{"$f":"IF(R331=\"\",\"0\",(IF(R331<AI331,1,IF(R331>#REF!,1,0))))","v":"0"},{"$f":"IF(S331=\"\",\"0\",(IF(S331<AI331,1,IF(S331>#REF!,1,0))))","v":"0"},{"$f":"IF(T331=\"\",\"0\",(IF(T331<AI331,1,IF(T331>#REF!,1,0))))","v":"0"}]
[null,null,null,null,null,null,null,null,null,null,null,null,null,null,null,null,null,null,null,null,null,"X","",null,null,null,null,null,null,"X",null,null,null,null,0,{"$f":"IF(Q332=\"\",\"0\",(IF(P332<AI332,1,IF(Q332>#REF!,1,0))))","v":"0"},{"$f":"IF(R332=\"\",\"0\",(IF(R332<AI332,1,IF(R332>#REF!,1,0))))","v":"0"},{"$f":"IF(S332=\"\",\"0\",(IF(S332<AI332,1,IF(S332>#REF!,1,0))))","v":"0"},{"$f":"IF(T332=\"\",\"0\",(IF(T332<AI332,1,IF(T332>#REF!,1,0))))","v":"0"}]
[null,null,null,null,null,null,null,null,null,null,null,null,null,null,null,null,null,null,null,null,null,"X","",null,null,null,null,null,null,"X",null,null,null,null,0,{"$f":"IF(Q333=\"\",\"0\",(IF(P333<AI333,1,IF(Q333>#REF!,1,0))))","v":"0"},{"$f":"IF(R333=\"\",\"0\",(IF(R333<AI333,1,IF(R333>#REF!,1,0))))","v":"0"},{"$f":"IF(S333=\"\",\"0\",(IF(S333<AI333,1,IF(S333>#REF!,1,0))))","v":"0"},{"$f":"IF(T333=\"\",\"0\",(IF(T333<AI333,1,IF(T333>#REF!,1,0))))","v":"0"}]
[]
[null,"Notizen: "]

{"sheet":"7.Material Test Results","index":9,"n_rows":52,"n_cols":17,"rows_kept":52,"cut":false,"hidden":false,"merged":[[1,1,2,15],[4,1,4,2],[4,3,4,8],[4,9,4,10],[4,11,4,16],[5,1,5,2],[5,3,5,8],[5,9,5,10],[5,11,5,16],[8,1,8,8],[8,9,8,11],[8,12,8,16],[9,1,9,4],[9,5,9,6],[9,9,9,14],[6,1,6,2],[6,3,6,8],[6,9,6,12],[6,13,6,16],[7,5,7,8],[7,9,7,12],[7,13,7,16],[13,1,13,4],[13,9,13,14],[14,1,14,4],[14,9,14,14],[15,1,15,4],[15,9,15,14],[10,1,10,4],[10,9,10,14],[11,1,11,4],[11,9,11,14],[12,1,12,4],[12,9,12,14],[19,1,19,4],[19,9,19,14],[20,1,20,4],[20,9,20,14],[21,1,21,4],[21,9,21,14],[16,1,16,4],[16,9,16,14],[17,1,17,4],[17,9,17,14],[18,1,18,4],[18,9,18,14],[25,1,25,4],[25,9,25,14],[26,1,26,4],[26,9,26,14],[27,1,27,4],[27,9,27,14],[22,1,22,4],[22,9,22,14],[23,1,23,4],[23,9,23,14],[24,1,24,4],[24,9,24,14],[31,1,31,4],[31,9,31,14],[32,1,32,4],[32,9,32,14],[33,1,33,4],[33,9,33,14],[28,1,28,4],[28,9,28,14],[29,1,29,4],[29,9,29,14],[30,1,30,4],[30,9,30,14],[37,1,37,4],[37,9,37,14],[38,1,38,4],[38,9,38,14],[39,1,39,4],[39,9,39,14],[34,1,34,4],[34,9,34,14],[35,1,35,4],[35,9,35,14],[36,1,36,4],[36,9,36,14],[43,1,43,4],[43,9,43,14],[44,1,44,4],[44,9,44,14],[45,1,45,4],[45,9,45,14],[40,1,40,4],[40,9,40,14],[41,1,41,4],[41,9,41,14],[42,1,42,4],[42,9,42,14],[52,1,52,2],[52,7,52,8],[52,9,52,10],[52,11,52,13],[52,14,52,16],[46,1,46,4],[46,9,46,14],[47,1,47,4],[47,9,47,14],[49,8,49,16],[51,1,51,2],[51,9,51,10],[51,11,51,13],[51,14,51,16]]}
[]
[null,"Produktionsteilzulassung\nMaterialtestergebnisse"]
[]
[]
[null,"ORGANISATION:",null,{"$f":"'0.Submission Checklist'!R2","v":0},null,null,null,null,null,"BAUTEILNUMMER:",null,{"$f":"'0.Submission Checklist'!D4","v":0}]
[null,"LIEFERANTEN-/VERKÄUFERCODE:",null,null,null,null,null,null,null,"BAUTEILNAME:",null,{"$f":"'0.Submission Checklist'!D5","v":0}]
[null,"MATERIALLIEFERANT:",null,null,null,null,null,null,null,"Zeichnungsnummer",null,null,null,{"$f":"'0.Submission Checklist'!D2","v":0}]
[null,"* BENUTZERDEFINIERTER LIEFERANTEN-/VERKÄUFERCODE:",null,null,null,null,null,null,null,"Zeichnungsrevisionen",null,null,null,{"$f":"'0.Submission Checklist'!D3","v":0}]
[null,"*Wenn eine Quellzulassung erforderlich ist, geben Sie den vom Lieferanten (Quelle) und Kunden zugewiesenen Code an.",null,null,null,null,null,null,null,"NAME des LABORS:"]
[null,"MATERIALSPEZIFIKATION NR. / REV / DATUM",null,null,null,"SPEZIFIKATION/GRENZEN:",null,"TESTDATUM","ANZAHL GETESTET","LIEFERANTENTESTERGEBNISSE (DATEN)",null,null,null,null,null,"PASS","FAIL"]
[]
[]
[]
[]
[]
[]
[]
[]
[]
[]
[]
[]
[]
[]
[]
[]
[]
[]
[]
[]
[]
[]
[]
[]
[]
[]
[]
[]
[]
[]
[]
[]
[]
[]
[]
[]
[]
[]
[]
[null,null,null,null,null,null,null,null,"Pauschale Konformitätserklärungen sind für keinerlei Prüfergebnisse akzeptiert."]
[]
[null,null,null,null,null,null,null,null,null,"UNTERSCHRIFT",null,"TITEL",null,null,"DATUM"]

{"sheet":"8.Performance Test Results","index":10,"n_rows":53,"n_cols":18,"rows_kept":53,"cut":false,"hidden":false,"merged":[[1,6,1,17],[2,1,2,5],[2,6,2,17],[5,1,5,3],[5,4,5,8],[5,9,5,10],[5,11,5,17],[8,1,8,5],[8,9,8,10],[8,11,8,17],[9,1,9,8],[9,9,9,17],[10,1,10,4],[10,5,10,6],[10,9,10,15],[6,1,6,3],[6,4,6,8],[6,9,6,10],[6,11,6,17],[7,1,7,2],[7,3,7,8],[7,9,7,10],[7,11,7,17],[14,1,14,4],[14,9,14,15],[15,1,15,4],[15,9,15,15],[16,1,16,4],[16,9,16,15],[11,1,11,4],[11,9,11,15],[12,1,12,4],[12,9,12,15],[13,1,13,4],[13,9,13,15],[20,1,20,4],[20,9,20,15],[21,1,21,4],[21,9,21,15],[22,1,22,4],[22,9,22,15],[17,1,17,4],[17,9,17,15],[18,1,18,4],[18,9,18,15],[19,1,19,4],[19,9,19,15],[26,1,26,4],[26,9,26,15],[27,1,27,4],[27,9,27,15],[28,1,28,4],[28,9,28,15],[23,1,23,4],[23,9,23,15],[24,1,24,4],[24,9,24,15],[25,1,25,4],[25,9,25,15],[32,1,32,4],[32,9,32,15],[33,1,33,4],[33,9,33,15],[34,1,34,4],[34,9,34,15],[29,1,29,4],[29,9,29,15],[30,1,30,4],[30,9,30,15],[31,1,31,4],[31,9,31,15],[38,1,38,4],[38,9,38,15],[39,1,39,4],[39,9,39,15],[40,1,40,4],[40,9,40,15],[35,1,35,4],[35,9,35,15],[36,1,36,4],[36,9,36,15],[37,1,37,4],[37,9,37,15],[44,1,44,4],[44,9,44,15],[45,1,45,4],[45,9,45,15],[46,1,46,4],[46,9,46,15],[41,1,41,4],[41,9,41,15],[42,1,42,4],[42,9,42,15],[43,1,43,4],[43,9,43,15],[53,1,53,2],[53,7,53,8],[53,9,53,10],[53,11,53,14],[53,15,53,17],[47,1,47,4],[47,9,47,15],[48,1,48,4],[48,9,48,15],[50,8,50,17],[52,1,52,2],[52,9,52,10],[52,11,52,14],[52,15,52,17]]}
[]
[null,null,null,null,null,null,"Produktionsteilzulassung "]
[null,null,null,null,null,null,"Leistungstestergebnisse"]
[]
[]
[null,"ORGANISATION:",null,null,{"$f":"'0.Submission Checklist'!R2","v":0},null,null,null,null,"BAUTEILNUMMER:",null,{"$f":"'0.Submission Checklist'!D4","v":0}]
[null,"LIEFERANTEN-/VERKÄUFERCODE:",null,null,null,null,null,null,null,"BAUTEILNAME:",null,{"$f":"'0.Submission Checklist'!D5","v":0}]
[null,"LIEFERANT:",null,{"$f":"'0.Submission Checklist'!R2","v":0},null,null,null,null,null,"ZEICHNUNGSNR.:",null,{"$f":"'0.Submission Checklist'!D2","v":0}]
[null,"* BENUTZERDEFINIERTER LIEFERANTEN-/VERKÄUFERCODE:",null,null,null,null,null,null,null,"DWG REV:",null,{"$f":"'0.Submission Checklist'!D3","v":0}]
[null,"*Wenn eine Quellzulassung erforderlich ist, geben Sie den vom Lieferanten (Quelle) und Kunden zugewiesenen Code an."]
[null,"PRÜFVORSCHRIFT / REV / DATUM",null,null,null,"SPEZIFIKATION/GRENZEN:",null,"TESTDATUM","ANZAHL GETESTET","LIEFERANTENPRÜFERGEBNISSE (DATEN) / PRÜFBEDINGUNGEN",null,null,null,null,null,null,"PASS","FAIL"]
[]
[]
[]
[]
[]
[]
[]
[]
[]
[]
[]
[]
[]
[]
[]
[]
[]
[]
[]
[]
[]
[]
[]
[]
[]
[]
[]
[]
[]
[]
[]
[]
[]
[]
[]
[]
[]
[]
[]
[null,null,null,null,null,null,null,null,"Pauschale Konformitätserklärungen sind für keinerlei Prüfergebnisse akzeptiert."]
[]
[null,null,null,null,null,null,null,null,null,"UNTERSCHRIFT",null,"TITEL",null,null,null,"DATUM"]

{"sheet":"9.Statistical Analysis & Cp ","index":11,"n_rows":84,"n_cols":10,"rows_kept":84,"cut":false,"hidden":false,"merged":[[1,8,2,8],[2,3,2,6],[0,0,0,2],[1,0,2,0],[1,1,2,1],[1,3,1,6],[1,7,2,7],[3,2,4,2],[3,3,3,6],[4,3,4,6],[46,0,46,8],[86,3,86,4]]}
[null,null,null,null,null,null,null,null,"Datenseite – 1"]
["Bauteilnummer",null,"Beschreibung",null,null,null,null,"Datum der Studie","00:00:00"]
[null,null,"Studiengrund"]
["Gemessen von:",0,"Notizen",null,null,null,null,"Druckrevision"]
["FAI-Nr.",null,null,null,null,null,null,"Gemessene Anlage"]
["Beschreibung Zeichnungs-merkmal","▲6 CAV 1","▲6 CAV 2","▲9 CAV 1","▲9 CAV 2","▲6 CAV 1","▲6 CAV 2","▲6 CAV 1","▲6 CAV 2"]
["Nominal",5,{"$f":"B7","v":5},0.39300000000000002,{"$f":"D7","v":0.39300000000000002},0,0,0,0.247]
["+ Toleranz",0.02,0,2E-3,{"$f":"D8","v":2E-3},5.0000000000000001E-3,5.0000000000000001E-3,5.0000000000000001E-3,1E-3]
["- Toleranz",0.02,{"$f":"B9","v":0.02},2E-3,{"$f":"D9","v":2E-3},5.0000000000000001E-3,5.0000000000000001E-3,5.0000000000000001E-3,1E-3]
["Beschreibung","Radius","Radius","PROFIL","ID","POS","POS","POS"]
["Messart","Radiusmessgerät","Radiusmessgerät","CMM"]
["Maßeinheit"]
["Muster Nr.",{"$f":"B6","v":"▲6 CAV 1"},"▲6 CAV 2","▲9 CAV 1","▲9 CAV 2","▲6 CAV 1","▲6 CAV 2","▲6 CAV 1","▲6 CAV 2"]
[1,5]
[2,5]
[3,5]
[4,5]
[5,5]
[6,5,null,null,null,null,null,null,null,{"$f":"IF(I19=\"\",\"\",ABS(#REF!-I19))","v":""}]
[7,5,null,null,null,null,null,null,null,{"$f":"IF(I20=\"\",\"\",ABS(I19-I20))","v":""}]
[8,5,null,null,null,null,null,null,null,""]
[9,5,null,null,null,null,null,null,null,""]
[10,5,null,null,null,null,null,null,null,""]
[11,5,null,null,null,null,null,null,null,""]
[12,5,null,null,null,null,null,null,null,""]
[13,5,null,null,null,null,null,null,null,""]
[14,5,null,null,null,null,null,null,null,""]
[15,5,null,null,null,null,null,null,null,""]
[16,5,null,null,null,null,null,null,null,""]
[17,5,null,null,null,null,null,null,null,""]
[18,5,null,null,null,null,null,null,null,""]
[19,5,null,null,null,null,null,null,null,""]
[20,5,null,null,null,null,null,null,null,""]
[21,5,null,null,null,null,null,null,null,""]
[22,5,null,null,null,null,null,null,null,""]
[23,5,null,null,null,null,null,null,null,""]
[24,5,null,null,null,null,null,null,null,""]
[25,5,null,null,null,null,null,null,null,""]
[26,5,null,null,null,null,null,null,null,""]
[27,5,null,null,null,null,null,null,null,""]
[28,5,null,null,null,null,null,null,null,""]
[29,5,null,null,null,null,null,null,null,""]
[30,4.99,null,null,null,null,null,null,null,""]
[31,4.99,null,null,null,null,null,null,null,""]
[32,4.99,null,null,null,null,null,null,null,""]
[33,4.99,null,null,null,null,null,null,null,""]
["STATISTISCHE DATEN"]
["USL",{"$f":"IF(B8=\"\",\"\",B8+B7)","v":5.0199999999999996},5,0.39500000000000002,0.39500000000000002,5.0000000000000001E-3,5.0000000000000001E-3,5.0000000000000001E-3,0.248]
["LSL",{"$f":"IF(B9=\"\",\"\",B7-ABS(B9))","v":4.9800000000000004},4.9800000000000004,0.39100000000000001,0.39100000000000001,-5.0000000000000001E-3,-5.0000000000000001E-3,-5.0000000000000001E-3,0.246]
["MEAN",{"$f":"IF(ISERROR(AVERAGE(B14:B46)),\"\",AVERAGE(B14:B46))","v":4.9987878787878799},"","","","","","",""]
["MAX",{"$f":"IF(AND(MAX(B14:B46)=0,B14=\"\"),\"\",MAX(B14:B46))","v":5},"","","","","","",""]
["MIN",{"$f":"IF(AND(MIN(B14:B46)=0,B14=\"\"),\"\",MIN(B14:B46))","v":4.99},"","","","","","",""]
["USL-LSL",{"$f":"IF(B48=\"\",IF(ISERROR(B50-B49),\"\",B50-B49),IF(B49=\"\",B48-B50,B48-B49))","v":3.9999999999999147E-2},{"$f":"IF(C48=\"\",IF(ISERROR(C50-C49),\"\",C50-C49),IF(C49=\"\",C48-C50,C48-C49))","v":1.9999999999999574E-2},4.0000000000000036E-3,4.0000000000000036E-3,0.01,0.01,0.01,2.0000000000000018E-3]
["Std Dev",{"$f":"IF(ISERROR(STDEV(B14:B46)),\"\",STDEV(B14:B46))","v":3.3143398263980137E-3},"","","","","","",""]
["Est Std Dev",{"$f":"AVERAGE($B$59:$B$59)/B60","v":3.5258934323383127E-3},{"$f":"AVERAGE($C$59:$C$59)/C60","v":{"$error":"#DIV/0!"}},{"$f":"AVERAGE($D$59:$D$59)/D60","v":{"$error":"#DIV/0!"}},{"$f":"AVERAGE($E$59:$E$59)/E60","v":{"$error":"#DIV/0!"}},{"$f":"AVERAGE($F$59:$F$59)/F60","v":{"$error":"#DIV/0!"}},{"$f":"AVERAGE($G$59:$G$59)/G60","v":{"$error":"#DIV/0!"}},{"$f":"AVERAGE($H$59:$H$59)/H60","v":{"$error":"#DIV/0!"}},{"$f":"AVERAGE($I$59:$I$59)/I60","v":{"$error":"#DIV/0!"}}]
["Reichweite",{"$f":"B51-B52","v":9.9999999999997868E-3},{"$f":"C51-C52","v":{"$error":"#VALUE!"}},{"$error":"#VALUE!"},{"$error":"#VALUE!"},{"$error":"#VALUE!"},{"$error":"#VALUE!"},{"$error":"#VALUE!"},{"$error":"#VALUE!"}]
["SubG Size",{"$f":"COUNT(B14:B46)","v":33},0,0,0,0,0,0,0]
["Range/StDev",{"$f":"B56/B54","v":3.0171921178244632},{"$f":"C56/C54","v":{"$error":"#VALUE!"}},{"$error":"#VALUE!"},{"$error":"#VALUE!"},{"$error":"#VALUE!"},{"$error":"#VALUE!"},{"$error":"#VALUE!"},{"$error":"#VALUE!"}]
["StDev-Calc",{"$f":"IF($B14=\"\",\"\",IF($B$57>$B$58,IF(ISERROR(STDEV($B14:B46)),\"\",STDEV($B14:B46)),ABS(MAX($B14:B46)-MIN($B14:B46))))","v":3.3143398263980137E-3},{"$f":"IF($C14=\"\",\"\",IF($C$57>$C$58,IF(ISERROR(STDEV($C14:C46)),\"\",STDEV($C14:C46)),ABS(MAX($C14:C46)-MIN($C14:C46))))","v":""},{"$f":"IF($D14=\"\",\"\",IF($D$57>$D$58,IF(ISERROR(STDEV($D14:D46)),\"\",STDEV($D14:D46)),ABS(MAX($D14:D46)-MIN($D14:D46))))","v":""},{"$f":"IF($E14=\"\",\"\",IF($E$57>$E$58,IF(ISERROR(STDEV($E14:E46)),\"\",STDEV($E14:E46)),ABS(MAX($E14:E46)-MIN($E14:E46))))","v":""},{"$f":"IF($F14=\"\",\"\",IF($F$57>$F$58,IF(ISERROR(STDEV($F14:F46)),\"\",STDEV($F14:F46)),ABS(MAX($F14:F46)-MIN($F14:F46))))","v":""},{"$f":"IF($G14=\"\",\"\",IF($G$57>$G$58,IF(ISERROR(STDEV($G14:G46)),\"\",STDEV($G14:G46)),ABS(MAX($G14:G46)-MIN($G14:G46))))","v":""},{"$f":"IF($H14=\"\",\"\",IF($H$57>$H$58,IF(ISERROR(STDEV($H14:H46)),\"\",STDEV($H14:H46)),ABS(MAX($H14:H46)-MIN($H14:H46))))","v":""},{"$f":"IF($I14=\"\",\"\",IF($I$57>$I$58,IF(ISERROR(STDEV($I14:I46)),\"\",STDEV($I14:I46)),ABS(MAX($I14:I46)-MIN($I14:I46))))","v":""}]
["d2/c4",{"$f":"IF($B$57>$B$58,0.94,2.326)","v":0.94},{"$f":"IF($C$57>$C$58,0.94,2.326)","v":{"$error":"#VALUE!"}},{"$f":"IF($D$57>$D$58,0.94,2.326)","v":{"$error":"#VALUE!"}},{"$f":"IF($E$57>$E$58,0.94,2.326)","v":{"$error":"#VALUE!"}},{"$f":"IF($F$57>$F$58,0.94,2.326)","v":{"$error":"#VALUE!"}},{"$f":"IF($G$57>$G$58,0.94,2.326)","v":{"$error":"#VALUE!"}},{"$f":"IF($H$57>$H$58,0.94,2.326)","v":{"$error":"#VALUE!"}},{"$f":"IF($I$57>$I$58,0.94,2.326)","v":{"$error":"#VALUE!"}}]
["Cp",{"$f":"IF(B50=\"\",\"\",IF(OR(B48=\"\",B49=\"\"),\"*\",IF(B55=0,99,B53/(6*B55))))","v":1.8907737271699969},{"$f":"IF(C50=\"\",\"\",IF(OR(C48=\"\",C49=\"\"),\"*\",IF(C55=0,99,C53/(6*C55))))","v":""},{"$f":"IF(D50=\"\",\"\",IF(OR(D48=\"\",D49=\"\"),\"*\",IF(D55=0,99,D53/(6*D55))))","v":""},{"$f":"IF(E50=\"\",\"\",IF(OR(E48=\"\",E49=\"\"),\"*\",IF(E55=0,99,E53/(6*E55))))","v":""},"","","",""]
["Cpk",{"$f":"IF(B50=\"\",\"\",MIN(B63:B64))","v":1.7761813800688868},{"$f":"IF(C50=\"\",\"\",MIN(C63:C64))","v":""},{"$f":"IF(D50=\"\",\"\",MIN(D63:D64))","v":""},"","","","",""]
["CpkU",{"$f":"IF(OR(B50=\"\",B48=\"\"),\"\",IF(B55=0,99,MIN((B48-B50)/(3*B55))))","v":2.005366074271107},{"$f":"IF(OR(C50=\"\",C48=\"\"),\"\",IF(C55=0,99,MIN((C48-C50)/(3*C55))))","v":""},{"$f":"IF(OR(D50=\"\",D48=\"\"),\"\",IF(D55=0,99,MIN((D48-D50)/(3*D55))))","v":""},"","","","",""]
["CpkL",{"$f":"IF(OR(B49=\"\",B50=\"\"),\"\",IF(B55=0,99,(B50-B49)/(3*B55)))","v":1.7761813800688868},{"$f":"IF(OR(C49=\"\",C50=\"\"),\"\",IF(C55=0,99,(C50-C49)/(3*C55)))","v":""},{"$f":"IF(OR(D49=\"\",D50=\"\"),\"\",IF(D55=0,99,(D50-D49)/(3*D55)))","v":""},"","","","",""]
["Pp",{"$f":"IF(B50=\"\",\"\",IF(OR(B48=\"\",B49=\"\"),\"*\",IF(B54=0,2,B53/(6*B54))))","v":2.0114614118829754},{"$f":"IF(C50=\"\",\"\",IF(OR(C48=\"\",C49=\"\"),\"*\",IF(C54=0,2,C53/(6*C54))))","v":""},"","","","","",""]
["Ppk",{"$f":"IF(B50=\"\",\"\",MIN(B67:B68))","v":1.8895546596477519},"","","","","","",""]
["PpU",{"$f":"IF(OR(B48=\"\",B50=\"\"),\"\",IF(B54=0,99,MIN((B48-B50)/(3*B54))))","v":2.133368164118199},{"$f":"IF(OR(C48=\"\",C50=\"\"),\"\",IF(C54=0,99,MIN((C48-C50)/(3*C54))))","v":""},"","","","","",""]
["PpL",{"$f":"IF(OR(B49=\"\",B50=\"\"),\"\",IF(B54=0,99,(B50-B49)/(3*B54)))","v":1.8895546596477519},{"$f":"IF(OR(C49=\"\",C50=\"\"),\"\",IF(C54=0,99,(C50-C49)/(3*C54)))","v":""},"","","","","",""]
["Z1",{"$f":"IF(B$49<>FALSE,IF(ISERROR(STANDARDIZE(B$49,B$50,B$54)),-6,STANDARDIZE(B$49,B$50,B$55)),\"*\")","v":-5.3285441402066605},{"$f":"IF(C$49<>FALSE,IF(ISERROR(STANDARDIZE(C$49,C$50,C$54)),-6,STANDARDIZE(C$49,C$50,C$55)),\"*\")","v":-6},-6,-6,-6,-6,-6,-6]
["Z2",{"$f":"IF(B$48<>FALSE,IF(ISERROR(STANDARDIZE(B$48,B$50,B$55)),6,STANDARDIZE(B$48,B$50,B$55)),\"*\")","v":6.0160982228133211},{"$f":"IF(C$48<>FALSE,IF(ISERROR(STANDARDIZE(C$48,C$50,C$55)),6,STANDARDIZE(C$48,C$50,C$55)),\"*\")","v":6},6,6,6,6,6,6]
["Z Bench",{"$f":"IF(OR(B77<1,B77>=1000000),MIN(B69,B70),NORMSINV(1-(B77/1000000)))","v":-5.3285441402066605},{"$f":"IF(OR(C77<1,C77>=1000000),MIN(C69,C70),NORMSINV(1-(C77/1000000)))","v":-6},-6,-6,-6,-6,-6,-6]
["Z Target",{"$f":"IF(B$55<>0,ABS(B$50-B$73)/(3*B55),99999)","v":0.11459234710111016},{"$f":"IF(C$55<>0,ABS(C$50-C$73)/(3*C55),99999)","v":{"$error":"#DIV/0!"}},{"$error":"#DIV/0!"},{"$error":"#DIV/0!"},{"$error":"#DIV/0!"},{"$error":"#DIV/0!"},{"$error":"#DIV/0!"},{"$error":"#DIV/0!"}]
["Target",{"$f":"IF(AND(B$49<>FALSE,B$48<>FALSE),$B$49+($B$48-$B$49)/2,B$50)","v":5},{"$f":"IF(AND(C$49<>FALSE,C$48<>FALSE),$B$49+($B$48-$B$49)/2,C$50)","v":5},5,5,5,5,5,5]
["% Defects",{"$f":"B82/1000000","v":0},{"$f":"C82/1000000","v":{"$error":"#DIV/0!"}},{"$error":"#DIV/0!"},{"$error":"#DIV/0!"},{"$error":"#DIV/0!"},{"$error":"#DIV/0!"},{"$error":"#DIV/0!"},{"$error":"#DIV/0!"}]
["Expected 1",{"$f":"IF(B69=\"*\",\"*\",NORMSDIST(B69)*1000000)","v":4.9501569107710058E-2},{"$f":"IF(C69=\"*\",\"*\",NORMSDIST(C69)*1000000)","v":9.8658764503769441E-4},9.8658764503769441E-4,9.8658764503769441E-4,9.8658764503769441E-4,9.8658764503769441E-4,9.8658764503769441E-4,9.8658764503769441E-4]
["Expected 2",{"$f":"IF(B70=\"*\",\"*\",(1-NORMSDIST(B70))*1000000)","v":8.9335594477546465E-4},{"$f":"IF(C70=\"*\",\"*\",(1-NORMSDIST(C70))*1000000)","v":9.8658770042447941E-4},9.8658770042447941E-4,9.8658770042447941E-4,9.8658770042447941E-4,9.8658770042447941E-4,9.8658770042447941E-4,9.8658770042447941E-4]
["Expected 3",{"$f":"IF(B$49=FALSE,IF(B$48<>FALSE,B76,\"*\"),IF(B$48=FALSE,IF(B$49,B75,\"*\"),SUM(B75:B76)))","v":5.0394925052485523E-2},{"$f":"IF(C$49=FALSE,IF(C$48<>FALSE,C76,\"*\"),IF(C$48=FALSE,IF(C$49,C75,\"*\"),SUM(C75:C76)))","v":1.9731753454621738E-3},1.9731753454621738E-3,1.9731753454621738E-3,1.9731753454621738E-3,1.9731753454621738E-3,1.9731753454621738E-3,1.9731753454621738E-3]
["Expected 4",{"$f":"IF(B77=\"\",\"\",B77/1000000)","v":5.0394925052485525E-8},{"$f":"IF(C77=\"\",\"\",C77/1000000)","v":1.9731753454621738E-9},1.9731753454621738E-9,1.9731753454621738E-9,1.9731753454621738E-9,1.9731753454621738E-9,1.9731753454621738E-9,1.9731753454621738E-9]
["Sigma",{"$f":"IF(OR(B82<1,B82=\"*\"),IF(OR(B77<1,B77=\"*\"),6,IF(B77=\"\",\"\",ROUND((NORMSINV(1-B77/1000000))+1.5,2))),ROUND((NORMSINV(1-B82/1000000))+1.5,2))","v":6},{"$f":"IF(OR(C82<1,C82=\"*\"),IF(OR(C77<1,C77=\"*\"),6,IF(C77=\"\",\"\",ROUND((NORMSINV(1-C77/1000000))+1.5,2))),ROUND((NORMSINV(1-C82/1000000))+1.5,2))","v":{"$error":"#DIV/0!"}},{"$error":"#DIV/0!"},{"$error":"#DIV/0!"},{"$error":"#DIV/0!"},{"$error":"#DIV/0!"},{"$error":"#DIV/0!"},{"$error":"#DIV/0!"}]
["PPM<LSL",{"$f":"IF(B$49<>FALSE,COUNTIF($B$14:$B$46, \"<\" & $B$49)*1000000/$B$57,\"*\")","v":0},{"$f":"IF(C$49<>FALSE,COUNTIF($C$14:$C$46, \"<\" & $C$49)*1000000/$C$57,\"*\")","v":{"$error":"#DIV/0!"}},{"$f":"IF(D$49<>FALSE,COUNTIF($D$14:$D$46, \"<\" & $D$49)*1000000/$D$57,\"*\")","v":{"$error":"#DIV/0!"}},{"$f":"IF(E$49<>FALSE,COUNTIF($E$14:$E$46, \"<\" & $E$49)*1000000/$E$57,\"*\")","v":{"$error":"#DIV/0!"}},{"$f":"IF(F$49<>FALSE,COUNTIF($F$14:$F$46, \"<\" & $F$49)*1000000/$F$57,\"*\")","v":{"$error":"#DIV/0!"}},{"$f":"IF(G$49<>FALSE,COUNTIF($G$14:$G$46, \"<\" & $G$49)*1000000/$G$57,\"*\")","v":{"$error":"#DIV/0!"}},{"$f":"IF(H$49<>FALSE,COUNTIF($H$14:$H$46, \"<\" & $H$49)*1000000/$H$57,\"*\")","v":{"$error":"#DIV/0!"}},{"$f":"IF(I$49<>FALSE,COUNTIF($I$14:$I$46, \"<\" & $I$49)*1000000/$I$57,\"*\")","v":{"$error":"#DIV/0!"}}]
["PPM>USL",{"$f":"IF(B$48<>FALSE,COUNTIF($B$14:$B$46, \">\" & $B$48)*1000000/$B$57,\"*\")","v":0},{"$f":"IF(C$48<>FALSE,COUNTIF($C$14:$C$46, \">\" & $C$48)*1000000/$C$57,\"*\")","v":{"$error":"#DIV/0!"}},{"$f":"IF(D$48<>FALSE,COUNTIF($D$14:$D$46, \">\" & $D$48)*1000000/$D$57,\"*\")","v":{"$error":"#DIV/0!"}},{"$f":"IF(E$48<>FALSE,COUNTIF($E$14:$E$46, \">\" & $E$48)*1000000/$E$57,\"*\")","v":{"$error":"#DIV/0!"}},{"$f":"IF(F$48<>FALSE,COUNTIF($F$14:$F$46, \">\" & $F$48)*1000000/$F$57,\"*\")","v":{"$error":"#DIV/0!"}},{"$f":"IF(G$48<>FALSE,COUNTIF($G$14:$G$46, \">\" & $G$48)*1000000/$G$57,\"*\")","v":{"$error":"#DIV/0!"}},{"$f":"IF(H$48<>FALSE,COUNTIF($H$14:$H$46, \">\" & $H$48)*1000000/$H$57,\"*\")","v":{"$error":"#DIV/0!"}},{"$f":"IF(I$48<>FALSE,COUNTIF($I$14:$I$46, \">\" & $I$48)*1000000/$I$57,\"*\")","v":{"$error":"#DIV/0!"}}]
["PPM",{"$f":"SUM(B80:B81)","v":0},{"$f":"SUM(C80:C81)","v":{"$error":"#DIV/0!"}},{"$error":"#DIV/0!"},{"$error":"#DIV/0!"},{"$error":"#DIV/0!"},{"$error":"#DIV/0!"},{"$error":"#DIV/0!"},{"$error":"#DIV/0!"}]
["UCL",{"$f":"B50+(B54*3)","v":5.008730898267074},{"$f":"C50+(C54*3)","v":{"$error":"#VALUE!"}},{"$f":"D50+(D54*3)","v":{"$error":"#VALUE!"}},{"$error":"#VALUE!"},{"$error":"#VALUE!"},{"$error":"#VALUE!"},{"$error":"#VALUE!"},{"$error":"#VALUE!"}]
["LCL",{"$f":"B50-(B54*3)","v":4.9888448593086858},{"$f":"C50-(C54*3)","v":{"$error":"#VALUE!"}},{"$f":"D50-(D54*3)","v":{"$error":"#VALUE!"}},{"$error":"#VALUE!"},{"$error":"#VALUE!"},{"$error":"#VALUE!"},{"$error":"#VALUE!"},{"$error":"#VALUE!"}]

{"sheet":"10.Post PPAP Run@Rate Pilot Run","index":12,"n_rows":56,"n_cols":13,"rows_kept":56,"cut":false,"hidden":false,"merged":[[6,1,6,3],[6,4,6,6],[6,8,6,11],[6,12,6,13],[1,4,2,13],[5,2,5,3],[5,4,5,6],[5,8,5,11],[5,12,5,13],[7,12,7,13],[8,2,8,3],[8,4,8,6],[8,8,8,11],[8,12,8,13],[7,2,7,3],[7,4,7,6],[7,8,7,11],[9,2,9,3],[9,4,9,6],[9,8,9,11],[9,12,9,13],[17,1,17,13],[20,1,20,3],[20,6,20,10],[21,1,21,3],[21,6,21,10],[19,1,19,3],[19,6,19,10],[22,1,22,3],[22,6,22,10],[38,6,39,10],[38,12,38,13],[23,1,23,3],[23,6,23,10],[24,1,24,3],[24,6,24,10],[25,2,25,3],[25,8,25,10],[26,9,26,13],[28,2,31,13],[35,1,35,6],[35,7,35,14],[36,1,36,4],[55,6,55,10],[55,12,55,13],[56,12,56,13],[57,2,57,12],[41,3,41,12],[45,2,47,13],[51,6,51,10],[51,12,51,13],[52,12,52,13],[53,6,53,10],[53,12,53,13]]}
[]
[null,null,null,null,"Post-dkPAP Run@Rate-Testlauf"]
[]
[null,"Lieferanteninformationen "]
[]
[null,null,"Name des Lieferanten:",null,{"$f":"'0.Submission Checklist'!R2","v":0},null,null,null,"Datum:"]
[null,"Zeichnungsnummer:",null,null,{"$f":"'0.Submission Checklist'!D2","v":0},null,null,null,"dk Einkaufverantwortlicher",null,null,null,{"$f":"'0.Submission Checklist'!D7","v":0}]
[null,null,"Zeichnungsrevision:",null,{"$f":"'0.Submission Checklist'!D3","v":0},null,null,null,"Kontaktperson Lieferant",null,null,null,{"$f":"'0.Submission Checklist'!R4","v":0}]
[null,null,"Revisionsdatum:",null,null,null,null,null,"Telefonnummer Lieferant"]
[null,null,"dormakaba P/N:",null,{"$f":"'0.Submission Checklist'!D4","v":0},null,null,null,"E-Mail-Adresse Lieferant:",null,null,null,{"$f":"'0.Submission Checklist'!R5","v":0}]
[]
[]
[null,"Kapazitätsplanung",null,null,null,null,null,"Run@Rate-Volumen"]
[]
[null,null,null,"AMU:",null,null,null,null,null,null,null,"Anforderungen Run@Rate-Testlauf:"]
[null,null,null,"Vorlaufzeit:",null,null,null,null,null,null,null,"Betriebszeit Run@Rate:"]
[]
[null,"Testlauf (vom Lieferanten auszufüllen)"]
[]
[null,"Geplantes Laufdatum:",null,null,null,null,"Tatsächliches Laufdatum:"]
[null,"Geplante Laufzeit:",null,null,null,null,"Tatsächliche Laufzeit:"]
[null,"Ziel (PPH):",null,null,null,null,"Ist (PPH):"]
[null,"Geplanter Ausschuss:",null,null,null,null,"Tatsächlicher Ausschuss:"]
[null,"Geplante Rüstzeit:",null,null,null,null,"Tatsächliche Rüstzeit:"]
[null,"Qualitätsleistungsziel (PPM):",null,null,null,null,"Tatsächliche Qualitätsleistung (PPM):"]
[]
[]
[null,null,"Kommentare:"]
[]
[]
[]
[]
[]
[null,"Empfehlung Lieferant"]
[]
[null,"Pass",null,null,null,null,null,"Fail"]
[null,"Zulassung Lieferant"]
[null,null,null,null,null,null,"Unterschrift",null,null,null,null,null,"Datum"]
[null,null,"Vertreter Lieferant"]
[]
[]
[null,null,null,"Alle nachstehenden Informationen sind von dormakaba auszufüllen"]
[]
[]
[null,null,"Kommentare:"]
[]
[]
[]
[]
[null,"Zulassungsunterschriften",null,null,null,null,"Unterschrift",null,null,null,null,null,"Datum"]
[]
[null,null,"Vertreter Versorgungskette"]
[]
[null,null,"Qualitätsbeauftragter"]
[]
[null,null,"Technischer Vertreter"]

{"sheet":"11.Appearance Approval","index":13,"n_rows":34,"n_cols":25,"rows_kept":34,"cut":false,"hidden":false,"merged":[[1,22,1,24],[1,1,1,3],[1,4,1,10],[1,11,1,14],[1,15,1,18],[1,19,1,21],[2,23,2,24],[3,1,3,3],[3,4,3,7],[3,9,3,11],[3,13,3,15],[3,16,3,17],[3,21,3,23],[2,1,2,3],[2,4,2,10],[2,11,2,12],[2,13,2,15],[2,16,2,17],[2,21,2,22],[9,1,14,17],[9,22,9,24],[10,18,10,21],[10,22,11,24],[11,18,11,21],[12,18,12,21],[17,24,19,24],[18,21,18,22],[19,21,19,22],[5,21,5,24],[7,18,9,21],[7,22,7,24],[8,22,8,24],[12,22,13,24],[13,18,13,21],[14,18,14,21],[14,22,15,24],[15,18,15,21],[33,23,33,24],[35,3,36,5],[29,1,29,2],[29,3,31,24],[32,1,32,7],[32,10,32,12],[32,13,32,17],[32,18,33,22],[33,1,33,7],[33,8,33,9],[33,10,33,12],[33,13,33,17]]}
[null,null,null,null,null,null,null,null,null,null,null,null,null,null,"BERICHT ZUR FREIGABE DES AUSSEHENS"]
[null,"BAUTEILNUMMER",null,null,{"$f":"'0.Submission Checklist'!D4","v":0},null,null,null,null,null,null,"ZEICHNUNGSNUMMER",null,null,null,{"$f":"'0.Submission Checklist'!D2","v":0},null,null,null,"ANWENDUNG"]
[null,"BAUTEILNAME",null,null,{"$f":"'0.Submission Checklist'!D5","v":0},null,null,null,null,null,null,"KÄUFER",null,null,null,null,"E/C-NIVEAU",null,null,null,null,"DATUM"]
[null,"LIEFERANT",null,null,{"$f":"'[1]0.Submission Checklist'!R2","v":0},null,null,null,"ANSCHRIFT",null,null,null,"ORT",null,null,null,"BUNDESLAND",null,null,"PLZ",null,"LIEFERANTENCODE"]
[null,"GRUND FÜR DIE",null,null,null,"TEILEVORLAGEBESTÄTIGUNG",null,null,null,null,"SONDERMUSTER",null,null,null,null,null,"WIEDEREINREICHUNG",null,null,null,null,"SONSTIGES"]
[null,"EINREICHUNG",null,null,null,"VORTEXTUR",null,null,null,null,"ERSTE PRODUKTIONSLIEFERUNG",null,null,null,null,null,"TECHNISCHE ÄNDERUNG"]
[null,"AUSSEHENSBEWERTUNG"]
[null,null,null,null,null,null,null,null,null,null,null,null,null,null,null,null,null,null,"VORTEXTUR\nBEWERTUNG",null,null,null,"AUTORISIERTER KUNDE"]
[null,"INFORMATIONEN DER ORGANISATION ZU QUELLE UND TEXTUR (Attributanalyse)",null,null,null,null,null,null,null,null,null,null,null,null,null,null,null,null,null,null,null,null,"VERTRETER"]
[null,null,null,null,null,null,null,null,null,null,null,null,null,null,null,null,null,null,null,null,null,null,"UNTERSCHRIFT UND DATUM"]
[null,null,null,null,null,null,null,null,null,null,null,null,null,null,null,null,null,null,"   KORRIGIEREN UND"]
[null,null,null,null,null,null,null,null,null,null,null,null,null,null,null,null,null,null," FORTFAHREN"]
[null,null,null,null,null,null,null,null,null,null,null,null,null,null,null,null,null,null,"   KORRIGIEREN UND"]
[null,null,null,null,null,null,null,null,null,null,null,null,null,null,null,null,null,null,"   WIEDER EINREICHEN"]
[null,null,null,null,null,null,null,null,null,null,null,null,null,null,null,null,null,null,"   GENEHMIGT"]
[null,null,null,null,null,null,null,null,null,null,null,null,null,null,null,null,null,null,"ETCH/TOOL/EDM"]
[null,"FARBAUSWERTUNG (Variable Data Analysis)"]
[null,null,null,null,null,null,null,null,null,null,null,null,null,null,null,null,null,null,null,null,null,null,null,"FARBE","TEIL\nDISPOSITION\n(PASS/FAIL)"]
[null,"FARBE",null,null,"TRISTIMULUSDATEN",null,null,"MASTER","MASTER","MATERIAL","MATERIAL","FARBTON",null,null,null,"WERT",null,"CHROMA",null,"GLANZ",null,"METALLISCH",null,"VERSAND"]
[null,"SUFFIX",null,null,null,null,null,"NUMMER:","DATUM","ART","QUELLE",null,null,null,null,null,null,null,null,null,null,"BRILLANZ",null,"SUFFIX"]
[null,null,"DL*","Da*","Db*","DE*","CMC",null,null,null,null,"ROT","GELB","GRÜN","BLAU","HELL","DUNKEL","GRAU","BLANK","HOCH","NIEDRIG","HOCH","NIEDRIG"]
[]
[]
[]
[]
[]
[]
[]
[]
[null,"KOMMENTARE"]
[]
[]
[null,"UNTERSCHRIFT DER ORGANISATION",null,null,null,null,null,null,"TELEFONNR.",null,"DATUM",null,null,"AUTORISIERTER KUNDE",null,null,null,null,null,null,null,null,null,"DATUM"]
[null,null,null,null,null,null,null,null,null,null,null,null,null,"UNTERSCHRIFT VERTRETER"]

{"sheet":"12.Master Sample","index":14,"n_rows":0,"n_cols":0,"rows_kept":0,"cut":false,"hidden":false,"merged":[]}

{"sheet":"13.Tooling Information Form","index":15,"n_rows":97,"n_cols":15,"rows_kept":97,"cut":false,"hidden":false,"merged":[[2,10,6,14],[3,2,3,3],[3,4,3,6],[3,7,3,9],[4,2,4,3],[4,4,4,6],[4,8,4,9],[0,3,0,9],[0,10,0,13],[1,1,1,3],[1,4,1,6],[1,7,1,9],[1,10,1,14],[5,1,5,3],[5,4,5,6],[5,8,5,9],[6,1,6,3],[6,4,6,6],[6,8,6,9],[2,1,2,3],[2,4,2,6],[2,7,2,9],[10,10,10,11],[10,12,10,14],[11,1,11,3],[11,4,11,6],[11,7,11,9],[11,10,11,11],[11,12,11,14],[7,1,7,2],[7,3,7,5],[7,6,7,8],[10,1,10,3],[10,4,10,6],[10,7,10,9],[12,1,12,3],[12,4,12,6],[12,7,12,9],[12,10,12,11],[12,12,12,14],[13,1,13,3],[13,4,13,6],[13,7,13,9],[13,10,13,11],[13,12,13,14],[14,1,14,3],[14,4,14,6],[14,7,14,9],[14,10,14,11],[14,12,14,14],[15,1,15,3],[15,4,15,6],[15,7,15,9],[15,10,15,11],[15,12,15,14],[16,1,16,3],[16,4,16,6],[16,7,16,9],[16,10,16,11],[16,12,16,14],[17,1,17,3],[17,4,17,6],[17,7,17,9],[17,10,17,11],[17,12,17,14],[18,1,18,3],[18,4,18,6],[18,7,18,9],[18,10,18,11],[18,12,18,14],[19,1,19,3],[19,4,19,6],[19,7,19,9],[19,10,19,11],[19,12,19,14],[20,1,20,3],[20,4,20,6],[20,7,20,9],[20,10,20,11],[20,12,20,14],[21,1,21,3],[21,4,21,6],[21,7,21,9],[21,10,21,11],[21,12,21,14],[22,1,22,3],[22,4,22,6],[22,7,22,9],[22,10,22,11],[22,12,22,14],[23,1,23,3],[23,4,23,6],[23,7,23,9],[23,10,23,11],[23,12,23,14],[24,1,24,3],[24,4,24,6],[24,7,24,9],[24,10,24,11],[24,12,24,14],[25,1,25,3],[25,4,25,6],[25,7,25,9],[25,10,25,11],[25,12,25,14],[26,1,26,3],[26,4,26,6],[26,7,26,9],[26,10,26,11],[26,12,26,14],[27,1,27,3],[27,4,27,6],[27,7,27,9],[27,10,27,11],[27,12,27,14],[28,1,28,3],[28,4,28,6],[28,7,28,9],[28,10,28,11],[28,12,28,14],[29,1,29,3],[29,4,29,6],[29,7,29,9],[29,10,29,11],[29,12,29,14],[30,1,30,3],[30,4,30,6],[30,7,30,9],[30,10,30,11],[30,12,30,14],[31,1,31,3],[31,4,31,6],[31,7,31,9],[31,10,31,11],[31,12,31,14],[34,1,37,14],[40,3,40,7],[40,9,40,13],[41,2,52,7],[41,8,52,13],[54,3,54,7],[54,9,54,13],[32,1,32,3],[32,4,32,6],[32,7,32,9],[32,10,32,11],[32,12,32,14],[33,1,33,14],[82,3,82,7],[82,9,82,13],[83,2,94,7],[83,8,94,13],[96,1,96,14],[97,1,100,14],[55,2,66,7],[55,8,66,13],[68,3,68,7],[68,9,68,13],[69,2,80,7],[69,8,80,13]]}
[null,null,null,"Werkzeuginformationsformular",null,null,null,null,null,null,"Referenznummer dormakaba-Werkzeug\n(falls zutreffend)",null,null,null,"XXXXX"]
[null,"Name des Lieferanten:",null,null,"dkPAP-Vorlagestufe",null,null,"Betroffene Merkmalsnummer(n)",null,null,"Bauteilbeschreibung"]
[null,{"$f":"'0.Submission Checklist'!R2","v":0},null,null,{"$f":"'0.Submission Checklist'!C14","v":"Stufe 1"},null,null,null,null,null,{"$f":"'0.Submission Checklist'!D5","v":0}]
[null,"Datum","dkPAP Fälligkeitsdatum",null,"Bauteilnummer",null,null,"Werkzeugstandort"]
[null,null,{"$f":"'0.Submission Checklist'!D10","v":"00:00:00"},null,{"$f":"'0.Submission Checklist'!D4","v":0},null,null,"Standort"]
[null,"Datum des Werkzeugwechsels",null,null,"Bauteilname",null,null,"Maschine"]
[null,null,null,null,null,null,null,"Station"]
[null,"Neues Werkzeug",null,"Modifizierte Werkzeuge",null,null,"Benötigt für PPAP",null,null,"Hinweis: Dieses Dokument muss für alle dormakaba-eigenen Werkzeuge ausgefüllt werden."]
[]
[null,"Komplette Werkzeugliste des Lieferanten, um sicherzustellen, dass alle Elemente abgeschlossen sind."]
[null,"WERKZEUGHANDLUNG",null,null,"Wer?",null,null,"Was?",null,null,"Wann?",null,"Status"]
[null,"Bildbearbeitung"]
[null,"Diagramm oder Streifenlayout"]
[null,"Werkzeugzeichnungen"]
[null,"Werkzeugkostenaufschlüsselung"]
[null,"Designkosten"]
[null,"Materialkosten"]
[null,"Arbeitskosten"]
[null,"Werkzeugbeschreibung"]
[null,"Werkzeugabmessungen"]
[null,"Länge"]
[null,"Breite"]
[null,"Höhe"]
[null,"Einbauhöhe"]
[null,"Gewicht"]
[null,"Pressengröße"]
[null,"Werkzeugmaterial"]
[null,"Werkzeugkapazität"]
[null,"Stündlich"]
[null,"Täglich"]
[null,"Jährlich"]
[null,"Lebenserwartung"]
[]
[null,"Kommentare"]
[]
[]
[]
[]
[]
[]
[null,null,"Abb. 1","Draufsicht",null,null,null,null,"Abb. 2","Unteransicht"]
[]
[]
[]
[]
[]
[]
[]
[]
[]
[]
[]
[]
[]
[null,null,"Abb. 3","Linke Ansicht",null,null,null,null,"Abb. 4","Rechte Ansicht"]
[]
[]
[]
[]
[]
[]
[]
[]
[]
[]
[]
[]
[]
[null,null,"Abb. 5","Frontansicht",null,null,null,null,"Abb. 6","Rückansicht"]
[]
[]
[]
[]
[]
[]
[]
[]
[]
[]
[]
[]
[]
[null,null,"Abb. 7","Werkzeug Stammblatt Ansicht",null,null,null,null,"Abb. 8","Beispiel"]
[]
[]
[]
[]
[]
[]
[]
[]
[]
[]
[]
[]
[]
[null,"Zusätzliche Kommentare"]

{"sheet":"14.Packaging Form","index":16,"n_rows":66,"n_cols":12,"rows_kept":66,"cut":false,"hidden":false,"merged":[[0,1,0,13],[1,10,1,13],[2,1,2,3],[2,4,2,6],[2,7,2,9],[2,11,2,13],[3,11,5,13],[4,1,4,3],[4,4,4,6],[4,7,4,9],[6,1,6,3],[6,4,6,6],[6,7,6,9],[6,11,8,13],[7,4,7,6],[7,7,7,9],[8,1,8,3],[8,4,8,6],[10,1,27,1],[10,2,11,4],[10,5,11,7],[29,1,35,1],[29,2,29,3],[33,2,33,3],[33,7,33,8],[34,2,34,3],[34,4,34,5],[34,7,34,8],[33,10,33,12],[10,11,11,13],[12,2,27,7],[12,8,27,13],[10,8,11,10],[31,7,31,8],[31,10,31,12],[32,2,32,3],[32,7,32,8],[32,10,32,12],[29,10,29,13],[30,2,30,3],[30,7,30,8],[30,10,30,12],[31,2,31,3],[34,10,34,12],[35,7,35,8],[40,2,55,7],[40,8,55,13],[57,1,65,1],[57,2,57,3],[57,4,57,5],[57,6,57,7],[57,8,57,9],[57,11,57,13],[58,2,58,3],[58,4,58,5],[38,1,55,1],[38,2,39,4],[38,5,39,7],[38,8,39,10],[38,11,39,13],[58,6,58,7],[58,8,58,9],[58,11,58,13],[59,2,59,3],[59,4,59,5],[59,6,59,7],[59,8,59,9],[59,11,59,13],[61,2,61,3],[61,4,61,5],[61,6,61,7],[61,8,61,9],[61,11,61,13],[60,2,60,3],[60,4,60,5],[60,6,60,7],[60,8,60,9],[60,11,60,13],[63,2,63,3],[63,4,63,5],[63,6,63,7],[63,8,63,9],[63,11,63,13],[62,2,62,3],[62,4,62,5],[62,6,62,7],[62,8,62,9],[62,11,62,13],[65,2,65,3],[65,4,65,5],[65,6,65,7],[65,8,65,9],[65,11,65,13],[64,2,64,3],[64,4,64,5],[64,6,64,7],[64,8,64,9],[64,11,64,13]]}
[null,"Verpackungsform"]
[null,"Datum",null,null,"Kontaktperson Verpackung",null,null,"Bauteilnummer",null,null,"Lieferantenverantwortung abgeschlossen?"]
[null,null,null,null,null,null,null,null,null,null,null,"Verpackungsdesign"]
[null,"Name des Lieferanten:",null,null,"Telefonnummer",null,null,"Druckrevisionsstufe",null,null,null,"Verpackung, die Versand- und Materialumschlagschäden verhindert"]
[null,{"$f":"'0.Submission Checklist'!R2","v":0}]
[null,"Lieferantencode",null,null,"Faxnummer",null,null,"Bauteilbeschreibung"]
[null,null,null,null,null,null,null,null,null,null,null,"Elektronische Speicherung der eingereichten Verpackungsdaten"]
[null,"Produktionsstätte des Lieferanten",null,null,"E-Mail-Adresse",null,null,"HAZMAT?"]
[]
[]
[null,"DIGITALE BILDER","Teil",null,null,"In Verpackungsposition",null,null,"Behälter",null,null,"Mit sichtbarem Etikett"]
[]
[]
[]
[]
[]
[]
[]
[]
[]
[]
[]
[]
[]
[]
[]
[]
[]
[]
[null,"PAKETDATEN","Komponente",null,"L (mm)","B (mm)","H (mm)","Komponente",null,"Gewicht (kg)","Mengen"]
[null,null,"Bauteilgröße",null,null,null,null,"Teil",null,null,"Anzahl Teile pro Behälter"]
[null,null,"Nur Behälter",null,null,null,null,"Packmaterial (Tara)",null,null,"Behälter pro Lage auf Palette"]
[null,null,"Nur Palette",null,null,null,null,"Behälter (Tara)",null,null,"Lagen pro Palette"]
[null,null,"Einheitsladung als Versand",null,null,null,null,"Palette (Tara)",null,null,"Behälter pro Palette"]
[null,null,"Zoll zu mm",null,"Pfund zu kg",null,null,"Behälter Brutto (inkl. Teile)",null,null,"Stapelregel"]
[null,null,null,{"$f":"2.54*C36","v":0},null,{"$f":"0.45359237*E36","v":0},null,"Stückgut Brutto (inkl. Teile)"]
[]
[]
[null,"DIGITALE BILDER","Packmaterial",null,null,"In Behälterposition",null,null,"Stückgut",null,null,"Wie mit Etikett geliefert"]
[]
[]
[]
[]
[]
[]
[]
[]
[]
[]
[]
[]
[]
[]
[]
[]
[]
[]
[null,"VERPACKUNGSMATERIAL","Beschreibung",null,"Hersteller",null,"Material:",null,"Bearbeitungszeit",null,"RET/EXP","KOMMENTARE"]
[null,null,"Packmaterial"]
[null,null,"Behälterfarbe"]
[null,null,"Behältertyp"]
[null,null,"Abdeckung/Aheadkappe"]
[null,null,"Palette"]
[null,null,"Stretch/Schrumpffolie"]
[null,null,"Streifen"]
[null,null,"Andere"]

{"sheet":"15.Checking Aids","index":17,"n_rows":9,"n_cols":7,"rows_kept":9,"cut":false,"hidden":false,"merged":[[6,5,6,6],[7,0,7,1],[7,2,7,3],[7,5,7,6],[13,0,13,1],[9,0,9,1],[10,0,10,1],[11,0,11,1],[12,0,12,1],[24,0,24,1],[3,2,3,3],[4,2,4,3],[5,0,5,1],[5,2,5,3],[8,0,8,1],[34,0,34,1],[26,0,26,1],[27,0,27,1],[28,0,28,1],[29,0,29,1],[30,0,30,1],[31,0,31,1],[3,5,3,6],[4,5,4,6],[5,5,5,6],[32,0,32,1],[33,0,33,1],[25,0,25,1],[14,0,14,1],[15,0,15,1],[16,0,16,1],[17,0,17,1],[18,0,18,1],[19,0,19,1],[20,0,20,1],[21,0,21,1],[22,0,22,1],[23,0,23,1]]}
[]
[null,null,null,"Prüfmittel"]
[]
["ORGANISATION:",null,null,null,"BAUTEILNUMMER:"]
["LIEFERANTEN-/VERKÄUFERCODE:",null,null,null,"BAUTEILNAME:"]
["LIEFERANT:",null,null,null,"ZEICHNUNGSNR.:"]
["* BENUTZERDEFINIERTER LIEFERANTEN-/VERKÄUFERCODE:",null,null,null,"DWG REV:"]
["Bauteilname:",null,null,null,"Erstellt am:"]
["Messgerätenummer",null,"Revisionsstand Maßzeichnung","Beschreibung Messgerät/Instrument","Kalibrierstatus ","MSA-Ergebnisse","Datum MSA"]

{"sheet":"16.Software Firmware","index":18,"n_rows":55,"n_cols":9,"rows_kept":55,"cut":false,"hidden":false,"merged":[[9,3,9,5],[1,4,2,9],[4,2,4,4],[4,6,4,8],[8,3,8,5],[8,7,8,8],[10,3,10,5],[11,3,11,5],[12,3,12,5],[15,2,18,8],[23,3,23,5],[23,6,23,8],[24,3,24,5],[24,6,24,8],[25,3,25,5],[25,6,25,8],[34,3,34,5],[34,6,34,8],[56,4,57,5],[56,6,57,7],[56,8,57,8],[35,3,35,5],[35,6,35,8],[44,2,46,8],[48,2,51,9],[54,4,55,5],[54,8,55,8]]}
[]
[null,null,null,null,"Software-/Firmware-Programmierungsüberprüfung"]
[]
[]
[null,null,"Von dormakaba auszufüllen",null,null,null,"Vom Lieferanten auszufüllen"]
[]
[null,"Allgemeine Informationen"]
[]
[null,null,"Name des Lieferanten:",{"$f":"'0.Submission Checklist'!R2","v":0},null,null,"Datum:"]
[null,null,"Standort des Lieferanten:",null,null,null,"Seitennr."]
[null,null,"Zeichnungsnummer:",{"$f":"'0.Submission Checklist'!D2","v":0},null,null,"Seiten insgesamt"]
[null,null,"Zeichnungsrevision:",{"$f":"'0.Submission Checklist'!D3","v":0}]
[null,null,"SAP Bauteilnummer:",{"$f":"'0.Submission Checklist'!D4","v":0}]
[]
[null,null,"Beschreibung der Änderung (Bitte beschreiben Sie ausführlich die Art der Änderung/Aktualisierung)"]
[]
[]
[]
[]
[]
[]
[]
[]
[null,null,null,"Firmware #1",null,null,"Firmware #2"]
[null,null,"FW Zeichnung -->"]
[null,null,"Beschreibung -->"]
[null,null,"Muster\nNummer","Erwarteter\nWert","Lieferant\nÜberprüfung","dormakaba\nÜberprüfung","Erwarteter\nWert","Lieferant\nÜberprüfung","dormakaba\nÜberprüfung"]
[]
[]
[]
[]
[]
[]
[]
[null,null,null,"Konfiguration #1",null,null,"Konfiguration #2"]
[null,null,"Beschreibung -->"]
[null,null,"Muster\nNummer","Erwarteter\nWert","Lieferant\nÜberprüfung","dormakaba\nÜberprüfung","Erwarteter\nWert","Lieferant\nÜberprüfung","dormakaba\nÜberprüfung"]
[]
[]
[]
[]
[]
[]
[]
[null,null,"Verwenden Sie mehrere Kopien dieses Formulars für zusätzliche Firmware- oder Konfigurationsüberprüfungen"]
[]
[]
[null,null,"Kommentare"]
[]
[]
[]
[]
[null,"Zulassungsunterschriften"]
[]
[null,null,"Lieferant",null,null,null,"dk Qualität"]

{"sheet":"17.Part Submission Warrant","index":19,"n_rows":65538,"n_cols":256,"rows_kept":65538,"cut":false,"hidden":false,"merged":[[6,20,6,22],[7,10,7,12],[1,1,2,4],[1,5,2,21],[4,2,4,3],[4,4,4,10],[4,11,4,16],[4,17,4,19],[6,1,6,5],[6,6,6,9],[6,10,6,13],[6,14,6,16],[6,17,6,19],[5,2,5,3],[5,4,5,6],[5,7,5,8],[5,12,5,16],[5,17,5,22],[7,13,7,16],[7,17,7,19],[7,20,7,22],[12,7,12,10],[13,2,13,10],[13,12,13,22],[11,2,11,7],[11,8,11,10],[11,12,11,19],[11,21,11,22],[15,2,15,7],[15,8,15,10],[15,21,15,22],[40,2,40,3],[40,4,41,22],[16,8,16,10],[17,2,17,7],[17,8,17,10],[17,16,17,19],[18,2,18,4],[18,8,18,10],[22,10,22,11],[22,13,22,15],[34,12,34,22],[36,2,36,22],[38,2,38,3],[43,2,43,6],[43,7,43,22],[45,2,45,22],[46,2,46,11],[46,12,46,13],[46,15,46,16],[46,17,46,22],[47,2,47,22],[48,2,48,5],[48,6,49,22],[50,2,50,9],[51,2,51,6],[51,7,53,9],[51,12,51,18],[51,19,51,22],[52,2,52,3],[52,10,52,11],[60,7,60,12],[60,15,60,22],[52,12,52,18],[52,19,52,22],[53,10,53,11],[53,12,53,18],[55,2,55,22],[56,2,56,5],[56,11,56,12]]}
[]
[null,null,null,null,null,"Teilevorlagebestätigung"]
[]
[]
[null,null,"Bauteilname:",null,null,null,null,null,null,null,null,"SAP Bauteilnummer (8-stellig):",null,null,null,null,null,{"$f":"'0.Submission Checklist'!D4","v":0}]
[null,null,"Zeichnungs-Nr.",null,{"$f":"'0.Submission Checklist'!D2","v":0},null,null,"Zeichnungsrevision",null,{"$f":"'0.Submission Checklist'!D3","v":0},null,null,"Bauteilnummer des Lieferanten:"]
[null,"Bestell-Nr.",null,null,null,null,null,null,null,null,"Gewicht (kg/g):",null,null,null,null,null,null,"PPAP Fälligkeitsdatum:",null,null,{"$f":"'0.Submission Checklist'!D10","v":0}]
[]
[]
[null,null,"LIEFERANTENINFORMATIONEN",null,null,null,null,null,null,null,null,null,"dormakaba INFORMATIONEN"]
[]
[null,null,{"$f":"'0.Submission Checklist'!R2","v":0},null,null,null,null,null,null,null,null,null,"dormakaba",null,null,null,null,null,null,null,"/"]
[null,null,"Name der Organisation",null,null,null,null,"Lieferanten-/Verkäufercode",null,null,null,null,"dormakaba Division/Werk"]
[]
[null,null,"Adresse",null,null,null,null,null,null,null,null,null,"dormakaba Vertreter Versorgungskette"]
[null,null,null,null,null,null,null,null,null,null,null,null,"Bitte geben Sie die Nr. dieser Einreichung an: "]
[null,null,"Ort",null,null,null,null,null,"Bundesland",null,null,null,"Wenn nicht Erstübermittlung, wurden alle gewünschten Änderungen"]
[null,null,null,null,null,null,null,null,null,null,null,null,"vorgenommen? "]
[null,null,"Land",null,null,null,null,null,"Postleitzahl"]
[]
[null,null,"MATERIALBERICHTERSTATTUNG"]
[null,null,"Enthält dieses Material gemäß den Materialvorschriften eingeschränkten Stoffe?"]
[null,null,"Angeforderte Materialkonformitätserklärungen via Portal?",null,null,null,null,null,null,null,"EU RoHS",null,null,"EU REACH ",null,null,null,null,"TSCA",null,null,"CA Prop 65"]
[]
[]
[]
[null,null,"GRUND FÜR DIE VORLAGE (mindestens einen überprüfen)"]
[]
[]
[]
[]
[]
[]
[]
[]
[null,null,"ANGEFORDERTE VORLAGESTUFE (automatisch aus Checkliste eingefügt)"]
[null,null,{"$f":"'[1]Submission Checklist Version 1 '!N13","v":"Level 3"}]
[null,null,"ERGEBNISSE DER EINREICHUNG"]
[null,null,"Ergebnisse für"]
[null,null,"Diese Ergebnisse erfüllen alle Zeichnungs- und Spezifikationsanforderungen: ",null,null,null,null,null,null,null,null,null,null,"(Wenn „NEIN“ – Erklärung erforderlich)"]
[null,null,"Erklärung:"]
[]
[]
[null,null,"Form / Hohlraum / Produktionsprozess"]
[null,null,"ERKLÄRUNG"]
[null,null,"Ich bestätige hiermit, dass die durch diesen Garantieschein repräsentierten Muster repräsentativ sind für unsere Bauteile und dass diese in einem Prozess hergestellt wurden, der alle Anforderungen erfüllt."]
[null,null," Prozessanforderungen.  Ich bestätige ferner, dass die Muster gemäß dieser Anforderungen ",null,null,null,null,null,null,null,null,null,null,null,"/",null,null,". Ich bestätige auch, dass dokumentierte Beweise für"]
[null,null,"hergestellt wurden und diese aktenkundig und zur Überprüfung verfügbar sind.  Ich habe Abweichungen von der nachstehenden Erklärung festgestellt."]
[null,null,"ERLÄUTERUNG/KOMMENTARE:"]
[]
[null,null,"Ist jedes Customer Tool richtig markiert und nummeriert?"]
[null,null,"Autorisierte Unterschrift der Organisation: ",null,null,null,null,null,null,null,null,"Datum:"]
[null,null,null,null,null,null,null,null,null,null,"Telefonnummer "]
[null,null,null,null,null,null,null,null,null,null,"E-Mail: "]
[]
[null,null,"NUR FÜR dormakaba"]
[null,null,"PPAP Garantieverfügung:",null,null,null,null,null,null,null,null,null,null,null,null,null,"Kommentar:"]
[null,null,"dormakaba Testverfügung:",null,null,null,null,null,null,null,null,"   ","   ",null,null,null,"Kommentar:"]
[null," Testgarantieverfügung Lieferant:",null,null,null,null,null,null,null,null,null,"   ","   ",null,null,null,"Kommentar:"]
[]
[null,"dormakaba Autorisierte Unterschrift: "]
[]
[]
[]
[]
[]
[]
[]
[]
[]
[]
[]
[]
[]
[]
[]
[]
[]
[]
[]
[]
[]
[]
[]
[]
[]
[]
[]
[]
[]
[]
[]
[]
[]
[]
[]
[]
[]
[]
[]
[]
[]
[]
[]
[]
[]
[]
[]
[]
[]
[]
[]
[]
[]
[]
[]
[]
[]
[]
[]
[]
[]
[]
[]
[]
[]
[]
[]
[]
[]
[]
[]
[]
[]
[]
[]
[]
[]
[]
[]
[]
[]
[]
[]
[]
[]
[]
[]
[]
[]
[]
[]
[]
[]
[]
[]
[]
[]
[]
[]
[]
[]
[]
[]
[]
[]
[]
[]
[]
[]
[]
[]
[]
[]
[]
[]
[]
[]
[]
[]
[]
[]
[]
[]
[]
[]
[]
[]
[]
[]
[]
[]
[]
[]
[]
[]
[]
[]
[]
[]
[]
[]
[]
[]
[]
[]
[]
[]
[]
[]
[]
[]
[]
[]
[]
[]
[]
[]
[]
[]
[]
[]
[]
[]
[]
[]
[]
[]
[]
[]
[]
[]
[]
[]
[]
[]
[]
[]
[]
[]
[]
[]
[]
[]
[]
[]
[]
[]
[]
[]
[]
[]
[]
[]
[]
[]
[]
[]
[]
[]
[]
[]
[]
[]
[]
[]
[]
[]
[]
[]
[]
[]
[]
[]
[]
[]
[]
[]
[]
[]
[]
[]
[]
[]
[]
[]
[]
[]
[]
[]
[]
[]
[]
[]
[]
[]
[]
[]
[]
[]
[]
[]
[]
[]
[]
[]
[]
[]
[]
[]
[]
[]
[]
[]
[]
[]
[]
[]
[]
[]
[]
[]
[]
[]
[]
[]
[]
[]
[]
[]
[]
[]
[]
[]
[]
[]
[]
[]
[]
[]
[]
[]
[]
[]
[]
[]
[]
[]
[]
[]
[]
[]
[]
[]
[]
[]
[]
[]
[]
[]
[]
[]
[]
[]
[]
[]
[]
[]
[]
[]
[]
[]
[]
[]
[]
[]
[]
[]
[]
[]
[]
[]
[]
[]
[]
[]
[]
[]
[]
[]
[]
[]
[]
[]
[]
[]
[]
[]
[]
[]
[]
[]
[]
[]
[]
[]
[]
[]
[]
[]
[]
[]
[]
[]
[]
[]
[]
[]
[]
[]
[]
[]
[]
[]
[]
[]
[]
[]
[]
[]
[]
[]
[]
[]
[]
[]
[]
[]
[]
[]
[]
[]
[]
[]
[]
[]
[]
[]
[]
[]
[]
[]
[]
[]
[]
[]
[]
[]
[]
[]
[]
[]
[]
[]
[]
[]
[]
[]
[]
[]
[]
[]
[]
[]
[]
[]
[]
[]
[]
[]
[]
[]
[]
[]
[]
[]
[]
[]
[]
[]
[]
[]
[]
[]
[]
[]
[]
[]
[]
[]
[]
[]
[]
[]
[]
[]
[]
[]
[]
[]
[]
[]
[]
[]
[]
[]
[]
[]
[]
[]
[]
[]
[]
[]
[]
[]
[]
[]
[]
[]
[]
[]
[]
[]
[]
[]
[]
[]
[]
[]
[]
[]
[]
[]
[]
[]
[]
[]
[]
[]
[]
[]
[]
[]
[]
[]
[]
[]
[]
[]
[]
[]
[]
[]
[]
[]
[]
[]
[]
[]
[]
[]
[]
[]
[]
[]
[]
[]
[]
[]
[]
[]
[]
[]
[]
[]
[]
[]
[]
[]
[]
[]
[]
[]
[]
[]
[]
[]
[]
[]
[]
[]
[]
[]
[]
[]
[]
[]
[]
[]
[]
[]
[]
[]
[]
[]
[]
[]
[]
[]
[]
[]
[]
[]
[]
[]
[]
[]
[]
[]
[]
[]
[]
[]
[]
[]
[]
[]
[]
[]
[]
[]
[]
[]
[]
[]
[]
[]
[]
[]
[]
[]
[]
[]
[]
[]
[]
[]
[]
[]
[]
[]
[]
[]
[]
[]
[]
[]
[]
[]
[]
[]
[]
[]
[]
[]
[]
[]
[]
[]
[]
[]
[]
[]
[]
[]
[]
[]
[]
[]
[]
[]
[]
[]
[]
[]
[]
[]
[]
[]
[]
[]
[]
[]
[]
[]
[]
[]
[]
[]
[]
[]
[]
[]
[]
[]
[]
[]
[]
[]
[]
[]
[]
[]
[]
[]
[]
[]
[]
[]
[]
[]
[]
[]
[]
[]
[]
[]
[]
[]
[]
[]
[]
[]
[]
[]
[]
[]
[]
[]
[]
[]
[]
[]
[]
[]
[]
[]
[]
[]
[]
[]
[]
[]
[]
[]
[]
[]
[]
[]
[]
[]
[]
[]
[]
[]
[]
[]
[]
[]
[]
[]
[]
[]
[]
[]
[]
[]
[]
[]
[]
[]
[]
[]
[]
[]
[]
[]
[]
[]
[]
[]
[]
[]
[]
[]
[]
[]
[]
[]
[]
[]
[]
[]
[]
[]
[]
[]
[]
[]
[]
[]
[]
[]
[]
[]
[]
[]
[]
[]
[]
[]
[]
[]
[]
[]
[]
[]
[]
[]
[]
[]
[]
[]
[]
[]
[]
[]
[]
[]
[]
[]
[]
[]
[]
[]
[]
[]
[]
[]
[]
[]
[]
[]
[]
[]
[]
[]
[]
[]
[]
[]
[]
[]
[]
[]
[]
[]
[]
[]
[]
[]
[]
[]
[]
[]
[]
[]
[]
[]
[]
[]
[]
[]
[]
[]
[]
[]
[]
[]
[]
[]
[]
[]
[]
[]
[]
[]
[]
[]
[]
[]
[]
[]
[]
[]
[]
[]
[]
[]
[]
[]
[]
[]
[]
[]
[]
[]
[]
[]
[]
[]
[]
[]
[]
[]
[]
[]
[]
[]
[]
[]
[]
[]
[]
[]
[]
[]
[]
[]
[]
[]
[]
[]
[]
[]
[]
[]
[]
[]
[]
[]
[]
[]
[]
[]
[]
[]
[]
[]
[]
[]
[]
[]
[]
[]
[]
[]
[]
[]
[]
[]
[]
[]
[]
[]
[]
[]
[]
[]
[]
[]
[]
[]
[]
[]
[]
[]
[]
[]
[]
[]
[]
[]
[]
[]
[]
[]
[]
[]
[]
[]
[]
[]
[]
[]
[]
[]
[]
[]
[]
[]
[]
[]
[]
[]
[]
[]
[]
[]
[]
[]
[]
[]
[]
[]
[]
[]
[]
[]
[]
[]
[]
[]
[]
[]
[]
[]
[]
[]
[]
[]
[]
[]
[]
[]
[]
[]
[]
[]
[]
[]
[]
[]
[]
[]
[]
[]
[]
[]
[]
[]
[]
[]
[]
[]
[]
[]
[]
[]
[]
[]
[]
[]
[]
[]
[]
[]
[]
[]
[]
[]
[]
[]
[]
[]
[]
[]
[]
[]
[]
[]
[]
[]
[]
[]
[]
[]
[]
[]
[]
[]
[]
[]
[]
[]
[]
[]
[]
[]
[]
[]
[]
[]
[]
[]
[]
[]
[]
[]
[]
[]
[]
[]
[]
[]
[]
[]
[]
[]
[]
[]
[]
[]
[]
[]
[]
[]
[]
[]
[]
[]
[]
[]
[]
[]
[]
[]
[]
[]
[]
[]
[]
[]
[]
[]
[]
[]
[]
[]
[]
[]
[]
[]
[]
[]
[]
[]
[]
[]
[]
[]
[]
[]
[]
[]
[]
[]
[]
[]
[]
[]
[]
[]
[]
[]
[]
[]
[]
[]
[]
[]
[]
[]
[]
[]
[]
[]
[]
[]
[]
[]
[]
[]
[]
[]
[]
[]
[]
[]
[]
[]
[]
[]
[]
[]
[]
[]
[]
[]
[]
[]
[]
[]
[]
[]
[]
[]
[]
[]
[]
[]
[]
[]
[]
[]
[]
[]
[]
[]
[]
[]
[]
[]
[]
[]
[]
[]
[]
[]
[]
[]
[]
[]
[]
[]
[]
[]
[]
[]
[]
[]
[]
[]
[]
[]
[]
[]
[]
[]
[]
[]
[]
[]
[]
[]
[]
[]
[]
[]
[]
[]
[]
[]
[]
[]
[]
[]
[]
[]
[]
[]
[]
[]
[]
[]
[]
[]
[]
[]
[]
[]
[]
[]
[]
[]
[]
[]
[]
[]
[]
[]
[]
[]
[]
[]
[]
[]
[]
[]
[]
[]
[]
[]
[]
[]
[]
[]
[]
[]
[]
[]
[]
[]
[]
[]
[]
[]
[]
[]
[]
[]
[]
[]
[]
[]
[]
[]
[]
[]
[]
[]
[]
[]
[]
[]
[]
[]
[]
[]
[]
[]
[]
[]
[]
[]
[]
[]
[]
[]
[]
[]
[]
[]
[]
[]
[]
[]
[]
[]
[]
[]
[]
[]
[]
[]
[]
[]
[]
[]
[]
[]
[]
[]
[]
[]
[]
[]
[]
[]
[]
[]
[]
[]
[]
[]
[]
[]
[]
[]
[]
[]
[]
[]
[]
[]
[]
[]
[]
[]
[]
[]
[]
[]
[]
[]
[]
[]
[]
[]
[]
[]
[]
[]
[]
[]
[]
[]
[]
[]
[]
[]
[]
[]
[]
[]
[]
[]
[]
[]
[]
[]
[]
[]
[]
[]
[]
[]
[]
[]
[]
[]
[]
[]
[]
[]
[]
[]
[]
[]
[]
[]
[]
[]
[]
[]
[]
[]
[]
[]
[]
[]
[]
[]
[]
[]
[]
[]
[]
[]
[]
[]
[]
[]
[]
[]
[]
[]
[]
[]
[]
[]
[]
[]
[]
[]
[]
[]
[]
[]
[]
[]
[]
[]
[]
[]
[]
[]
[]
[]
[]
[]
[]
[]
[]
[]
[]
[]
[]
[]
[]
[]
[]
[]
[]
[]
[]
[]
[]
[]
[]
[]
[]
[]
[]
[]
[]
[]
[]
[]
[]
[]
[]
[]
[]
[]
[]
[]
[]
[]
[]
[]
[]
[]
[]
[]
[]
[]
[]
[]
[]
[]
[]
[]
[]
[]
[]
[]
[]
[]
[]
[]
[]
[]
[]
[]
[]
[]
[]
[]
[]
[]
[]
[]
[]
[]
[]
[]
[]
[]
[]
[]
[]
[]
[]
[]
[]
[]
[]
[]
[]
[]
[]
[]
[]
[]
[]
[]
[]
[]
[]
[]
[]
[]
[]
[]
[]
[]
[]
[]
[]
[]
[]
[]
[]
[]
[]
[]
[]
[]
[]
[]
[]
[]
[]
[]
[]
[]
[]
[]
[]
[]
[]
[]
[]
[]
[]
[]
[]
[]
[]
[]
[]
[]
[]
[]
[]
[]
[]
[]
[]
[]
[]
[]
[]
[]
[]
[]
[]
[]
[]
[]
[]
[]
[]
[]
[]
[]
[]
[]
[]
[]
[]
[]
[]
[]
[]
[]
[]
[]
[]
[]
[]
[]
[]
[]
[]
[]
[]
[]
[]
[]
[]
[]
[]
[]
[]
[]
[]
[]
[]
[]
[]
[]
[]
[]
[]
[]
[]
[]
[]
[]
[]
[]
[]
[]
[]
[]
[]
[]
[]
[]
[]
[]
[]
[]
[]
[]
[]
[]
[]
[]
[]
[]
[]
[]
[]
[]
[]
[]
[]
[]
[]
[]
[]
[]
[]
[]
[]
[]
[]
[]
[]
[]
[]
[]
[]
[]
[]
[]
[]
[]
[]
[]
[]
[]
[]
[]
[]
[]
[]
[]
[]
[]
[]
[]
[]
[]
[]
[]
[]
[]
[]
[]
[]
[]
[]
[]
[]
[]
[]
[]
[]
[]
[]
[]
[]
[]
[]
[]
[]
[]
[]
[]
[]
[]
[]
[]
[]
[]
[]
[]
[]
[]
[]
[]
[]
[]
[]
[]
[]
[]
[]
[]
[]
[]
[]
[]
[]
[]
[]
[]
[]
[]
[]
[]
[]
[]
[]
[]
[]
[]
[]
[]
[]
[]
[]
[]
[]
[]
[]
[]
[]
[]
[]
[]
[]
[]
[]
[]
[]
[]
[]
[]
[]
[]
[]
[]
[]
[]
[]
[]
[]
[]
[]
[]
[]
[]
[]
[]
[]
[]
[]
[]
[]
[]
[]
[]
[]
[]
[]
[]
[]
[]
[]
[]
[]
[]
[]
[]
[]
[]
[]
[]
[]
[]
[]
[]
[]
[]
[]
[]
[]
[]
[]
[]
[]
[]
[]
[]
[]
[]
[]
[]
[]
[]
[]
[]
[]
[]
[]
[]
[]
[]
[]
[]
[]
[]
[]
[]
[]
[]
[]
[]
[]
[]
[]
[]
[]
[]
[]
[]
[]
[]
[]
[]
[]
[]
[]
[]
[]
[]
[]
[]
[]
[]
[]
[]
[]
[]
[]
[]
[]
[]
[]
[]
[]
[]
[]
[]
[]
[]
[]
[]
[]
[]
[]
[]
[]
[]
[]
[]
[]
[]
[]
[]
[]
[]
[]
[]
[]
[]
[]
[]
[]
[]
[]
[]
[]
[]
[]
[]
[]
[]
[]
[]
[]
[]
[]
[]
[]
[]
[]
[]
[]
[]
[]
[]
[]
[]
[]
[]
[]
[]
[]
[]
[]
[]
[]
[]
[]
[]
[]
[]
[]
[]
[]
[]
[]
[]
[]
[]
[]
[]
[]
[]
[]
[]
[]
[]
[]
[]
[]
[]
[]
[]
[]
[]
[]
[]
[]
[]
[]
[]
[]
[]
[]
[]
[]
[]
[]
[]
[]
[]
[]
[]
[]
[]
[]
[]
[]
[]
[]
[]
[]
[]
[]
[]
[]
[]
[]
[]
[]
[]
[]
[]
[]
[]
[]
[]
[]
[]
[]
[]
[]
[]
[]
[]
[]
[]
[]
[]
[]
[]
[]
[]
[]
[]
[]
[]
[]
[]
[]
[]
[]
[]
[]
[]
[]
[]
[]
[]
[]
[]
[]
[]
[]
[]
[]
[]
[]
[]
[]
[]
[]
[]
[]
[]
[]
[]
[]
[]
[]
[]
[]
[]
[]
[]
[]
[]
[]
[]
[]
[]
[]
[]
[]
[]
[]
[]
[]
[]
[]
[]
[]
[]
[]
[]
[]
[]
[]
[]
[]
[]
[]
[]
[]
[]
[]
[]
[]
[]
[]
[]
[]
[]
[]
[]
[]
[]
[]
[]
[]
[]
[]
[]
[]
[]
[]
[]
[]
[]
[]
[]
[]
[]
[]
[]
[]
[]
[]
[]
[]
[]
[]
[]
[]
[]
[]
[]
[]
[]
[]
[]
[]
[]
[]
[]
[]
[]
[]
[]
[]
[]
[]
[]
[]
[]
[]
[]
[]
[]
[]
[]
[]
[]
[]
[]
[]
[]
[]
[]
[]
[]
[]
[]
[]
[]
[]
[]
[]
[]
[]
[]
[]
[]
[]
[]
[]
[]
[]
[]
[]
[]
[]
[]
[]
[]
[]
[]
[]
[]
[]
[]
[]
[]
[]
[]
[]
[]
[]
[]
[]
[]
[]
[]
[]
[]
[]
[]
[]
[]
[]
[]
[]
[]
[]
[]
[]
[]
[]
[]
[]
[]
[]
[]
[]
[]
[]
[]
[]
[]
[]
[]
[]
[]
[]
[]
[]
[]
[]
[]
[]
[]
[]
[]
[]
[]
[]
[]
[]
[]
[]
[]
[]
[]
[]
[]
[]
[]
[]
[]
[]
[]
[]
[]
[]
[]
[]
[]
[]
[]
[]
[]
[]
[]
[]
[]
[]
[]
[]
[]
[]
[]
[]
[]
[]
[]
[]
[]
[]
[]
[]
[]
[]
[]
[]
[]
[]
[]
[]
[]
[]
[]
[]
[]
[]
[]
[]
[]
[]
[]
[]
[]
[]
[]
[]
[]
[]
[]
[]
[]
[]
[]
[]
[]
[]
[]
[]
[]
[]
[]
[]
[]
[]
[]
[]
[]
[]
[]
[]
[]
[]
[]
[]
[]
[]
[]
[]
[]
[]
[]
[]
[]
[]
[]
[]
[]
[]
[]
[]
[]
[]
[]
[]
[]
[]
[]
[]
[]
[]
[]
[]
[]
[]
[]
[]
[]
[]
[]
[]
[]
[]
[]
[]
[]
[]
[]
[]
[]
[]
[]
[]
[]
[]
[]
[]
[]
[]
[]
[]
[]
[]
[]
[]
[]
[]
[]
[]
[]
[]
[]
[]
[]
[]
[]
[]
[]
[]
[]
[]
[]
[]
[]
[]
[]
[]
[]
[]
[]
[]
[]
[]
[]
[]
[]
[]
[]
[]
[]
[]
[]
[]
[]
[]
[]
[]
[]
[]
[]
[]
[]
[]
[]
[]
[]
[]
[]
[]
[]
[]
[]
[]
[]
[]
[]
[]
[]
[]
[]
[]
[]
[]
[]
[]
[]
[]
[]
[]
[]
[]
[]
[]
[]
[]
[]
[]
[]
[]
[]
[]
[]
[]
[]
[]
[]
[]
[]
[]
[]
[]
[]
[]
[]
[]
[]
[]
[]
[]
[]
[]
[]
[]
[]
[]
[]
[]
[]
[]
[]
[]
[]
[]
[]
[]
[]
[]
[]
[]
[]
[]
[]
[]
[]
[]
[]
[]
[]
[]
[]
[]
[]
[]
[]
[]
[]
[]
[]
[]
[]
[]
[]
[]
[]
[]
[]
[]
[]
[]
[]
[]
[]
[]
[]
[]
[]
[]
[]
[]
[]
[]
[]
[]
[]
[]
[]
[]
[]
[]
[]
[]
[]
[]
[]
[]
[]
[]
[]
[]
[]
[]
[]
[]
[]
[]
[]
[]
[]
[]
[]
[]
[]
[]
[]
[]
[]
[]
[]
[]
[]
[]
[]
[]
[]
[]
[]
[]
[]
[]
[]
[]
[]
[]
[]
[]
[]
[]
[]
[]
[]
[]
[]
[]
[]
[]
[]
[]
[]
[]
[]
[]
[]
[]
[]
[]
[]
[]
[]
[]
[]
[]
[]
[]
[]
[]
[]
[]
[]
[]
[]
[]
[]
[]
[]
[]
[]
[]
[]
[]
[]
[]
[]
[]
[]
[]
[]
[]
[]
[]
[]
[]
[]
[]
[]
[]
[]
[]
[]
[]
[]
[]
[]
[]
[]
[]
[]
[]
[]
[]
[]
[]
[]
[]
[]
[]
[]
[]
[]
[]
[]
[]
[]
[]
[]
[]
[]
[]
[]
[]
[]
[]
[]
[]
[]
[]
[]
[]
[]
[]
[]
[]
[]
[]
[]
[]
[]
[]
[]
[]
[]
[]
[]
[]
[]
[]
[]
[]
[]
[]
[]
[]
[]
[]
[]
[]
[]
[]
[]
[]
[]
[]
[]
[]
[]
[]
[]
[]
[]
[]
[]
[]
[]
[]
[]
[]
[]
[]
[]
[]
[]
[]
[]
[]
[]
[]
[]
[]
[]
[]
[]
[]
[]
[]
[]
[]
[]
[]
[]
[]
[]
[]
[]
[]
[]
[]
[]
[]
[]
[]
[]
[]
[]
[]
[]
[]
[]
[]
[]
[]
[]
[]
[]
[]
[]
[]
[]
[]
[]
[]
[]
[]
[]
[]
[]
[]
[]
[]
[]
[]
[]
[]
[]
[]
[]
[]
[]
[]
[]
[]
[]
[]
[]
[]
[]
[]
[]
[]
[]
[]
[]
[]
[]
[]
[]
[]
[]
[]
[]
[]
[]
[]
[]
[]
[]
[]
[]
[]
[]
[]
[]
[]
[]
[]
[]
[]
[]
[]
[]
[]
[]
[]
[]
[]
[]
[]
[]
[]
[]
[]
[]
[]
[]
[]
[]
[]
[]
[]
[]
[]
[]
[]
[]
[]
[]
[]
[]
[]
[]
[]
[]
[]
[]
[]
[]
[]
[]
[]
[]
[]
[]
[]
[]
[]
[]
[]
[]
[]
[]
[]
[]
[]
[]
[]
[]
[]
[]
[]
[]
[]
[]
[]
[]
[]
[]
[]
[]
[]
[]
[]
[]
[]
[]
[]
[]
[]
[]
[]
[]
[]
[]
[]
[]
[]
[]
[]
[]
[]
[]
[]
[]
[]
[]
[]
[]
[]
[]
[]
[]
[]
[]
[]
[]
[]
[]
[]
[]
[]
[]
[]
[]
[]
[]
[]
[]
[]
[]
[]
[]
[]
[]
[]
[]
[]
[]
[]
[]
[]
[]
[]
[]
[]
[]
[]
[]
[]
[]
[]
[]
[]
[]
[]
[]
[]
[]
[]
[]
[]
[]
[]
[]
[]
[]
[]
[]
[]
[]
[]
[]
[]
[]
[]
[]
[]
[]
[]
[]
[]
[]
[]
[]
[]
[]
[]
[]
[]
[]
[]
[]
[]
[]
[]
[]
[]
[]
[]
[]
[]
[]
[]
[]
[]
[]
[]
[]
[]
[]
[]
[]
[]
[]
[]
[]
[]
[]
[]
[]
[]
[]
[]
[]
[]
[]
[]
[]
[]
[]
[]
[]
[]
[]
[]
[]
[]
[]
[]
[]
[]
[]
[]
[]
[]
[]
[]
[]
[]
[]
[]
[]
[]
[]
[]
[]
[]
[]
[]
[]
[]
[]
[]
[]
[]
[]
[]
[]
[]
[]
[]
[]
[]
[]
[]
[]
[]
[]
[]
[]
[]
[]
[]
[]
[]
[]
[]
[]
[]
[]
[]
[]
[]
[]
[]
[]
[]
[]
[]
[]
[]
[]
[]
[]
[]
[]
[]
[]
[]
[]
[]
[]
[]
[]
[]
[]
[]
[]
[]
[]
[]
[]
[]
[]
[]
[]
[]
[]
[]
[]
[]
[]
[]
[]
[]
[]
[]
[]
[]
[]
[]
[]
[]
[]
[]
[]
[]
[]
[]
[]
[]
[]
[]
[]
[]
[]
[]
[]
[]
[]
[]
[]
[]
[]
[]
[]
[]
[]
[]
[]
[]
[]
[]
[]
[]
[]
[]
[]
[]
[]
[]
[]
[]
[]
[]
[]
[]
[]
[]
[]
[]
[]
[]
[]
[]
[]
[]
[]
[]
[]
[]
[]
[]
[]
[]
[]
[]
[]
[]
[]
[]
[]
[]
[]
[]
[]
[]
[]
[]
[]
[]
[]
[]
[]
[]
[]
[]
[]
[]
[]
[]
[]
[]
[]
[]
[]
[]
[]
[]
[]
[]
[]
[]
[]
[]
[]
[]
[]
[]
[]
[]
[]
[]
[]
[]
[]
[]
[]
[]
[]
[]
[]
[]
[]
[]
[]
[]
[]
[]
[]
[]
[]
[]
[]
[]
[]
[]
[]
[]
[]
[]
[]
[]
[]
[]
[]
[]
[]
[]
[]
[]
[]
[]
[]
[]
[]
[]
[]
[]
[]
[]
[]
[]
[]
[]
[]
[]
[]
[]
[]
[]
[]
[]
[]
[]
[]
[]
[]
[]
[]
[]
[]
[]
[]
[]
[]
[]
[]
[]
[]
[]
[]
[]
[]
[]
[]
[]
[]
[]
[]
[]
[]
[]
[]
[]
[]
[]
[]
[]
[]
[]
[]
[]
[]
[]
[]
[]
[]
[]
[]
[]
[]
[]
[]
[]
[]
[]
[]
[]
[]
[]
[]
[]
[]
[]
[]
[]
[]
[]
[]
[]
[]
[]
[]
[]
[]
[]
[]
[]
[]
[]
[]
[]
[]
[]
[]
[]
[]
[]
[]
[]
[]
[]
[]
[]
[]
[]
[]
[]
[]
[]
[]
[]
[]
[]
[]
[]
[]
[]
[]
[]
[]
[]
[]
[]
[]
[]
[]
[]
[]
[]
[]
[]
[]
[]
[]
[]
[]
[]
[]
[]
[]
[]
[]
[]
[]
[]
[]
[]
[]
[]
[]
[]
[]
[]
[]
[]
[]
[]
[]
[]
[]
[]
[]
[]
[]
[]
[]
[]
[]
[]
[]
[]
[]
[]
[]
[]
[]
[]
[]
[]
[]
[]
[]
[]
[]
[]
[]
[]
[]
[]
[]
[]
[]
[]
[]
[]
[]
[]
[]
[]
[]
[]
[]
[]
[]
[]
[]
[]
[]
[]
[]
[]
[]
[]
[]
[]
[]
[]
[]
[]
[]
[]
[]
[]
[]
[]
[]
[]
[]
[]
[]
[]
[]
[]
[]
[]
[]
[]
[]
[]
[]
[]
[]
[]
[]
[]
[]
[]
[]
[]
[]
[]
[]
[]
[]
[]
[]
[]
[]
[]
[]
[]
[]
[]
[]
[]
[]
[]
[]
[]
[]
[]
[]
[]
[]
[]
[]
[]
[]
[]
[]
[]
[]
[]
[]
[]
[]
[]
[]
[]
[]
[]
[]
[]
[]
[]
[]
[]
[]
[]
[]
[]
[]
[]
[]
[]
[]
[]
[]
[]
[]
[]
[]
[]
[]
[]
[]
[]
[]
[]
[]
[]
[]
[]
[]
[]
[]
[]
[]
[]
[]
[]
[]
[]
[]
[]
[]
[]
[]
[]
[]
[]
[]
[]
[]
[]
[]
[]
[]
[]
[]
[]
[]
[]
[]
[]
[]
[]
[]
[]
[]
[]
[]
[]
[]
[]
[]
[]
[]
[]
[]
[]
[]
[]
[]
[]
[]
[]
[]
[]
[]
[]
[]
[]
[]
[]
[]
[]
[]
[]
[]
[]
[]
[]
[]
[]
[]
[]
[]
[]
[]
[]
[]
[]
[]
[]
[]
[]
[]
[]
[]
[]
[]
[]
[]
[]
[]
[]
[]
[]
[]
[]
[]
[]
[]
[]
[]
[]
[]
[]
[]
[]
[]
[]
[]
[]
[]
[]
[]
[]
[]
[]
[]
[]
[]
[]
[]
[]
[]
[]
[]
[]
[]
[]
[]
[]
[]
[]
[]
[]
[]
[]
[]
[]
[]
[]
[]
[]
[]
[]
[]
[]
[]
[]
[]
[]
[]
[]
[]
[]
[]
[]
[]
[]
[]
[]
[]
[]
[]
[]
[]
[]
[]
[]
[]
[]
[]
[]
[]
[]
[]
[]
[]
[]
[]
[]
[]
[]
[]
[]
[]
[]
[]
[]
[]
[]
[]
[]
[]
[]
[]
[]
[]
[]
[]
[]
[]
[]
[]
[]
[]
[]
[]
[]
[]
[]
[]
[]
[]
[]
[]
[]
[]
[]
[]
[]
[]
[]
[]
[]
[]
[]
[]
[]
[]
[]
[]
[]
[]
[]
[]
[]
[]
[]
[]
[]
[]
[]
[]
[]
[]
[]
[]
[]
[]
[]
[]
[]
[]
[]
[]
[]
[]
[]
[]
[]
[]
[]
[]
[]
[]
[]
[]
[]
[]
[]
[]
[]
[]
[]
[]
[]
[]
[]
[]
[]
[]
[]
[]
[]
[]
[]
[]
[]
[]
[]
[]
[]
[]
[]
[]
[]
[]
[]
[]
[]
[]
[]
[]
[]
[]
[]
[]
[]
[]
[]
[]
[]
[]
[]
[]
[]
[]
[]
[]
[]
[]
[]
[]
[]
[]
[]
[]
[]
[]
[]
[]
[]
[]
[]
[]
[]
[]
[]
[]
[]
[]
[]
[]
[]
[]
[]
[]
[]
[]
[]
[]
[]
[]
[]
[]
[]
[]
[]
[]
[]
[]
[]
[]
[]
[]
[]
[]
[]
[]
[]
[]
[]
[]
[]
[]
[]
[]
[]
[]
[]
[]
[]
[]
[]
[]
[]
[]
[]
[]
[]
[]
[]
[]
[]
[]
[]
[]
[]
[]
[]
[]
[]
[]
[]
[]
[]
[]
[]
[]
[]
[]
[]
[]
[]
[]
[]
[]
[]
[]
[]
[]
[]
[]
[]
[]
[]
[]
[]
[]
[]
[]
[]
[]
[]
[]
[]
[]
[]
[]
[]
[]
[]
[]
[]
[]
[]
[]
[]
[]
[]
[]
[]
[]
[]
[]
[]
[]
[]
[]
[]
[]
[]
[]
[]
[]
[]
[]
[]
[]
[]
[]
[]
[]
[]
[]
[]
[]
[]
[]
[]
[]
[]
[]
[]
[]
[]
[]
[]
[]
[]
[]
[]
[]
[]
[]
[]
[]
[]
[]
[]
[]
[]
[]
[]
[]
[]
[]
[]
[]
[]
[]
[]
[]
[]
[]
[]
[]
[]
[]
[]
[]
[]
[]
[]
[]
[]
[]
[]
[]
[]
[]
[]
[]
[]
[]
[]
[]
[]
[]
[]
[]
[]
[]
[]
[]
[]
[]
[]
[]
[]
[]
[]
[]
[]
[]
[]
[]
[]
[]
[]
[]
[]
[]
[]
[]
[]
[]
[]
[]
[]
[]
[]
[]
[]
[]
[]
[]
[]
[]
[]
[]
[]
[]
[]
[]
[]
[]
[]
[]
[]
[]
[]
[]
[]
[]
[]
[]
[]
[]
[]
[]
[]
[]
[]
[]
[]
[]
[]
[]
[]
[]
[]
[]
[]
[]
[]
[]
[]
[]
[]
[]
[]
[]
[]
[]
[]
[]
[]
[]
[]
[]
[]
[]
[]
[]
[]
[]
[]
[]
[]
[]
[]
[]
[]
[]
[]
[]
[]
[]
[]
[]
[]
[]
[]
[]
[]
[]
[]
[]
[]
[]
[]
[]
[]
[]
[]
[]
[]
[]
[]
[]
[]
[]
[]
[]
[]
[]
[]
[]
[]
[]
[]
[]
[]
[]
[]
[]
[]
[]
[]
[]
[]
[]
[]
[]
[]
[]
[]
[]
[]
[]
[]
[]
[]
[]
[]
[]
[]
[]
[]
[]
[]
[]
[]
[]
[]
[]
[]
[]
[]
[]
[]
[]
[]
[]
[]
[]
[]
[]
[]
[]
[]
[]
[]
[]
[]
[]
[]
[]
[]
[]
[]
[]
[]
[]
[]
[]
[]
[]
[]
[]
[]
[]
[]
[]
[]
[]
[]
[]
[]
[]
[]
[]
[]
[]
[]
[]
[]
[]
[]
[]
[]
[]
[]
[]
[]
[]
[]
[]
[]
[]
[]
[]
[]
[]
[]
[]
[]
[]
[]
[]
[]
[]
[]
[]
[]
[]
[]
[]
[]
[]
[]
[]
[]
[]
[]
[]
[]
[]
[]
[]
[]
[]
[]
[]
[]
[]
[]
[]
[]
[]
[]
[]
[]
[]
[]
[]
[]
[]
[]
[]
[]
[]
[]
[]
[]
[]
[]
[]
[]
[]
[]
[]
[]
[]
[]
[]
[]
[]
[]
[]
[]
[]
[]
[]
[]
[]
[]
[]
[]
[]
[]
[]
[]
[]
[]
[]
[]
[]
[]
[]
[]
[]
[]
[]
[]
[]
[]
[]
[]
[]
[]
[]
[]
[]
[]
[]
[]
[]
[]
[]
[]
[]
[]
[]
[]
[]
[]
[]
[]
[]
[]
[]
[]
[]
[]
[]
[]
[]
[]
[]
[]
[]
[]
[]
[]
[]
[]
[]
[]
[]
[]
[]
[]
[]
[]
[]
[]
[]
[]
[]
[]
[]
[]
[]
[]
[]
[]
[]
[]
[]
[]
[]
[]
[]
[]
[]
[]
[]
[]
[]
[]
[]
[]
[]
[]
[]
[]
[]
[]
[]
[]
[]
[]
[]
[]
[]
[]
[]
[]
[]
[]
[]
[]
[]
[]
[]
[]
[]
[]
[]
[]
[]
[]
[]
[]
[]
[]
[]
[]
[]
[]
[]
[]
[]
[]
[]
[]
[]
[]
[]
[]
[]
[]
[]
[]
[]
[]
[]
[]
[]
[]
[]
[]
[]
[]
[]
[]
[]
[]
[]
[]
[]
[]
[]
[]
[]
[]
[]
[]
[]
[]
[]
[]
[]
[]
[]
[]
[]
[]
[]
[]
[]
[]
[]
[]
[]
[]
[]
[]
[]
[]
[]
[]
[]
[]
[]
[]
[]
[]
[]
[]
[]
[]
[]
[]
[]
[]
[]
[]
[]
[]
[]
[]
[]
[]
[]
[]
[]
[]
[]
[]
[]
[]
[]
[]
[]
[]
[]
[]
[]
[]
[]
[]
[]
[]
[]
[]
[]
[]
[]
[]
[]
[]
[]
[]
[]
[]
[]
[]
[]
[]
[]
[]
[]
[]
[]
[]
[]
[]
[]
[]
[]
[]
[]
[]
[]
[]
[]
[]
[]
[]
[]
[]
[]
[]
[]
[]
[]
[]
[]
[]
[]
[]
[]
[]
[]
[]
[]
[]
[]
[]
[]
[]
[]
[]
[]
[]
[]
[]
[]
[]
[]
[]
[]
[]
[]
[]
[]
[]
[]
[]
[]
[]
[]
[]
[]
[]
[]
[]
[]
[]
[]
[]
[]
[]
[]
[]
[]
[]
[]
[]
[]
[]
[]
[]
[]
[]
[]
[]
[]
[]
[]
[]
[]
[]
[]
[]
[]
[]
[]
[]
[]
[]
[]
[]
[]
[]
[]
[]
[]
[]
[]
[]
[]
[]
[]
[]
[]
[]
[]
[]
[]
[]
[]
[]
[]
[]
[]
[]
[]
[]
[]
[]
[]
[]
[]
[]
[]
[]
[]
[]
[]
[]
[]
[]
[]
[]
[]
[]
[]
[]
[]
[]
[]
[]
[]
[]
[]
[]
[]
[]
[]
[]
[]
[]
[]
[]
[]
[]
[]
[]
[]
[]
[]
[]
[]
[]
[]
[]
[]
[]
[]
[]
[]
[]
[]
[]
[]
[]
[]
[]
[]
[]
[]
[]
[]
[]
[]
[]
[]
[]
[]
[]
[]
[]
[]
[]
[]
[]
[]
[]
[]
[]
[]
[]
[]
[]
[]
[]
[]
[]
[]
[]
[]
[]
[]
[]
[]
[]
[]
[]
[]
[]
[]
[]
[]
[]
[]
[]
[]
[]
[]
[]
[]
[]
[]
[]
[]
[]
[]
[]
[]
[]
[]
[]
[]
[]
[]
[]
[]
[]
[]
[]
[]
[]
[]
[]
[]
[]
[]
[]
[]
[]
[]
[]
[]
[]
[]
[]
[]
[]
[]
[]
[]
[]
[]
[]
[]
[]
[]
[]
[]
[]
[]
[]
[]
[]
[]
[]
[]
[]
[]
[]
[]
[]
[]
[]
[]
[]
[]
[]
[]
[]
[]
[]
[]
[]
[]
[]
[]
[]
[]
[]
[]
[]
[]
[]
[]
[]
[]
[]
[]
[]
[]
[]
[]
[]
[]
[]
[]
[]
[]
[]
[]
[]
[]
[]
[]
[]
[]
[]
[]
[]
[]
[]
[]
[]
[]
[]
[]
[]
[]
[]
[]
[]
[]
[]
[]
[]
[]
[]
[]
[]
[]
[]
[]
[]
[]
[]
[]
[]
[]
[]
[]
[]
[]
[]
[]
[]
[]
[]
[]
[]
[]
[]
[]
[]
[]
[]
[]
[]
[]
[]
[]
[]
[]
[]
[]
[]
[]
[]
[]
[]
[]
[]
[]
[]
[]
[]
[]
[]
[]
[]
[]
[]
[]
[]
[]
[]
[]
[]
[]
[]
[]
[]
[]
[]
[]
[]
[]
[]
[]
[]
[]
[]
[]
[]
[]
[]
[]
[]
[]
[]
[]
[]
[]
[]
[]
[]
[]
[]
[]
[]
[]
[]
[]
[]
[]
[]
[]
[]
[]
[]
[]
[]
[]
[]
[]
[]
[]
[]
[]
[]
[]
[]
[]
[]
[]
[]
[]
[]
[]
[]
[]
[]
[]
[]
[]
[]
[]
[]
[]
[]
[]
[]
[]
[]
[]
[]
[]
[]
[]
[]
[]
[]
[]
[]
[]
[]
[]
[]
[]
[]
[]
[]
[]
[]
[]
[]
[]
[]
[]
[]
[]
[]
[]
[]
[]
[]
[]
[]
[]
[]
[]
[]
[]
[]
[]
[]
[]
[]
[]
[]
[]
[]
[]
[]
[]
[]
[]
[]
[]
[]
[]
[]
[]
[]
[]
[]
[]
[]
[]
[]
[]
[]
[]
[]
[]
[]
[]
[]
[]
[]
[]
[]
[]
[]
[]
[]
[]
[]
[]
[]
[]
[]
[]
[]
[]
[]
[]
[]
[]
[]
[]
[]
[]
[]
[]
[]
[]
[]
[]
[]
[]
[]
[]
[]
[]
[]
[]
[]
[]
[]
[]
[]
[]
[]
[]
[]
[]
[]
[]
[]
[]
[]
[]
[]
[]
[]
[]
[]
[]
[]
[]
[]
[]
[]
[]
[]
[]
[]
[]
[]
[]
[]
[]
[]
[]
[]
[]
[]
[]
[]
[]
[]
[]
[]
[]
[]
[]
[]
[]
[]
[]
[]
[]
[]
[]
[]
[]
[]
[]
[]
[]
[]
[]
[]
[]
[]
[]
[]
[]
[]
[]
[]
[]
[]
[]
[]
[]
[]
[]
[]
[]
[]
[]
[]
[]
[]
[]
[]
[]
[]
[]
[]
[]
[]
[]
[]
[]
[]
[]
[]
[]
[]
[]
[]
[]
[]
[]
[]
[]
[]
[]
[]
[]
[]
[]
[]
[]
[]
[]
[]
[]
[]
[]
[]
[]
[]
[]
[]
[]
[]
[]
[]
[]
[]
[]
[]
[]
[]
[]
[]
[]
[]
[]
[]
[]
[]
[]
[]
[]
[]
[]
[]
[]
[]
[]
[]
[]
[]
[]
[]
[]
[]
[]
[]
[]
[]
[]
[]
[]
[]
[]
[]
[]
[]
[]
[]
[]
[]
[]
[]
[]
[]
[]
[]
[]
[]
[]
[]
[]
[]
[]
[]
[]
[]
[]
[]
[]
[]
[]
[]
[]
[]
[]
[]
[]
[]
[]
[]
[]
[]
[]
[]
[]
[]
[]
[]
[]
[]
[]
[]
[]
[]
[]
[]
[]
[]
[]
[]
[]
[]
[]
[]
[]
[]
[]
[]
[]
[]
[]
[]
[]
[]
[]
[]
[]
[]
[]
[]
[]
[]
[]
[]
[]
[]
[]
[]
[]
[]
[]
[]
[]
[]
[]
[]
[]
[]
[]
[]
[]
[]
[]
[]
[]
[]
[]
[]
[]
[]
[]
[]
[]
[]
[]
[]
[]
[]
[]
[]
[]
[]
[]
[]
[]
[]
[]
[]
[]
[]
[]
[]
[]
[]
[]
[]
[]
[]
[]
[]
[]
[]
[]
[]
[]
[]
[]
[]
[]
[]
[]
[]
[]
[]
[]
[]
[]
[]
[]
[]
[]
[]
[]
[]
[]
[]
[]
[]
[]
[]
[]
[]
[]
[]
[]
[]
[]
[]
[]
[]
[]
[]
[]
[]
[]
[]
[]
[]
[]
[]
[]
[]
[]
[]
[]
[]
[]
[]
[]
[]
[]
[]
[]
[]
[]
[]
[]
[]
[]
[]
[]
[]
[]
[]
[]
[]
[]
[]
[]
[]
[]
[]
[]
[]
[]
[]
[]
[]
[]
[]
[]
[]
[]
[]
[]
[]
[]
[]
[]
[]
[]
[]
[]
[]
[]
[]
[]
[]
[]
[]
[]
[]
[]
[]
[]
[]
[]
[]
[]
[]
[]
[]
[]
[]
[]
[]
[]
[]
[]
[]
[]
[]
[]
[]
[]
[]
[]
[]
[]
[]
[]
[]
[]
[]
[]
[]
[]
[]
[]
[]
[]
[]
[]
[]
[]
[]
[]
[]
[]
[]
[]
[]
[]
[]
[]
[]
[]
[]
[]
[]
[]
[]
[]
[]
[]
[]
[]
[]
[]
[]
[]
[]
[]
[]
[]
[]
[]
[]
[]
[]
[]
[]
[]
[]
[]
[]
[]
[]
[]
[]
[]
[]
[]
[]
[]
[]
[]
[]
[]
[]
[]
[]
[]
[]
[]
[]
[]
[]
[]
[]
[]
[]
[]
[]
[]
[]
[]
[]
[]
[]
[]
[]
[]
[]
[]
[]
[]
[]
[]
[]
[]
[]
[]
[]
[]
[]
[]
[]
[]
[]
[]
[]
[]
[]
[]
[]
[]
[]
[]
[]
[]
[]
[]
[]
[]
[]
[]
[]
[]
[]
[]
[]
[]
[]
[]
[]
[]
[]
[]
[]
[]
[]
[]
[]
[]
[]
[]
[]
[]
[]
[]
[]
[]
[]
[]
[]
[]
[]
[]
[]
[]
[]
[]
[]
[]
[]
[]
[]
[]
[]
[]
[]
[]
[]
[]
[]
[]
[]
[]
[]
[]
[]
[]
[]
[]
[]
[]
[]
[]
[]
[]
[]
[]
[]
[]
[]
[]
[]
[]
[]
[]
[]
[]
[]
[]
[]
[]
[]
[]
[]
[]
[]
[]
[]
[]
[]
[]
[]
[]
[]
[]
[]
[]
[]
[]
[]
[]
[]
[]
[]
[]
[]
[]
[]
[]
[]
[]
[]
[]
[]
[]
[]
[]
[]
[]
[]
[]
[]
[]
[]
[]
[]
[]
[]
[]
[]
[]
[]
[]
[]
[]
[]
[]
[]
[]
[]
[]
[]
[]
[]
[]
[]
[]
[]
[]
[]
[]
[]
[]
[]
[]
[]
[]
[]
[]
[]
[]
[]
[]
[]
[]
[]
[]
[]
[]
[]
[]
[]
[]
[]
[]
[]
[]
[]
[]
[]
[]
[]
[]
[]
[]
[]
[]
[]
[]
[]
[]
[]
[]
[]
[]
[]
[]
[]
[]
[]
[]
[]
[]
[]
[]
[]
[]
[]
[]
[]
[]
[]
[]
[]
[]
[]
[]
[]
[]
[]
[]
[]
[]
[]
[]
[]
[]
[]
[]
[]
[]
[]
[]
[]
[]
[]
[]
[]
[]
[]
[]
[]
[]
[]
[]
[]
[]
[]
[]
[]
[]
[]
[]
[]
[]
[]
[]
[]
[]
[]
[]
[]
[]
[]
[]
[]
[]
[]
[]
[]
[]
[]
[]
[]
[]
[]
[]
[]
[]
[]
[]
[]
[]
[]
[]
[]
[]
[]
[]
[]
[]
[]
[]
[]
[]
[]
[]
[]
[]
[]
[]
[]
[]
[]
[]
[]
[]
[]
[]
[]
[]
[]
[]
[]
[]
[]
[]
[]
[]
[]
[]
[]
[]
[]
[]
[]
[]
[]
[]
[]
[]
[]
[]
[]
[]
[]
[]
[]
[]
[]
[]
[]
[]
[]
[]
[]
[]
[]
[]
[]
[]
[]
[]
[]
[]
[]
[]
[]
[]
[]
[]
[]
[]
[]
[]
[]
[]
[]
[]
[]
[]
[]
[]
[]
[]
[]
[]
[]
[]
[]
[]
[]
[]
[]
[]
[]
[]
[]
[]
[]
[]
[]
[]
[]
[]
[]
[]
[]
[]
[]
[]
[]
[]
[]
[]
[]
[]
[]
[]
[]
[]
[]
[]
[]
[]
[]
[]
[]
[]
[]
[]
[]
[]
[]
[]
[]
[]
[]
[]
[]
[]
[]
[]
[]
[]
[]
[]
[]
[]
[]
[]
[]
[]
[]
[]
[]
[]
[]
[]
[]
[]
[]
[]
[]
[]
[]
[]
[]
[]
[]
[]
[]
[]
[]
[]
[]
[]
[]
[]
[]
[]
[]
[]
[]
[]
[]
[]
[]
[]
[]
[]
[]
[]
[]
[]
[]
[]
[]
[]
[]
[]
[]
[]
[]
[]
[]
[]
[]
[]
[]
[]
[]
[]
[]
[]
[]
[]
[]
[]
[]
[]
[]
[]
[]
[]
[]
[]
[]
[]
[]
[]
[]
[]
[]
[]
[]
[]
[]
[]
[]
[]
[]
[]
[]
[]
[]
[]
[]
[]
[]
[]
[]
[]
[]
[]
[]
[]
[]
[]
[]
[]
[]
[]
[]
[]
[]
[]
[]
[]
[]
[]
[]
[]
[]
[]
[]
[]
[]
[]
[]
[]
[]
[]
[]
[]
[]
[]
[]
[]
[]
[]
[]
[]
[]
[]
[]
[]
[]
[]
[]
[]
[]
[]
[]
[]
[]
[]
[]
[]
[]
[]
[]
[]
[]
[]
[]
[]
[]
[]
[]
[]
[]
[]
[]
[]
[]
[]
[]
[]
[]
[]
[]
[]
[]
[]
[]
[]
[]
[]
[]
[]
[]
[]
[]
[]
[]
[]
[]
[]
[]
[]
[]
[]
[]
[]
[]
[]
[]
[]
[]
[]
[]
[]
[]
[]
[]
[]
[]
[]
[]
[]
[]
[]
[]
[]
[]
[]
[]
[]
[]
[]
[]
[]
[]
[]
[]
[]
[]
[]
[]
[]
[]
[]
[]
[]
[]
[]
[]
[]
[]
[]
[]
[]
[]
[]
[]
[]
[]
[]
[]
[]
[]
[]
[]
[]
[]
[]
[]
[]
[]
[]
[]
[]
[]
[]
[]
[]
[]
[]
[]
[]
[]
[]
[]
[]
[]
[]
[]
[]
[]
[]
[]
[]
[]
[]
[]
[]
[]
[]
[]
[]
[]
[]
[]
[]
[]
[]
[]
[]
[]
[]
[]
[]
[]
[]
[]
[]
[]
[]
[]
[]
[]
[]
[]
[]
[]
[]
[]
[]
[]
[]
[]
[]
[]
[]
[]
[]
[]
[]
[]
[]
[]
[]
[]
[]
[]
[]
[]
[]
[]
[]
[]
[]
[]
[]
[]
[]
[]
[]
[]
[]
[]
[]
[]
[]
[]
[]
[]
[]
[]
[]
[]
[]
[]
[]
[]
[]
[]
[]
[]
[]
[]
[]
[]
[]
[]
[]
[]
[]
[]
[]
[]
[]
[]
[]
[]
[]
[]
[]
[]
[]
[]
[]
[]
[]
[]
[]
[]
[]
[]
[]
[]
[]
[]
[]
[]
[]
[]
[]
[]
[]
[]
[]
[]
[]
[]
[]
[]
[]
[]
[]
[]
[]
[]
[]
[]
[]
[]
[]
[]
[]
[]
[]
[]
[]
[]
[]
[]
[]
[]
[]
[]
[]
[]
[]
[]
[]
[]
[]
[]
[]
[]
[]
[]
[]
[]
[]
[]
[]
[]
[]
[]
[]
[]
[]
[]
[]
[]
[]
[]
[]
[]
[]
[]
[]
[]
[]
[]
[]
[]
[]
[]
[]
[]
[]
[]
[]
[]
[]
[]
[]
[]
[]
[]
[]
[]
[]
[]
[]
[]
[]
[]
[]
[]
[]
[]
[]
[]
[]
[]
[]
[]
[]
[]
[]
[]
[]
[]
[]
[]
[]
[]
[]
[]
[]
[]
[]
[]
[]
[]
[]
[]
[]
[]
[]
[]
[]
[]
[]
[]
[]
[]
[]
[]
[]
[]
[]
[]
[]
[]
[]
[]
[]
[]
[]
[]
[]
[]
[]
[]
[]
[]
[]
[]
[]
[]
[]
[]
[]
[]
[]
[]
[]
[]
[]
[]
[]
[]
[]
[]
[]
[]
[]
[]
[]
[]
[]
[]
[]
[]
[]
[]
[]
[]
[]
[]
[]
[]
[]
[]
[]
[]
[]
[]
[]
[]
[]
[]
[]
[]
[]
[]
[]
[]
[]
[]
[]
[]
[]
[]
[]
[]
[]
[]
[]
[]
[]
[]
[]
[]
[]
[]
[]
[]
[]
[]
[]
[]
[]
[]
[]
[]
[]
[]
[]
[]
[]
[]
[]
[]
[]
[]
[]
[]
[]
[]
[]
[]
[]
[]
[]
[]
[]
[]
[]
[]
[]
[]
[]
[]
[]
[]
[]
[]
[]
[]
[]
[]
[]
[]
[]
[]
[]
[]
[]
[]
[]
[]
[]
[]
[]
[]
[]
[]
[]
[]
[]
[]
[]
[]
[]
[]
[]
[]
[]
[]
[]
[]
[]
[]
[]
[]
[]
[]
[]
[]
[]
[]
[]
[]
[]
[]
[]
[]
[]
[]
[]
[]
[]
[]
[]
[]
[]
[]
[]
[]
[]
[]
[]
[]
[]
[]
[]
[]
[]
[]
[]
[]
[]
[]
[]
[]
[]
[]
[]
[]
[]
[]
[]
[]
[]
[]
[]
[]
[]
[]
[]
[]
[]
[]
[]
[]
[]
[]
[]
[]
[]
[]
[]
[]
[]
[]
[]
[]
[]
[]
[]
[]
[]
[]
[]
[]
[]
[]
[]
[]
[]
[]
[]
[]
[]
[]
[]
[]
[]
[]
[]
[]
[]
[]
[]
[]
[]
[]
[]
[]
[]
[]
[]
[]
[]
[]
[]
[]
[]
[]
[]
[]
[]
[]
[]
[]
[]
[]
[]
[]
[]
[]
[]
[]
[]
[]
[]
[]
[]
[]
[]
[]
[]
[]
[]
[]
[]
[]
[]
[]
[]
[]
[]
[]
[]
[]
[]
[]
[]
[]
[]
[]
[]
[]
[]
[]
[]
[]
[]
[]
[]
[]
[]
[]
[]
[]
[]
[]
[]
[]
[]
[]
[]
[]
[]
[]
[]
[]
[]
[]
[]
[]
[]
[]
[]
[]
[]
[]
[]
[]
[]
[]
[]
[]
[]
[]
[]
[]
[]
[]
[]
[]
[]
[]
[]
[]
[]
[]
[]
[]
[]
[]
[]
[]
[]
[]
[]
[]
[]
[]
[]
[]
[]
[]
[]
[]
[]
[]
[]
[]
[]
[]
[]
[]
[]
[]
[]
[]
[]
[]
[]
[]
[]
[]
[]
[]
[]
[]
[]
[]
[]
[]
[]
[]
[]
[]
[]
[]
[]
[]
[]
[]
[]
[]
[]
[]
[]
[]
[]
[]
[]
[]
[]
[]
[]
[]
[]
[]
[]
[]
[]
[]
[]
[]
[]
[]
[]
[]
[]
[]
[]
[]
[]
[]
[]
[]
[]
[]
[]
[]
[]
[]
[]
[]
[]
[]
[]
[]
[]
[]
[]
[]
[]
[]
[]
[]
[]
[]
[]
[]
[]
[]
[]
[]
[]
[]
[]
[]
[]
[]
[]
[]
[]
[]
[]
[]
[]
[]
[]
[]
[]
[]
[]
[]
[]
[]
[]
[]
[]
[]
[]
[]
[]
[]
[]
[]
[]
[]
[]
[]
[]
[]
[]
[]
[]
[]
[]
[]
[]
[]
[]
[]
[]
[]
[]
[]
[]
[]
[]
[]
[]
[]
[]
[]
[]
[]
[]
[]
[]
[]
[]
[]
[]
[]
[]
[]
[]
[]
[]
[]
[]
[]
[]
[]
[]
[]
[]
[]
[]
[]
[]
[]
[]
[]
[]
[]
[]
[]
[]
[]
[]
[]
[]
[]
[]
[]
[]
[]
[]
[]
[]
[]
[]
[]
[]
[]
[]
[]
[]
[]
[]
[]
[]
[]
[]
[]
[]
[]
[]
[]
[]
[]
[]
[]
[]
[]
[]
[]
[]
[]
[]
[]
[]
[]
[]
[]
[]
[]
[]
[]
[]
[]
[]
[]
[]
[]
[]
[]
[]
[]
[]
[]
[]
[]
[]
[]
[]
[]
[]
[]
[]
[]
[]
[]
[]
[]
[]
[]
[]
[]
[]
[]
[]
[]
[]
[]
[]
[]
[]
[]
[]
[]
[]
[]
[]
[]
[]
[]
[]
[]
[]
[]
[]
[]
[]
[]
[]
[]
[]
[]
[]
[]
[]
[]
[]
[]
[]
[]
[]
[]
[]
[]
[]
[]
[]
[]
[]
[]
[]
[]
[]
[]
[]
[]
[]
[]
[]
[]
[]
[]
[]
[]
[]
[]
[]
[]
[]
[]
[]
[]
[]
[]
[]
[]
[]
[]
[]
[]
[]
[]
[]
[]
[]
[]
[]
[]
[]
[]
[]
[]
[]
[]
[]
[]
[]
[]
[]
[]
[]
[]
[]
[]
[]
[]
[]
[]
[]
[]
[]
[]
[]
[]
[]
[]
[]
[]
[]
[]
[]
[]
[]
[]
[]
[]
[]
[]
[]
[]
[]
[]
[]
[]
[]
[]
[]
[]
[]
[]
[]
[]
[]
[]
[]
[]
[]
[]
[]
[]
[]
[]
[]
[]
[]
[]
[]
[]
[]
[]
[]
[]
[]
[]
[]
[]
[]
[]
[]
[]
[]
[]
[]
[]
[]
[]
[]
[]
[]
[]
[]
[]
[]
[]
[]
[]
[]
[]
[]
[]
[]
[]
[]
[]
[]
[]
[]
[]
[]
[]
[]
[]
[]
[]
[]
[]
[]
[]
[]
[]
[]
[]
[]
[]
[]
[]
[]
[]
[]
[]
[]
[]
[]
[]
[]
[]
[]
[]
[]
[]
[]
[]
[]
[]
[]
[]
[]
[]
[]
[]
[]
[]
[]
[]
[]
[]
[]
[]
[]
[]
[]
[]
[]
[]
[]
[]
[]
[]
[]
[]
[]
[]
[]
[]
[]
[]
[]
[]
[]
[]
[]
[]
[]
[]
[]
[]
[]
[]
[]
[]
[]
[]
[]
[]
[]
[]
[]
[]
[]
[]
[]
[]
[]
[]
[]
[]
[]
[]
[]
[]
[]
[]
[]
[]
[]
[]
[]
[]
[]
[]
[]
[]
[]
[]
[]
[]
[]
[]
[]
[]
[]
[]
[]
[]
[]
[]
[]
[]
[]
[]
[]
[]
[]
[]
[]
[]
[]
[]
[]
[]
[]
[]
[]
[]
[]
[]
[]
[]
[]
[]
[]
[]
[]
[]
[]
[]
[]
[]
[]
[]
[]
[]
[]
[]
[]
[]
[]
[]
[]
[]
[]
[]
[]
[]
[]
[]
[]
[]
[]
[]
[]
[]
[]
[]
[]
[]
[]
[]
[]
[]
[]
[]
[]
[]
[]
[]
[]
[]
[]
[]
[]
[]
[]
[]
[]
[]
[]
[]
[]
[]
[]
[]
[]
[]
[]
[]
[]
[]
[]
[]
[]
[]
[]
[]
[]
[]
[]
[]
[]
[]
[]
[]
[]
[]
[]
[]
[]
[]
[]
[]
[]
[]
[]
[]
[]
[]
[]
[]
[]
[]
[]
[]
[]
[]
[]
[]
[]
[]
[]
[]
[]
[]
[]
[]
[]
[]
[]
[]
[]
[]
[]
[]
[]
[]
[]
[]
[]
[]
[]
[]
[]
[]
[]
[]
[]
[]
[]
[]
[]
[]
[]
[]
[]
[]
[]
[]
[]
[]
[]
[]
[]
[]
[]
[]
[]
[]
[]
[]
[]
[]
[]
[]
[]
[]
[]
[]
[]
[]
[]
[]
[]
[]
[]
[]
[]
[]
[]
[]
[]
[]
[]
[]
[]
[]
[]
[]
[]
[]
[]
[]
[]
[]
[]
[]
[]
[]
[]
[]
[]
[]
[]
[]
[]
[]
[]
[]
[]
[]
[]
[]
[]
[]
[]
[]
[]
[]
[]
[]
[]
[]
[]
[]
[]
[]
[]
[]
[]
[]
[]
[]
[]
[]
[]
[]
[]
[]
[]
[]
[]
[]
[]
[]
[]
[]
[]
[]
[]
[]
[]
[]
[]
[]
[]
[]
[]
[]
[]
[]
[]
[]
[]
[]
[]
[]
[]
[]
[]
[]
[]
[]
[]
[]
[]
[]
[]
[]
[]
[]
[]
[]
[]
[]
[]
[]
[]
[]
[]
[]
[]
[]
[]
[]
[]
[]
[]
[]
[]
[]
[]
[]
[]
[]
[]
[]
[]
[]
[]
[]
[]
[]
[]
[]
[]
[]
[]
[]
[]
[]
[]
[]
[]
[]
[]
[]
[]
[]
[]
[]
[]
[]
[]
[]
[]
[]
[]
[]
[]
[]
[]
[]
[]
[]
[]
[]
[]
[]
[]
[]
[]
[]
[]
[]
[]
[]
[]
[]
[]
[]
[]
[]
[]
[]
[]
[]
[]
[]
[]
[]
[]
[]
[]
[]
[]
[]
[]
[]
[]
[]
[]
[]
[]
[]
[]
[]
[]
[]
[]
[]
[]
[]
[]
[]
[]
[]
[]
[]
[]
[]
[]
[]
[]
[]
[]
[]
[]
[]
[]
[]
[]
[]
[]
[]
[]
[]
[]
[]
[]
[]
[]
[]
[]
[]
[]
[]
[]
[]
[]
[]
[]
[]
[]
[]
[]
[]
[]
[]
[]
[]
[]
[]
[]
[]
[]
[]
[]
[]
[]
[]
[]
[]
[]
[]
[]
[]
[]
[]
[]
[]
[]
[]
[]
[]
[]
[]
[]
[]
[]
[]
[]
[]
[]
[]
[]
[]
[]
[]
[]
[]
[]
[]
[]
[]
[]
[]
[]
[]
[]
[]
[]
[]
[]
[]
[]
[]
[]
[]
[]
[]
[]
[]
[]
[]
[]
[]
[]
[]
[]
[]
[]
[]
[]
[]
[]
[]
[]
[]
[]
[]
[]
[]
[]
[]
[]
[]
[]
[]
[]
[]
[]
[]
[]
[]
[]
[]
[]
[]
[]
[]
[]
[]
[]
[]
[]
[]
[]
[]
[]
[]
[]
[]
[]
[]
[]
[]
[]
[]
[]
[]
[]
[]
[]
[]
[]
[]
[]
[]
[]
[]
[]
[]
[]
[]
[]
[]
[]
[]
[]
[]
[]
[]
[]
[]
[]
[]
[]
[]
[]
[]
[]
[]
[]
[]
[]
[]
[]
[]
[]
[]
[]
[]
[]
[]
[]
[]
[]
[]
[]
[]
[]
[]
[]
[]
[]
[]
[]
[]
[]
[]
[]
[]
[]
[]
[]
[]
[]
[]
[]
[]
[]
[]
[]
[]
[]
[]
[]
[]
[]
[]
[]
[]
[]
[]
[]
[]
[]
[]
[]
[]
[]
[]
[]
[]
[]
[]
[]
[]
[]
[]
[]
[]
[]
[]
[]
[]
[]
[]
[]
[]
[]
[]
[]
[]
[]
[]
[]
[]
[]
[]
[]
[]
[]
[]
[]
[]
[]
[]
[]
[]
[]
[]
[]
[]
[]
[]
[]
[]
[]
[]
[]
[]
[]
[]
[]
[]
[]
[]
[]
[]
[]
[]
[]
[]
[]
[]
[]
[]
[]
[]
[]
[]
[]
[]
[]
[]
[]
[]
[]
[]
[]
[]
[]
[]
[]
[]
[]
[]
[]
[]
[]
[]
[]
[]
[]
[]
[]
[]
[]
[]
[]
[]
[]
[]
[]
[]
[]
[]
[]
[]
[]
[]
[]
[]
[]
[]
[]
[]
[]
[]
[]
[]
[]
[]
[]
[]
[]
[]
[]
[]
[]
[]
[]
[]
[]
[]
[]
[]
[]
[]
[]
[]
[]
[]
[]
[]
[]
[]
[]
[]
[]
[]
[]
[]
[]
[]
[]
[]
[]
[]
[]
[]
[]
[]
[]
[]
[]
[]
[]
[]
[]
[]
[]
[]
[]
[]
[]
[]
[]
[]
[]
[]
[]
[]
[]
[]
[]
[]
[]
[]
[]
[]
[]
[]
[]
[]
[]
[]
[]
[]
[]
[]
[]
[]
[]
[]
[]
[]
[]
[]
[]
[]
[]
[]
[]
[]
[]
[]
[]
[]
[]
[]
[]
[]
[]
[]
[]
[]
[]
[]
[]
[]
[]
[]
[]
[]
[]
[]
[]
[]
[]
[]
[]
[]
[]
[]
[]
[]
[]
[]
[]
[]
[]
[]
[]
[]
[]
[]
[]
[]
[]
[]
[]
[]
[]
[]
[]
[]
[]
[]
[]
[]
[]
[]
[]
[]
[]
[]
[]
[]
[]
[]
[]
[]
[]
[]
[]
[]
[]
[]
[]
[]
[]
[]
[]
[]
[]
[]
[]
[]
[]
[]
[]
[]
[]
[]
[]
[]
[]
[]
[]
[]
[]
[]
[]
[]
[]
[]
[]
[]
[]
[]
[]
[]
[]
[]
[]
[]
[]
[]
[]
[]
[]
[]
[]
[]
[]
[]
[]
[]
[]
[]
[]
[]
[]
[]
[]
[]
[]
[]
[]
[]
[]
[]
[]
[]
[]
[]
[]
[]
[]
[]
[]
[]
[]
[]
[]
[]
[]
[]
[]
[]
[]
[]
[]
[]
[]
[]
[]
[]
[]
[]
[]
[]
[]
[]
[]
[]
[]
[]
[]
[]
[]
[]
[]
[]
[]
[]
[]
[]
[]
[]
[]
[]
[]
[]
[]
[]
[]
[]
[]
[]
[]
[]
[]
[]
[]
[]
[]
[]
[]
[]
[]
[]
[]
[]
[]
[]
[]
[]
[]
[]
[]
[]
[]
[]
[]
[]
[]
[]
[]
[]
[]
[]
[]
[]
[]
[]
[]
[]
[]
[]
[]
[]
[]
[]
[]
[]
[]
[]
[]
[]
[]
[]
[]
[]
[]
[]
[]
[]
[]
[]
[]
[]
[]
[]
[]
[]
[]
[]
[]
[]
[]
[]
[]
[]
[]
[]
[]
[]
[]
[]
[]
[]
[]
[]
[]
[]
[]
[]
[]
[]
[]
[]
[]
[]
[]
[]
[]
[]
[]
[]
[]
[]
[]
[]
[]
[]
[]
[]
[]
[]
[]
[]
[]
[]
[]
[]
[]
[]
[]
[]
[]
[]
[]
[]
[]
[]
[]
[]
[]
[]
[]
[]
[]
[]
[]
[]
[]
[]
[]
[]
[]
[]
[]
[]
[]
[]
[]
[]
[]
[]
[]
[]
[]
[]
[]
[]
[]
[]
[]
[]
[]
[]
[]
[]
[]
[]
[]
[]
[]
[]
[]
[]
[]
[]
[]
[]
[]
[]
[]
[]
[]
[]
[]
[]
[]
[]
[]
[]
[]
[]
[]
[]
[]
[]
[]
[]
[]
[]
[]
[]
[]
[]
[]
[]
[]
[]
[]
[]
[]
[]
[]
[]
[]
[]
[]
[]
[]
[]
[]
[]
[]
[]
[]
[]
[]
[]
[]
[]
[]
[]
[]
[]
[]
[]
[]
[]
[]
[]
[]
[]
[]
[]
[]
[]
[]
[]
[]
[]
[]
[]
[]
[]
[]
[]
[]
[]
[]
[]
[]
[]
[]
[]
[]
[]
[]
[]
[]
[]
[]
[]
[]
[]
[]
[]
[]
[]
[]
[]
[]
[]
[]
[]
[]
[]
[]
[]
[]
[]
[]
[]
[]
[]
[]
[]
[]
[]
[]
[]
[]
[]
[]
[]
[]
[]
[]
[]
[]
[]
[]
[]
[]
[]
[]
[]
[]
[]
[]
[]
[]
[]
[]
[]
[]
[]
[]
[]
[]
[]
[]
[]
[]
[]
[]
[]
[]
[]
[]
[]
[]
[]
[]
[]
[]
[]
[]
[]
[]
[]
[]
[]
[]
[]
[]
[]
[]
[]
[]
[]
[]
[]
[]
[]
[]
[]
[]
[]
[]
[]
[]
[]
[]
[]
[]
[]
[]
[]
[]
[]
[]
[]
[]
[]
[]
[]
[]
[]
[]
[]
[]
[]
[]
[]
[]
[]
[]
[]
[]
[]
[]
[]
[]
[]
[]
[]
[]
[]
[]
[]
[]
[]
[]
[]
[]
[]
[]
[]
[]
[]
[]
[]
[]
[]
[]
[]
[]
[]
[]
[]
[]
[]
[]
[]
[]
[]
[]
[]
[]
[]
[]
[]
[]
[]
[]
[]
[]
[]
[]
[]
[]
[]
[]
[]
[]
[]
[]
[]
[]
[]
[]
[]
[]
[]
[]
[]
[]
[]
[]
[]
[]
[]
[]
[]
[]
[]
[]
[]
[]
[]
[]
[]
[]
[]
[]
[]
[]
[]
[]
[]
[]
[]
[]
[]
[]
[]
[]
[]
[]
[]
[]
[]
[]
[]
[]
[]
[]
[]
[]
[]
[]
[]
[]
[]
[]
[]
[]
[]
[]
[]
[]
[]
[]
[]
[]
[]
[]
[]
[]
[]
[]
[]
[]
[]
[]
[]
[]
[]
[]
[]
[]
[]
[]
[]
[]
[]
[]
[]
[]
[]
[]
[]
[]
[]
[]
[]
[]
[]
[]
[]
[]
[]
[]
[]
[]
[]
[]
[]
[]
[]
[]
[]
[]
[]
[]
[]
[]
[]
[]
[]
[]
[]
[]
[]
[]
[]
[]
[]
[]
[]
[]
[]
[]
[]
[]
[]
[]
[]
[]
[]
[]
[]
[]
[]
[]
[]
[]
[]
[]
[]
[]
[]
[]
[]
[]
[]
[]
[]
[]
[]
[]
[]
[]
[]
[]
[]
[]
[]
[]
[]
[]
[]
[]
[]
[]
[]
[]
[]
[]
[]
[]
[]
[]
[]
[]
[]
[]
[]
[]
[]
[]
[]
[]
[]
[]
[]
[]
[]
[]
[]
[]
[]
[]
[]
[]
[]
[]
[]
[]
[]
[]
[]
[]
[]
[]
[]
[]
[]
[]
[]
[]
[]
[]
[]
[]
[]
[]
[]
[]
[]
[]
[]
[]
[]
[]
[]
[]
[]
[]
[]
[]
[]
[]
[]
[]
[]
[]
[]
[]
[]
[]
[]
[]
[]
[]
[]
[]
[]
[]
[]
[]
[]
[]
[]
[]
[]
[]
[]
[]
[]
[]
[]
[]
[]
[]
[]
[]
[]
[]
[]
[]
[]
[]
[]
[]
[]
[]
[]
[]
[]
[]
[]
[]
[]
[]
[]
[]
[]
[]
[]
[]
[]
[]
[]
[]
[]
[]
[]
[]
[]
[]
[]
[]
[]
[]
[]
[]
[]
[]
[]
[]
[]
[]
[]
[]
[]
[]
[]
[]
[]
[]
[]
[]
[]
[]
[]
[]
[]
[]
[]
[]
[]
[]
[]
[]
[]
[]
[]
[]
[]
[]
[]
[]
[]
[]
[]
[]
[]
[]
[]
[]
[]
[]
[]
[]
[]
[]
[]
[]
[]
[]
[]
[]
[]
[]
[]
[]
[]
[]
[]
[]
[]
[]
[]
[]
[]
[]
[]
[]
[]
[]
[]
[]
[]
[]
[]
[]
[]
[]
[]
[]
[]
[]
[]
[]
[]
[]
[]
[]
[]
[]
[]
[]
[]
[]
[]
[]
[]
[]
[]
[]
[]
[]
[]
[]
[]
[]
[]
[]
[]
[]
[]
[]
[]
[]
[]
[]
[]
[]
[]
[]
[]
[]
[]
[]
[]
[]
[]
[]
[]
[]
[]
[]
[]
[]
[]
[]
[]
[]
[]
[]
[]
[]
[]
[]
[]
[]
[]
[]
[]
[]
[]
[]
[]
[]
[]
[]
[]
[]
[]
[]
[]
[]
[]
[]
[]
[]
[]
[]
[]
[]
[]
[]
[]
[]
[]
[]
[]
[]
[]
[]
[]
[]
[]
[]
[]
[]
[]
[]
[]
[]
[]
[]
[]
[]
[]
[]
[]
[]
[]
[]
[]
[]
[]
[]
[]
[]
[]
[]
[]
[]
[]
[]
[]
[]
[]
[]
[]
[]
[]
[]
[]
[]
[]
[]
[]
[]
[]
[]
[]
[]
[]
[]
[]
[]
[]
[]
[]
[]
[]
[]
[]
[]
[]
[]
[]
[]
[]
[]
[]
[]
[]
[]
[]
[]
[]
[]
[]
[]
[]
[]
[]
[]
[]
[]
[]
[]
[]
[]
[]
[]
[]
[]
[]
[]
[]
[]
[]
[]
[]
[]
[]
[]
[]
[]
[]
[]
[]
[]
[]
[]
[]
[]
[]
[]
[]
[]
[]
[]
[]
[]
[]
[]
[]
[]
[]
[]
[]
[]
[]
[]
[]
[]
[]
[]
[]
[]
[]
[]
[]
[]
[]
[]
[]
[]
[]
[]
[]
[]
[]
[]
[]
[]
[]
[]
[]
[]
[]
[]
[]
[]
[]
[]
[]
[]
[]
[]
[]
[]
[]
[]
[]
[]
[]
[]
[]
[]
[]
[]
[]
[]
[]
[]
[]
[]
[]
[]
[]
[]
[]
[]
[]
[]
[]
[]
[]
[]
[]
[]
[]
[]
[]
[]
[]
[]
[]
[]
[]
[]
[]
[]
[]
[]
[]
[]
[]
[]
[]
[]
[]
[]
[]
[]
[]
[]
[]
[]
[]
[]
[]
[]
[]
[]
[]
[]
[]
[]
[]
[]
[]
[]
[]
[]
[]
[]
[]
[]
[]
[]
[]
[]
[]
[]
[]
[]
[]
[]
[]
[]
[]
[]
[]
[]
[]
[]
[]
[]
[]
[]
[]
[]
[]
[]
[]
[]
[]
[]
[]
[]
[]
[]
[]
[]
[]
[]
[]
[]
[]
[]
[]
[]
[]
[]
[]
[]
[]
[]
[]
[]
[]
[]
[]
[]
[]
[]
[]
[]
[]
[]
[]
[]
[]
[]
[]
[]
[]
[]
[]
[]
[]
[]
[]
[]
[]
[]
[]
[]
[]
[]
[]
[]
[]
[]
[]
[]
[]
[]
[]
[]
[]
[]
[]
[]
[]
[]
[]
[]
[]
[]
[]
[]
[]
[]
[]
[]
[]
[]
[]
[]
[]
[]
[]
[]
[]
[]
[]
[]
[]
[]
[]
[]
[]
[]
[]
[]
[]
[]
[]
[]
[]
[]
[]
[]
[]
[]
[]
[]
[]
[]
[]
[]
[]
[]
[]
[]
[]
[]
[]
[]
[]
[]
[]
[]
[]
[]
[]
[]
[]
[]
[]
[]
[]
[]
[]
[]
[]
[]
[]
[]
[]
[]
[]
[]
[]
[]
[]
[]
[]
[]
[]
[]
[]
[]
[]
[]
[]
[]
[]
[]
[]
[]
[]
[]
[]
[]
[]
[]
[]
[]
[]
[]
[]
[]
[]
[]
[]
[]
[]
[]
[]
[]
[]
[]
[]
[]
[]
[]
[]
[]
[]
[]
[]
[]
[]
[]
[]
[]
[]
[]
[]
[]
[]
[]
[]
[]
[]
[]
[]
[]
[]
[]
[]
[]
[]
[]
[]
[]
[]
[]
[]
[]
[]
[]
[]
[]
[]
[]
[]
[]
[]
[]
[]
[]
[]
[]
[]
[]
[]
[]
[]
[]
[]
[]
[]
[]
[]
[]
[]
[]
[]
[]
[]
[]
[]
[]
[]
[]
[]
[]
[]
[]
[]
[]
[]
[]
[]
[]
[]
[]
[]
[]
[]
[]
[]
[]
[]
[]
[]
[]
[]
[]
[]
[]
[]
[]
[]
[]
[]
[]
[]
[]
[]
[]
[]
[]
[]
[]
[]
[]
[]
[]
[]
[]
[]
[]
[]
[]
[]
[]
[]
[]
[]
[]
[]
[]
[]
[]
[]
[]
[]
[]
[]
[]
[]
[]
[]
[]
[]
[]
[]
[]
[]
[]
[]
[]
[]
[]
[]
[]
[]
[]
[]
[]
[]
[]
[]
[]
[]
[]
[]
[]
[]
[]
[]
[]
[]
[]
[]
[]
[]
[]
[]
[]
[]
[]
[]
[]
[]
[]
[]
[]
[]
[]
[]
[]
[]
[]
[]
[]
[]
[]
[]
[]
[]
[]
[]
[]
[]
[]
[]
[]
[]
[]
[]
[]
[]
[]
[]
[]
[]
[]
[]
[]
[]
[]
[]
[]
[]
[]
[]
[]
[]
[]
[]
[]
[]
[]
[]
[]
[]
[]
[]
[]
[]
[]
[]
[]
[]
[]
[]
[]
[]
[]
[]
[]
[]
[]
[]
[]
[]
[]
[]
[]
[]
[]
[]
[]
[]
[]
[]
[]
[]
[]
[]
[]
[]
[]
[]
[]
[]
[]
[]
[]
[]
[]
[]
[]
[]
[]
[]
[]
[]
[]
[]
[]
[]
[]
[]
[]
[]
[]
[]
[]
[]
[]
[]
[]
[]
[]
[]
[]
[]
[]
[]
[]
[]
[]
[]
[]
[]
[]
[]
[]
[]
[]
[]
[]
[]
[]
[]
[]
[]
[]
[]
[]
[]
[]
[]
[]
[]
[]
[]
[]
[]
[]
[]
[]
[]
[]
[]
[]
[]
[]
[]
[]
[]
[]
[]
[]
[]
[]
[]
[]
[]
[]
[]
[]
[]
[]
[]
[]
[]
[]
[]
[]
[]
[]
[]
[]
[]
[]
[]
[]
[]
[]
[]
[]
[]
[]
[]
[]
[]
[]
[]
[]
[]
[]
[]
[]
[]
[]
[]
[]
[]
[]
[]
[]
[]
[]
[]
[]
[]
[]
[]
[]
[]
[]
[]
[]
[]
[]
[]
[]
[]
[]
[]
[]
[]
[]
[]
[]
[]
[]
[]
[]
[]
[]
[]
[]
[]
[]
[]
[]
[]
[]
[]
[]
[]
[]
[]
[]
[]
[]
[]
[]
[]
[]
[]
[]
[]
[]
[]
[]
[]
[]
[]
[]
[]
[]
[]
[]
[]
[]
[]
[]
[]
[]
[]
[]
[]
[]
[]
[]
[]
[]
[]
[]
[]
[]
[]
[]
[]
[]
[]
[]
[]
[]
[]
[]
[]
[]
[]
[]
[]
[]
[]
[]
[]
[]
[]
[]
[]
[]
[]
[]
[]
[]
[]
[]
[]
[]
[]
[]
[]
[]
[]
[]
[]
[]
[]
[]
[]
[]
[]
[]
[]
[]
[]
[]
[]
[]
[]
[]
[]
[]
[]
[]
[]
[]
[]
[]
[]
[]
[]
[]
[]
[]
[]
[]
[]
[]
[]
[]
[]
[]
[]
[]
[]
[]
[]
[]
[]
[]
[]
[]
[]
[]
[]
[]
[]
[]
[]
[]
[]
[]
[]
[]
[]
[]
[]
[]
[]
[]
[]
[]
[]
[]
[]
[]
[]
[]
[]
[]
[]
[]
[]
[]
[]
[]
[]
[]
[]
[]
[]
[]
[]
[]
[]
[]
[]
[]
[]
[]
[]
[]
[]
[]
[]
[]
[]
[]
[]
[]
[]
[]
[]
[]
[]
[]
[]
[]
[]
[]
[]
[]
[]
[]
[]
[]
[]
[]
[]
[]
[]
[]
[]
[]
[]
[]
[]
[]
[]
[]
[]
[]
[]
[]
[]
[]
[]
[]
[]
[]
[]
[]
[]
[]
[]
[]
[]
[]
[]
[]
[]
[]
[]
[]
[]
[]
[]
[]
[]
[]
[]
[]
[]
[]
[]
[]
[]
[]
[]
[]
[]
[]
[]
[]
[]
[]
[]
[]
[]
[]
[]
[]
[]
[]
[]
[]
[]
[]
[]
[]
[]
[]
[]
[]
[]
[]
[]
[]
[]
[]
[]
[]
[]
[]
[]
[]
[]
[]
[]
[]
[]
[]
[]
[]
[]
[]
[]
[]
[]
[]
[]
[]
[]
[]
[]
[]
[]
[]
[]
[]
[]
[]
[]
[]
[]
[]
[]
[]
[]
[]
[]
[]
[]
[]
[]
[]
[]
[]
[]
[]
[]
[]
[]
[]
[]
[]
[]
[]
[]
[]
[]
[]
[]
[]
[]
[]
[]
[]
[]
[]
[]
[]
[]
[]
[]
[]
[]
[]
[]
[]
[]
[]
[]
[]
[]
[]
[]
[]
[]
[]
[]
[]
[]
[]
[]
[]
[]
[]
[]
[]
[]
[]
[]
[]
[]
[]
[]
[]
[]
[]
[]
[]
[]
[]
[]
[]
[]
[]
[]
[]
[]
[]
[]
[]
[]
[]
[]
[]
[]
[]
[]
[]
[]
[]
[]
[]
[]
[]
[]
[]
[]
[]
[]
[]
[]
[]
[]
[]
[]
[]
[]
[]
[]
[]
[]
[]
[]
[]
[]
[]
[]
[]
[]
[]
[]
[]
[]
[]
[]
[]
[]
[]
[]
[]
[]
[]
[]
[]
[]
[]
[]
[]
[]
[]
[]
[]
[]
[]
[]
[]
[]
[]
[]
[]
[]
[]
[]
[]
[]
[]
[]
[]
[]
[]
[]
[]
[]
[]
[]
[]
[]
[]
[]
[]
[]
[]
[]
[]
[]
[]
[]
[]
[]
[]
[]
[]
[]
[]
[]
[]
[]
[]
[]
[]
[]
[]
[]
[]
[]
[]
[]
[]
[]
[]
[]
[]
[]
[]
[]
[]
[]
[]
[]
[]
[]
[]
[]
[]
[]
[]
[]
[]
[]
[]
[]
[]
[]
[]
[]
[]
[]
[]
[]
[]
[]
[]
[]
[]
[]
[]
[]
[]
[]
[]
[]
[]
[]
[]
[]
[]
[]
[]
[]
[]
[]
[]
[]
[]
[]
[]
[]
[]
[]
[]
[]
[]
[]
[]
[]
[]
[]
[]
[]
[]
[]
[]
[]
[]
[]
[]
[]
[]
[]
[]
[]
[]
[]
[]
[]
[]
[]
[]
[]
[]
[]
[]
[]
[]
[]
[]
[]
[]
[]
[]
[]
[]
[]
[]
[]
[]
[]
[]
[]
[]
[]
[]
[]
[]
[]
[]
[]
[]
[]
[]
[]
[]
[]
[]
[]
[]
[]
[]
[]
[]
[]
[]
[]
[]
[]
[]
[]
[]
[]
[]
[]
[]
[]
[]
[]
[]
[]
[]
[]
[]
[]
[]
[]
[]
[]
[]
[]
[]
[]
[]
[]
[]
[]
[]
[]
[]
[]
[]
[]
[]
[]
[]
[]
[]
[]
[]
[]
[]
[]
[]
[]
[]
[]
[]
[]
[]
[]
[]
[]
[]
[]
[]
[]
[]
[]
[]
[]
[]
[]
[]
[]
[]
[]
[]
[]
[]
[]
[]
[]
[]
[]
[]
[]
[]
[]
[]
[]
[]
[]
[]
[]
[]
[]
[]
[]
[]
[]
[]
[]
[]
[]
[]
[]
[]
[]
[]
[]
[]
[]
[]
[]
[]
[]
[]
[]
[]
[]
[]
[]
[]
[]
[]
[]
[]
[]
[]
[]
[]
[]
[]
[]
[]
[]
[]
[]
[]
[]
[]
[]
[]
[]
[]
[]
[]
[]
[]
[]
[]
[]
[]
[]
[]
[]
[]
[]
[]
[]
[]
[]
[]
[]
[]
[]
[]
[]
[]
[]
[]
[]
[]
[]
[]
[]
[]
[]
[]
[]
[]
[]
[]
[]
[]
[]
[]
[]
[]
[]
[]
[]
[]
[]
[]
[]
[]
[]
[]
[]
[]
[]
[]
[]
[]
[]
[]
[]
[]
[]
[]
[]
[]
[]
[]
[]
[]
[]
[]
[]
[]
[]
[]
[]
[]
[]
[]
[]
[]
[]
[]
[]
[]
[]
[]
[]
[]
[]
[]
[]
[]
[]
[]
[]
[]
[]
[]
[]
[]
[]
[]
[]
[]
[]
[]
[]
[]
[]
[]
[]
[]
[]
[]
[]
[]
[]
[]
[]
[]
[]
[]
[]
[]
[]
[]
[]
[]
[]
[]
[]
[]
[]
[]
[]
[]
[]
[]
[]
[]
[]
[]
[]
[]
[]
[]
[]
[]
[]
[]
[]
[]
[]
[]
[]
[]
[]
[]
[]
[]
[]
[]
[]
[]
[]
[]
[]
[]
[]
[]
[]
[]
[]
[]
[]
[]
[]
[]
[]
[]
[]
[]
[]
[]
[]
[]
[]
[]
[]
[]
[]
[]
[]
[]
[]
[]
[]
[]
[]
[]
[]
[]
[]
[]
[]
[]
[]
[]
[]
[]
[]
[]
[]
[]
[]
[]
[]
[]
[]
[]
[]
[]
[]
[]
[]
[]
[]
[]
[]
[]
[]
[]
[]
[]
[]
[]
[]
[]
[]
[]
[]
[]
[]
[]
[]
[]
[]
[]
[]
[]
[]
[]
[]
[]
[]
[]
[]
[]
[]
[]
[]
[]
[]
[]
[]
[]
[]
[]
[]
[]
[]
[]
[]
[]
[]
[]
[]
[]
[]
[]
[]
[]
[]
[]
[]
[]
[]
[]
[]
[]
[]
[]
[]
[]
[]
[]
[]
[]
[]
[]
[]
[]
[]
[]
[]
[]
[]
[]
[]
[]
[]
[]
[]
[]
[]
[]
[]
[]
[]
[]
[]
[]
[]
[]
[]
[]
[]
[]
[]
[]
[]
[]
[]
[]
[]
[]
[]
[]
[]
[]
[]
[]
[]
[]
[]
[]
[]
[]
[]
[]
[]
[]
[]
[]
[]
[]
[]
[]
[]
[]
[]
[]
[]
[]
[]
[]
[]
[]
[]
[]
[]
[]
[]
[]
[]
[]
[]
[]
[]
[]
[]
[]
[]
[]
[]
[]
[]
[]
[]
[]
[]
[]
[]
[]
[]
[]
[]
[]
[]
[]
[]
[]
[]
[]
[]
[]
[]
[]
[]
[]
[]
[]
[]
[]
[]
[]
[]
[]
[]
[]
[]
[]
[]
[]
[]
[]
[]
[]
[]
[]
[]
[]
[]
[]
[]
[]
[]
[]
[]
[]
[]
[]
[]
[]
[]
[]
[]
[]
[]
[]
[]
[]
[]
[]
[]
[]
[]
[]
[]
[]
[]
[]
[]
[]
[]
[]
[]
[]
[]
[]
[]
[]
[]
[]
[]
[]
[]
[]
[]
[]
[]
[]
[]
[]
[]
[]
[]
[]
[]
[]
[]
[]
[]
[]
[]
[]
[]
[]
[]
[]
[]
[]
[]
[]
[]
[]
[]
[]
[]
[]
[]
[]
[]
[]
[]
[]
[]
[]
[]
[]
[]
[]
[]
[]
[]
[]
[]
[]
[]
[]
[]
[]
[]
[]
[]
[]
[]
[]
[]
[]
[]
[]
[]
[]
[]
[]
[]
[]
[]
[]
[]
[]
[]
[]
[]
[]
[]
[]
[]
[]
[]
[]
[]
[]
[]
[]
[]
[]
[]
[]
[]
[]
[]
[]
[]
[]
[]
[]
[]
[]
[]
[]
[]
[]
[]
[]
[]
[]
[]
[]
[]
[]
[]
[]
[]
[]
[]
[]
[]
[]
[]
[]
[]
[]
[]
[]
[]
[]
[]
[]
[]
[]
[]
[]
[]
[]
[]
[]
[]
[]
[]
[]
[]
[]
[]
[]
[]
[]
[]
[]
[]
[]
[]
[]
[]
[]
[]
[]
[]
[]
[]
[]
[]
[]
[]
[]
[]
[]
[]
[]
[]
[]
[]
[]
[]
[]
[]
[]
[]
[]
[]
[]
[]
[]
[]
[]
[]
[]
[]
[]
[]
[]
[]
[]
[]
[]
[]
[]
[]
[]
[]
[]
[]
[]
[]
[]
[]
[]
[]
[]
[]
[]
[]
[]
[]
[]
[]
[]
[]
[]
[]
[]
[]
[]
[]
[]
[]
[]
[]
[]
[]
[]
[]
[]
[]
[]
[]
[]
[]
[]
[]
[]
[]
[]
[]
[]
[]
[]
[]
[]
[]
[]
[]
[]
[]
[]
[]
[]
[]
[]
[]
[]
[]
[]
[]
[]
[]
[]
[]
[]
[]
[]
[]
[]
[]
[]
[]
[]
[]
[]
[]
[]
[]
[]
[]
[]
[]
[]
[]
[]
[]
[]
[]
[]
[]
[]
[]
[]
[]
[]
[]
[]
[]
[]
[]
[]
[]
[]
[]
[]
[]
[]
[]
[]
[]
[]
[]
[]
[]
[]
[]
[]
[]
[]
[]
[]
[]
[]
[]
[]
[]
[]
[]
[]
[]
[]
[]
[]
[]
[]
[]
[]
[]
[]
[]
[]
[]
[]
[]
[]
[]
[]
[]
[]
[]
[]
[]
[]
[]
[]
[]
[]
[]
[]
[]
[]
[]
[]
[]
[]
[]
[]
[]
[]
[]
[]
[]
[]
[]
[]
[]
[]
[]
[]
[]
[]
[]
[]
[]
[]
[]
[]
[]
[]
[]
[]
[]
[]
[]
[]
[]
[]
[]
[]
[]
[]
[]
[]
[]
[]
[]
[]
[]
[]
[]
[]
[]
[]
[]
[]
[]
[]
[]
[]
[]
[]
[]
[]
[]
[]
[]
[]
[]
[]
[]
[]
[]
[]
[]
[]
[]
[]
[]
[]
[]
[]
[]
[]
[]
[]
[]
[]
[]
[]
[]
[]
[]
[]
[]
[]
[]
[]
[]
[]
[]
[]
[]
[]
[]
[]
[]
[]
[]
[]
[]
[]
[]
[]
[]
[]
[]
[]
[]
[]
[]
[]
[]
[]
[]
[]
[]
[]
[]
[]
[]
[]
[]
[]
[]
[]
[]
[]
[]
[]
[]
[]
[]
[]
[]
[]
[]
[]
[]
[]
[]
[]
[]
[]
[]
[]
[]
[]
[]
[]
[]
[]
[]
[]
[]
[]
[]
[]
[]
[]
[]
[]
[]
[]
[]
[]
[]
[]
[]
[]
[]
[]
[]
[]
[]
[]
[]
[]
[]
[]
[]
[]
[]
[]
[]
[]
[]
[]
[]
[]
[]
[]
[]
[]
[]
[]
[]
[]
[]
[]
[]
[]
[]
[]
[]
[]
[]
[]
[]
[]
[]
[]
[]
[]
[]
[]
[]
[]
[]
[]
[]
[]
[]
[]
[]
[]
[]
[]
[]
[]
[]
[]
[]
[]
[]
[]
[]
[]
[]
[]
[]
[]
[]
[]
[]
[]
[]
[]
[]
[]
[]
[]
[]
[]
[]
[]
[]
[]
[]
[]
[]
[]
[]
[]
[]
[]
[]
[]
[]
[]
[]
[]
[]
[]
[]
[]
[]
[]
[]
[]
[]
[]
[]
[]
[]
[]
[]
[]
[]
[]
[]
[]
[]
[]
[]
[]
[]
[]
[]
[]
[]
[]
[]
[]
[]
[]
[]
[]
[]
[]
[]
[]
[]
[]
[]
[]
[]
[]
[]
[]
[]
[]
[]
[]
[]
[]
[]
[]
[]
[]
[]
[]
[]
[]
[]
[]
[]
[]
[]
[]
[]
[]
[]
[]
[]
[]
[]
[]
[]
[]
[]
[]
[]
[]
[]
[]
[]
[]
[]
[]
[]
[]
[]
[]
[]
[]
[]
[]
[]
[]
[]
[]
[]
[]
[]
[]
[]
[]
[]
[]
[]
[]
[]
[]
[]
[]
[]
[]
[]
[]
[]
[]
[]
[]
[]
[]
[]
[]
[]
[]
[]
[]
[]
[]
[]
[]
[]
[]
[]
[]
[]
[]
[]
[]
[]
[]
[]
[]
[]
[]
[]
[]
[]
[]
[]
[]
[]
[]
[]
[]
[]
[]
[]
[]
[]
[]
[]
[]
[]
[]
[]
[]
[]
[]
[]
[]
[]
[]
[]
[]
[]
[]
[]
[]
[]
[]
[]
[]
[]
[]
[]
[]
[]
[]
[]
[]
[]
[]
[]
[]
[]
[]
[]
[]
[]
[]
[]
[]
[]
[]
[]
[]
[]
[]
[]
[]
[]
[]
[]
[]
[]
[]
[]
[]
[]
[]
[]
[]
[]
[]
[]
[]
[]
[]
[]
[]
[]
[]
[]
[]
[]
[]
[]
[]
[]
[]
[]
[]
[]
[]
[]
[]
[]
[]
[]
[]
[]
[]
[]
[]
[]
[]
[]
[]
[]
[]
[]
[]
[]
[]
[]
[]
[]
[]
[]
[]
[]
[]
[]
[]
[]
[]
[]
[]
[]
[]
[]
[]
[]
[]
[]
[]
[]
[]
[]
[]
[]
[]
[]
[]
[]
[]
[]
[]
[]
[]
[]
[]
[]
[]
[]
[]
[]
[]
[]
[]
[]
[]
[]
[]
[]
[]
[]
[]
[]
[]
[]
[]
[]
[]
[]
[]
[]
[]
[]
[]
[]
[]
[]
[]
[]
[]
[]
[]
[]
[]
[]
[]
[]
[]
[]
[]
[]
[]
[]
[]
[]
[]
[]
[]
[]
[]
[]
[]
[]
[]
[]
[]
[]
[]
[]
[]
[]
[]
[]
[]
[]
[]
[]
[]
[]
[]
[]
[]
[]
[]
[]
[]
[]
[]
[]
[]
[]
[]
[]
[]
[]
[]
[]
[]
[]
[]
[]
[]
[]
[]
[]
[]
[]
[]
[]
[]
[]
[]
[]
[]
[]
[]
[]
[]
[]
[]
[]
[]
[]
[]
[]
[]
[]
[]
[]
[]
[]
[]
[]
[]
[]
[]
[]
[]
[]
[]
[]
[]
[]
[]
[]
[]
[]
[]
[]
[]
[]
[]
[]
[]
[]
[]
[]
[]
[]
[]
[]
[]
[]
[]
[]
[]
[]
[]
[]
[]
[]
[]
[]
[]
[]
[]
[]
[]
[]
[]
[]
[]
[]
[]
[]
[]
[]
[]
[]
[]
[]
[]
[]
[]
[]
[]
[]
[]
[]
[]
[]
[]
[]
[]
[]
[]
[]
[]
[]
[]
[]
[]
[]
[]
[]
[]
[]
[]
[]
[]
[]
[]
[]
[]
[]
[]
[]
[]
[]
[]
[]
[]
[]
[]
[]
[]
[]
[]
[]
[]
[]
[]
[]
[]
[]
[]
[]
[]
[]
[]
[]
[]
[]
[]
[]
[]
[]
[]
[]
[]
[]
[]
[]
[]
[]
[]
[]
[]
[]
[]
[]
[]
[]
[]
[]
[]
[]
[]
[]
[]
[]
[]
[]
[]
[]
[]
[]
[]
[]
[]
[]
[]
[]
[]
[]
[]
[]
[]
[]
[]
[]
[]
[]
[]
[]
[]
[]
[]
[]
[]
[]
[]
[]
[]
[]
[]
[]
[]
[]
[]
[]
[]
[]
[]
[]
[]
[]
[]
[]
[]
[]
[]
[]
[]
[]
[]
[]
[]
[]
[]
[]
[]
[]
[]
[]
[]
[]
[]
[]
[]
[]
[]
[]
[]
[]
[]
[]
[]
[]
[]
[]
[]
[]
[]
[]
[]
[]
[]
[]
[]
[]
[]
[]
[]
[]
[]
[]
[]
[]
[]
[]
[]
[]
[]
[]
[]
[]
[]
[]
[]
[]
[]
[]
[]
[]
[]
[]
[]
[]
[]
[]
[]
[]
[]
[]
[]
[]
[]
[]
[]
[]
[]
[]
[]
[]
[]
[]
[]
[]
[]
[]
[]
[]
[]
[]
[]
[]
[]
[]
[]
[]
[]
[]
[]
[]
[]
[]
[]
[]
[]
[]
[]
[]
[]
[]
[]
[]
[]
[]
[]
[]
[]
[]
[]
[]
[]
[]
[]
[]
[]
[]
[]
[]
[]
[]
[]
[]
[]
[]
[]
[]
[]
[]
[]
[]
[]
[]
[]
[]
[]
[]
[]
[]
[]
[]
[]
[]
[]
[]
[]
[]
[]
[]
[]
[]
[]
[]
[]
[]
[]
[]
[]
[]
[]
[]
[]
[]
[]
[]
[]
[]
[]
[]
[]
[]
[]
[]
[]
[]
[]
[]
[]
[]
[]
[]
[]
[]
[]
[]
[]
[]
[]
[]
[]
[]
[]
[]
[]
[]
[]
[]
[]
[]
[]
[]
[]
[]
[]
[]
[]
[]
[]
[]
[]
[]
[]
[]
[]
[]
[]
[]
[]
[]
[]
[]
[]
[]
[]
[]
[]
[]
[]
[]
[]
[]
[]
[]
[]
[]
[]
[]
[]
[]
[]
[]
[]
[]
[]
[]
[]
[]
[]
[]
[]
[]
[]
[]
[]
[]
[]
[]
[]
[]
[]
[]
[]
[]
[]
[]
[]
[]
[]
[]
[]
[]
[]
[]
[]
[]
[]
[]
[]
[]
[]
[]
[]
[]
[]
[]
[]
[]
[]
[]
[]
[]
[]
[]
[]
[]
[]
[]
[]
[]
[]
[]
[]
[]
[]
[]
[]
[]
[]
[]
[]
[]
[]
[]
[]
[]
[]
[]
[]
[]
[]
[]
[]
[]
[]
[]
[]
[]
[]
[]
[]
[]
[]
[]
[]
[]
[]
[]
[]
[]
[]
[]
[]
[]
[]
[]
[]
[]
[]
[]
[]
[]
[]
[]
[]
[]
[]
[]
[]
[]
[]
[]
[]
[]
[]
[]
[]
[]
[]
[]
[]
[]
[]
[]
[]
[]
[]
[]
[]
[]
[]
[]
[]
[]
[]
[]
[]
[]
[]
[]
[]
[]
[]
[]
[]
[]
[]
[]
[]
[]
[]
[]
[]
[]
[]
[]
[]
[]
[]
[]
[]
[]
[]
[]
[]
[]
[]
[]
[]
[]
[]
[]
[]
[]
[]
[]
[]
[]
[]
[]
[]
[]
[]
[]
[]
[]
[]
[]
[]
[]
[]
[]
[]
[]
[]
[]
[]
[]
[]
[]
[]
[]
[]
[]
[]
[]
[]
[]
[]
[]
[]
[]
[]
[]
[]
[]
[]
[]
[]
[]
[]
[]
[]
[]
[]
[]
[]
[]
[]
[]
[]
[]
[]
[]
[]
[]
[]
[]
[]
[]
[]
[]
[]
[]
[]
[]
[]
[]
[]
[]
[]
[]
[]
[]
[]
[]
[]
[]
[]
[]
[]
[]
[]
[]
[]
[]
[]
[]
[]
[]
[]
[]
[]
[]
[]
[]
[]
[]
[]
[]
[]
[]
[]
[]
[]
[]
[]
[]
[]
[]
[]
[]
[]
[]
[]
[]
[]
[]
[]
[]
[]
[]
[]
[]
[]
[]
[]
[]
[]
[]
[]
[]
[]
[]
[]
[]
[]
[]
[]
[]
[]
[]
[]
[]
[]
[]
[]
[]
[]
[]
[]
[]
[]
[]
[]
[]
[]
[]
[]
[]
[]
[]
[]
[]
[]
[]
[]
[]
[]
[]
[]
[]
[]
[]
[]
[]
[]
[]
[]
[]
[]
[]
[]
[]
[]
[]
[]
[]
[]
[]
[]
[]
[]
[]
[]
[]
[]
[]
[]
[]
[]
[]
[]
[]
[]
[]
[]
[]
[]
[]
[]
[]
[]
[]
[]
[]
[]
[]
[]
[]
[]
[]
[]
[]
[]
[]
[]
[]
[]
[]
[]
[]
[]
[]
[]
[]
[]
[]
[]
[]
[]
[]
[]
[]
[]
[]
[]
[]
[]
[]
[]
[]
[]
[]
[]
[]
[]
[]
[]
[]
[]
[]
[]
[]
[]
[]
[]
[]
[]
[]
[]
[]
[]
[]
[]
[]
[]
[]
[]
[]
[]
[]
[]
[]
[]
[]
[]
[]
[]
[]
[]
[]
[]
[]
[]
[]
[]
[]
[]
[]
[]
[]
[]
[]
[]
[]
[]
[]
[]
[]
[]
[]
[]
[]
[]
[]
[]
[]
[]
[]
[]
[]
[]
[]
[]
[]
[]
[]
[]
[]
[]
[]
[]
[]
[]
[]
[]
[]
[]
[]
[]
[]
[]
[]
[]
[]
[]
[]
[]
[]
[]
[]
[]
[]
[]
[]
[]
[]
[]
[]
[]
[]
[]
[]
[]
[]
[]
[]
[]
[]
[]
[]
[]
[]
[]
[]
[]
[]
[]
[]
[]
[]
[]
[]
[]
[]
[]
[]
[]
[]
[]
[]
[]
[]
[]
[]
[]
[]
[]
[]
[]
[]
[]
[]
[]
[]
[]
[]
[]
[]
[]
[]
[]
[]
[]
[]
[]
[]
[]
[]
[]
[]
[]
[]
[]
[]
[]
[]
[]
[]
[]
[]
[]
[]
[]
[]
[]
[]
[]
[]
[]
[]
[]
[]
[]
[]
[]
[]
[]
[]
[]
[]
[]
[]
[]
[]
[]
[]
[]
[]
[]
[]
[]
[]
[]
[]
[]
[]
[]
[]
[]
[]
[]
[]
[]
[]
[]
[]
[]
[]
[]
[]
[]
[]
[]
[]
[]
[]
[]
[]
[]
[]
[]
[]
[]
[]
[]
[]
[]
[]
[]
[]
[]
[]
[]
[]
[]
[]
[]
[]
[]
[]
[]
[]
[]
[]
[]
[]
[]
[]
[]
[]
[]
[]
[]
[]
[]
[]
[]
[]
[]
[]
[]
[]
[]
[]
[]
[]
[]
[]
[]
[]
[]
[]
[]
[]
[]
[]
[]
[]
[]
[]
[]
[]
[]
[]
[]
[]
[]
[]
[]
[]
[]
[]
[]
[]
[]
[]
[]
[]
[]
[]
[]
[]
[]
[]
[]
[]
[]
[]
[]
[]
[]
[]
[]
[]
[]
[]
[]
[]
[]
[]
[]
[]
[]
[]
[]
[]
[]
[]
[]
[]
[]
[]
[]
[]
[]
[]
[]
[]
[]
[]
[]
[]
[]
[]
[]
[]
[]
[]
[]
[]
[]
[]
[]
[]
[]
[]
[]
[]
[]
[]
[]
[]
[]
[]
[]
[]
[]
[]
[]
[]
[]
[]
[]
[]
[]
[]
[]
[]
[]
[]
[]
[]
[]
[]
[]
[]
[]
[]
[]
[]
[]
[]
[]
[]
[]
[]
[]
[]
[]
[]
[]
[]
[]
[]
[]
[]
[]
[]
[]
[]
[]
[]
[]
[]
[]
[]
[]
[]
[]
[]
[]
[]
[]
[]
[]
[]
[]
[]
[]
[]
[]
[]
[]
[]
[]
[]
[]
[]
[]
[]
[]
[]
[]
[]
[]
[]
[]
[]
[]
[]
[]
[]
[]
[]
[]
[]
[]
[]
[]
[]
[]
[]
[]
[]
[]
[]
[]
[]
[]
[]
[]
[]
[]
[]
[]
[]
[]
[]
[]
[]
[]
[]
[]
[]
[]
[]
[]
[]
[]
[]
[]
[]
[]
[]
[]
[]
[]
[]
[]
[]
[]
[]
[]
[]
[]
[]
[]
[]
[]
[]
[]
[]
[]
[]
[]
[]
[]
[]
[]
[]
[]
[]
[]
[]
[]
[]
[]
[]
[]
[]
[]
[]
[]
[]
[]
[]
[]
[]
[]
[]
[]
[]
[]
[]
[]
[]
[]
[]
[]
[]
[]
[]
[]
[]
[]
[]
[]
[]
[]
[]
[]
[]
[]
[]
[]
[]
[]
[]
[]
[]
[]
[]
[]
[]
[]
[]
[]
[]
[]
[]
[]
[]
[]
[]
[]
[]
[]
[]
[]
[]
[]
[]
[]
[]
[]
[]
[]
[]
[]
[]
[]
[]
[]
[]
[]
[]
[]
[]
[]
[]
[]
[]
[]
[]
[]
[]
[]
[]
[]
[]
[]
[]
[]
[]
[]
[]
[]
[]
[]
[]
[]
[]
[]
[]
[]
[]
[]
[]
[]
[]
[]
[]
[]
[]
[]
[]
[]
[]
[]
[]
[]
[]
[]
[]
[]
[]
[]
[]
[]
[]
[]
[]
[]
[]
[]
[]
[]
[]
[]
[]
[]
[]
[]
[]
[]
[]
[]
[]
[]
[]
[]
[]
[]
[]
[]
[]
[]
[]
[]
[]
[]
[]
[]
[]
[]
[]
[]
[]
[]
[]
[]
[]
[]
[]
[]
[]
[]
[]
[]
[]
[]
[]
[]
[]
[]
[]
[]
[]
[]
[]
[]
[]
[]
[]
[]
[]
[]
[]
[]
[]
[]
[]
[]
[]
[]
[]
[]
[]
[]
[]
[]
[]
[]
[]
[]
[]
[]
[]
[]
[]
[]
[]
[]
[]
[]
[]
[]
[]
[]
[]
[]
[]
[]
[]
[]
[]
[]
[]
[]
[]
[]
[]
[]
[]
[]
[]
[]
[]
[]
[]
[]
[]
[]
[]
[]
[]
[]
[]
[]
[]
[]
[]
[]
[]
[]
[]
[]
[]
[]
[]
[]
[]
[]
[]
[]
[]
[]
[]
[]
[]
[]
[]
[]
[]
[]
[]
[]
[]
[]
[]
[]
[]
[]
[]
[]
[]
[]
[]
[]
[]
[]
[]
[]
[]
[]
[]
[]
[]
[]
[]
[]
[]
[]
[]
[]
[]
[]
[]
[]
[]
[]
[]
[]
[]
[]
[]
[]
[]
[]
[]
[]
[]
[]
[]
[]
[]
[]
[]
[]
[]
[]
[]
[]
[]
[]
[]
[]
[]
[]
[]
[]
[]
[]
[]
[]
[]
[]
[]
[]
[]
[]
[]
[]
[]
[]
[]
[]
[]
[]
[]
[]
[]
[]
[]
[]
[]
[]
[]
[]
[]
[]
[]
[]
[]
[]
[]
[]
[]
[]
[]
[]
[]
[]
[]
[]
[]
[]
[]
[]
[]
[]
[]
[]
[]
[]
[]
[]
[]
[]
[]
[]
[]
[]
[]
[]
[]
[]
[]
[]
[]
[]
[]
[]
[]
[]
[]
[]
[]
[]
[]
[]
[]
[]
[]
[]
[]
[]
[]
[]
[]
[]
[]
[]
[]
[]
[]
[]
[]
[]
[]
[]
[]
[]
[]
[]
[]
[]
[]
[]
[]
[]
[]
[]
[]
[]
[]
[]
[]
[]
[]
[]
[]
[]
[]
[]
[]
[]
[]
[]
[]
[]
[]
[]
[]
[]
[]
[]
[]
[]
[]
[]
[]
[]
[]
[]
[]
[]
[]
[]
[]
[]
[]
[]
[]
[]
[]
[]
[]
[]
[]
[]
[]
[]
[]
[]
[]
[]
[]
[]
[]
[]
[]
[]
[]
[]
[]
[]
[]
[]
[]
[]
[]
[]
[]
[]
[]
[]
[]
[]
[]
[]
[]
[]
[]
[]
[]
[]
[]
[]
[]
[]
[]
[]
[]
[]
[]
[]
[]
[]
[]
[]
[]
[]
[]
[]
[]
[]
[]
[]
[]
[]
[]
[]
[]
[]
[]
[]
[]
[]
[]
[]
[]
[]
[]
[]
[]
[]
[]
[]
[]
[]
[]
[]
[]
[]
[]
[]
[]
[]
[]
[]
[]
[]
[]
[]
[]
[]
[]
[]
[]
[]
[]
[]
[]
[]
[]
[]
[]
[]
[]
[]
[]
[]
[]
[]
[]
[]
[]
[]
[]
[]
[]
[]
[]
[]
[]
[]
[]
[]
[]
[]
[]
[]
[]
[]
[]
[]
[]
[]
[]
[]
[]
[]
[]
[]
[]
[]
[]
[]
[]
[]
[]
[]
[]
[]
[]
[]
[]
[]
[]
[]
[]
[]
[]
[]
[]
[]
[]
[]
[]
[]
[]
[]
[]
[]
[]
[]
[]
[]
[]
[]
[]
[]
[]
[]
[]
[]
[]
[]
[]
[]
[]
[]
[]
[]
[]
[]
[]
[]
[]
[]
[]
[]
[]
[]
[]
[]
[]
[]
[]
[]
[]
[]
[]
[]
[]
[]
[]
[]
[]
[]
[]
[]
[]
[]
[]
[]
[]
[]
[]
[]
[]
[]
[]
[]
[]
[]
[]
[]
[]
[]
[]
[]
[]
[]
[]
[]
[]
[]
[]
[]
[]
[]
[]
[]
[]
[]
[]
[]
[]
[]
[]
[]
[]
[]
[]
[]
[]
[]
[]
[]
[]
[]
[]
[]
[]
[]
[]
[]
[]
[]
[]
[]
[]
[]
[]
[]
[]
[]
[]
[]
[]
[]
[]
[]
[]
[]
[]
[]
[]
[]
[]
[]
[]
[]
[]
[]
[]
[]
[]
[]
[]
[]
[]
[]
[]
[]
[]
[]
[]
[]
[]
[]
[]
[]
[]
[]
[]
[]
[]
[]
[]
[]
[]
[]
[]
[]
[]
[]
[]
[]
[]
[]
[]
[]
[]
[]
[]
[]
[]
[]
[]
[]
[]
[]
[]
[]
[]
[]
[]
[]
[]
[]
[]
[]
[]
[]
[]
[]
[]
[]
[]
[]
[]
[]
[]
[]
[]
[]
[]
[]
[]
[]
[]
[]
[]
[]
[]
[]
[]
[]
[]
[]
[]
[]
[]
[]
[]
[]
[]
[]
[]
[]
[]
[]
[]
[]
[]
[]
[]
[]
[]
[]
[]
[]
[]
[]
[]
[]
[]
[]
[]
[]
[]
[]
[]
[]
[]
[]
[]
[]
[]
[]
[]
[]
[]
[]
[]
[]
[]
[]
[]
[]
[]
[]
[]
[]
[]
[]
[]
[]
[]
[]
[]
[]
[]
[]
[]
[]
[]
[]
[]
[]
[]
[]
[]
[]
[]
[]
[]
[]
[]
[]
[]
[]
[]
[]
[]
[]
[]
[]
[]
[]
[]
[]
[]
[]
[]
[]
[]
[]
[]
[]
[]
[]
[]
[]
[]
[]
[]
[]
[]
[]
[]
[]
[]
[]
[]
[]
[]
[]
[]
[]
[]
[]
[]
[]
[]
[]
[]
[]
[]
[]
[]
[]
[]
[]
[]
[]
[]
[]
[]
[]
[]
[]
[]
[]
[]
[]
[]
[]
[]
[]
[]
[]
[]
[]
[]
[]
[]
[]
[]
[]
[]
[]
[]
[]
[]
[]
[]
[]
[]
[]
[]
[]
[]
[]
[]
[]
[]
[]
[]
[]
[]
[]
[]
[]
[]
[]
[]
[]
[]
[]
[]
[]
[]
[]
[]
[]
[]
[]
[]
[]
[]
[]
[]
[]
[]
[]
[]
[]
[]
[]
[]
[]
[]
[]
[]
[]
[]
[]
[]
[]
[]
[]
[]
[]
[]
[]
[]
[]
[]
[]
[]
[]
[]
[]
[]
[]
[]
[]
[]
[]
[]
[]
[]
[]
[]
[]
[]
[]
[]
[]
[]
[]
[]
[]
[]
[]
[]
[]
[]
[]
[]
[]
[]
[]
[]
[]
[]
[]
[]
[]
[]
[]
[]
[]
[]
[]
[]
[]
[]
[]
[]
[]
[]
[]
[]
[]
[]
[]
[]
[]
[]
[]
[]
[]
[]
[]
[]
[]
[]
[]
[]
[]
[]
[]
[]
[]
[]
[]
[]
[]
[]
[]
[]
[]
[]
[]
[]
[]
[]
[]
[]
[]
[]
[]
[]
[]
[]
[]
[]
[]
[]
[]
[]
[]
[]
[]
[]
[]
[]
[]
[]
[]
[]
[]
[]
[]
[]
[]
[]
[]
[]
[]
[]
[]
[]
[]
[]
[]
[]
[]
[]
[]
[]
[]
[]
[]
[]
[]
[]
[]
[]
[]
[]
[]
[]
[]
[]
[]
[]
[]
[]
[]
[]
[]
[]
[]
[]
[]
[]
[]
[]
[]
[]
[]
[]
[]
[]
[]
[]
[]
[]
[]
[]
[]
[]
[]
[]
[]
[]
[]
[]
[]
[]
[]
[]
[]
[]
[]
[]
[]
[]
[]
[]
[]
[]
[]
[]
[]
[]
[]
[]
[]
[]
[]
[]
[]
[]
[]
[]
[]
[]
[]
[]
[]
[]
[]
[]
[]
[]
[]
[]
[]
[]
[]
[]
[]
[]
[]
[]
[]
[]
[]
[]
[]
[]
[]
[]
[]
[]
[]
[]
[]
[]
[]
[]
[]
[]
[]
[]
[]
[]
[]
[]
[]
[]
[]
[]
[]
[]
[]
[]
[]
[]
[]
[]
[]
[]
[]
[]
[]
[]
[]
[]
[]
[]
[]
[]
[]
[]
[]
[]
[]
[]
[]
[]
[]
[]
[]
[]
[]
[]
[]
[]
[]
[]
[]
[]
[]
[]
[]
[]
[]
[]
[]
[]
[]
[]
[]
[]
[]
[]
[]
[]
[]
[]
[]
[]
[]
[]
[]
[]
[]
[]
[]
[]
[]
[]
[]
[]
[]
[]
[]
[]
[]
[]
[]
[]
[]
[]
[]
[]
[]
[]
[]
[]
[]
[]
[]
[]
[]
[]
[]
[]
[]
[]
[]
[]
[]
[]
[]
[]
[]
[]
[]
[]
[]
[]
[]
[]
[]
[]
[]
[]
[]
[]
[]
[]
[]
[]
[]
[]
[]
[]
[]
[]
[]
[]
[]
[]
[]
[]
[]
[]
[]
[]
[]
[]
[]
[]
[]
[]
[]
[]
[]
[]
[]
[]
[]
[]
[]
[]
[]
[]
[]
[]
[]
[]
[]
[]
[]
[]
[]
[]
[]
[]
[]
[]
[]
[]
[]
[]
[]
[]
[]
[]
[]
[]
[]
[]
[]
[]
[]
[]
[]
[]
[]
[]
[]
[]
[]
[]
[]
[]
[]
[]
[]
[]
[]
[]
[]
[]
[]
[]
[]
[]
[]
[]
[]
[]
[]
[]
[]
[]
[]
[]
[]
[]
[]
[]
[]
[]
[]
[]
[]
[]
[]
[]
[]
[]
[]
[]
[]
[]
[]
[]
[]
[]
[]
[]
[]
[]
[]
[]
[]
[]
[]
[]
[]
[]
[]
[]
[]
[]
[]
[]
[]
[]
[]
[]
[]
[]
[]
[]
[]
[]
[]
[]
[]
[]
[]
[]
[]
[]
[]
[]
[]
[]
[]
[]
[]
[]
[]
[]
[]
[]
[]
[]
[]
[]
[]
[]
[]
[]
[]
[]
[]
[]
[]
[]
[]
[]
[]
[]
[]
[]
[]
[]
[]
[]
[]
[]
[]
[]
[]
[]
[]
[]
[]
[]
[]
[]
[]
[]
[]
[]
[]
[]
[]
[]
[]
[]
[]
[]
[]
[]
[]
[]
[]
[]
[]
[]
[]
[]
[]
[]
[]
[]
[]
[]
[]
[]
[]
[]
[]
[]
[]
[]
[]
[]
[]
[]
[]
[]
[]
[]
[]
[]
[]
[]
[]
[]
[]
[]
[]
[]
[]
[]
[]
[]
[]
[]
[]
[]
[]
[]
[]
[]
[]
[]
[]
[]
[]
[]
[]
[]
[]
[]
[]
[]
[]
[]
[]
[]
[]
[]
[]
[]
[]
[]
[]
[]
[]
[]
[]
[]
[]
[]
[]
[]
[]
[]
[]
[]
[]
[]
[]
[]
[]
[]
[]
[]
[]
[]
[]
[]
[]
[]
[]
[]
[]
[]
[]
[]
[]
[]
[]
[]
[]
[]
[]
[]
[]
[]
[]
[]
[]
[]
[]
[]
[]
[]
[]
[]
[]
[]
[]
[]
[]
[]
[]
[]
[]
[]
[]
[]
[]
[]
[]
[]
[]
[]
[]
[]
[]
[]
[]
[]
[]
[]
[]
[]
[]
[]
[]
[]
[]
[]
[]
[]
[]
[]
[]
[]
[]
[]
[]
[]
[]
[]
[]
[]
[]
[]
[]
[]
[]
[]
[]
[]
[]
[]
[]
[]
[]
[]
[]
[]
[]
[]
[]
[]
[]
[]
[]
[]
[]
[]
[]
[]
[]
[]
[]
[]
[]
[]
[]
[]
[]
[]
[]
[]
[]
[]
[]
[]
[]
[]
[]
[]
[]
[]
[]
[]
[]
[]
[]
[]
[]
[]
[]
[]
[]
[]
[]
[]
[]
[]
[]
[]
[]
[]
[]
[]
[]
[]
[]
[]
[]
[]
[]
[]
[]
[]
[]
[]
[]
[]
[]
[]
[]
[]
[]
[]
[]
[]
[]
[]
[]
[]
[]
[]
[]
[]
[]
[]
[]
[]
[]
[]
[]
[]
[]
[]
[]
[]
[]
[]
[]
[]
[]
[]
[]
[]
[]
[]
[]
[]
[]
[]
[]
[]
[]
[]
[]
[]
[]
[]
[]
[]
[]
[]
[]
[]
[]
[]
[]
[]
[]
[]
[]
[]
[]
[]
[]
[]
[]
[]
[]
[]
[]
[]
[]
[]
[]
[]
[]
[]
[]
[]
[]
[]
[]
[]
[]
[]
[]
[]
[]
[]
[]
[]
[]
[]
[]
[]
[]
[]
[]
[]
[]
[]
[]
[]
[]
[]
[]
[]
[]
[]
[]
[]
[]
[]
[]
[]
[]
[]
[]
[]
[]
[]
[]
[]
[]
[]
[]
[]
[]
[]
[]
[]
[]
[]
[]
[]
[]
[]
[]
[]
[]
[]
[]
[]
[]
[]
[]
[]
[]
[]
[]
[]
[]
[]
[]
[]
[]
[]
[]
[]
[]
[]
[]
[]
[]
[]
[]
[]
[]
[]
[]
[]
[]
[]
[]
[]
[]
[]
[]
[]
[]
[]
[]
[]
[]
[]
[]
[]
[]
[]
[]
[]
[]
[]
[]
[]
[]
[]
[]
[]
[]
[]
[]
[]
[]
[]
[]
[]
[]
[]
[]
[]
[]
[]
[]
[]
[]
[]
[]
[]
[]
[]
[]
[]
[]
[]
[]
[]
[]
[]
[]
[]
[]
[]
[]
[]
[]
[]
[]
[]
[]
[]
[]
[]
[]
[]
[]
[]
[]
[]
[]
[]
[]
[]
[]
[]
[]
[]
[]
[]
[]
[]
[]
[]
[]
[]
[]
[]
[]
[]
[]
[]
[]
[]
[]
[]
[]
[]
[]
[]
[]
[]
[]
[]
[]
[]
[]
[]
[]
[]
[]
[]
[]
[]
[]
[]
[]
[]
[]
[]
[]
[]
[]
[]
[]
[]
[]
[]
[]
[]
[]
[]
[]
[]
[]
[]
[]
[]
[]
[]
[]
[]
[]
[]
[]
[]
[]
[]
[]
[]
[]
[]
[]
[]
[]
[]
[]
[]
[]
[]
[]
[]
[]
[]
[]
[]
[]
[]
[]
[]
[]
[]
[]
[]
[]
[]
[]
[]
[]
[]
[]
[]
[]
[]
[]
[]
[]
[]
[]
[]
[]
[]
[]
[]
[]
[]
[]
[]
[]
[]
[]
[]
[]
[]
[]
[]
[]
[]
[]
[]
[]
[]
[]
[]
[]
[]
[]
[]
[]
[]
[]
[]
[]
[]
[]
[]
[]
[]
[]
[]
[]
[]
[]
[]
[]
[]
[]
[]
[]
[]
[]
[]
[]
[]
[]
[]
[]
[]
[]
[]
[]
[]
[]
[]
[]
[]
[]
[]
[]
[]
[]
[]
[]
[]
[]
[]
[]
[]
[]
[]
[]
[]
[]
[]
[]
[]
[]
[]
[]
[]
[]
[]
[]
[]
[]
[]
[]
[]
[]
[]
[]
[]
[]
[]
[]
[]
[]
[]
[]
[]
[]
[]
[]
[]
[]
[]
[]
[]
[]
[]
[]
[]
[]
[]
[]
[]
[]
[]
[]
[]
[]
[]
[]
[]
[]
[]
[]
[]
[]
[]
[]
[]
[]
[]
[]
[]
[]
[]
[]
[]
[]
[]
[]
[]
[]
[]
[]
[]
[]
[]
[]
[]
[]
[]
[]
[]
[]
[]
[]
[]
[]
[]
[]
[]
[]
[]
[]
[]
[]
[]
[]
[]
[]
[]
[]
[]
[]
[]
[]
[]
[]
[]
[]
[]
[]
[]
[]
[]
[]
[]
[]
[]
[]
[]
[]
[]
[]
[]
[]
[]
[]
[]
[]
[]
[]
[]
[]
[]
[]
[]
[]
[]
[]
[]
[]
[]
[]
[]
[]
[]
[]
[]
[]
[]
[]
[]
[]
[]
[]
[]
[]
[]
[]
[]
[]
[]
[]
[]
[]
[]
[]
[]
[]
[]
[]
[]
[]
[]
[]
[]
[]
[]
[]
[]
[]
[]
[]
[]
[]
[]
[]
[]
[]
[]
[]
[]
[]
[]
[]
[]
[]
[]
[]
[]
[]
[]
[]
[]
[]
[]
[]
[]
[]
[]
[]
[]
[]
[]
[]
[]
[]
[]
[]
[]
[]
[]
[]
[]
[]
[]
[]
[]
[]
[]
[]
[]
[]
[]
[]
[]
[]
[]
[]
[]
[]
[]
[]
[]
[]
[]
[]
[]
[]
[]
[]
[]
[]
[]
[]
[]
[]
[]
[]
[]
[]
[]
[]
[]
[]
[]
[]
[]
[]
[]
[]
[]
[]
[]
[]
[]
[]
[]
[]
[]
[]
[]
[]
[]
[]
[]
[]
[]
[]
[]
[]
[]
[]
[]
[]
[]
[]
[]
[]
[]
[]
[]
[]
[]
[]
[]
[]
[]
[]
[]
[]
[]
[]
[]
[]
[]
[]
[]
[]
[]
[]
[]
[]
[]
[]
[]
[]
[]
[]
[]
[]
[]
[]
[]
[]
[]
[]
[]
[]
[]
[]
[]
[]
[]
[]
[]
[]
[]
[]
[]
[]
[]
[]
[]
[]
[]
[]
[]
[]
[]
[]
[]
[]
[]
[]
[]
[]
[]
[]
[]
[]
[]
[]
[]
[]
[]
[]
[]
[]
[]
[]
[]
[]
[]
[]
[]
[]
[]
[]
[]
[]
[]
[]
[]
[]
[]
[]
[]
[]
[]
[]
[]
[]
[]
[]
[]
[]
[]
[]
[]
[]
[]
[]
[]
[]
[]
[]
[]
[]
[]
[]
[]
[]
[]
[]
[]
[]
[]
[]
[]
[]
[]
[]
[]
[]
[]
[]
[]
[]
[]
[]
[]
[]
[]
[]
[]
[]
[]
[]
[]
[]
[]
[]
[]
[]
[]
[]
[]
[]
[]
[]
[]
[]
[]
[]
[]
[]
[]
[]
[]
[]
[]
[]
[]
[]
[]
[]
[]
[]
[]
[]
[]
[]
[]
[]
[]
[]
[]
[]
[]
[]
[]
[]
[]
[]
[]
[]
[]
[]
[]
[]
[]
[]
[]
[]
[]
[]
[]
[]
[]
[]
[]
[]
[]
[]
[]
[]
[]
[]
[]
[]
[]
[]
[]
[]
[]
[]
[]
[]
[]
[]
[]
[]
[]
[]
[]
[]
[]
[]
[]
[]
[]
[]
[]
[]
[]
[]
[]
[]
[]
[]
[]
[]
[]
[]
[]
[]
[]
[]
[]
[]
[]
[]
[]
[]
[]
[]
[]
[]
[]
[]
[]
[]
[]
[]
[]
[]
[]
[]
[]
[]
[]
[]
[]
[]
[]
[]
[]
[]
[]
[]
[]
[]
[]
[]
[]
[]
[]
[]
[]
[]
[]
[]
[]
[]
[]
[]
[]
[]
[]
[]
[]
[]
[]
[]
[]
[]
[]
[]
[]
[]
[]
[]
[]
[]
[]
[]
[]
[]
[]
[]
[]
[]
[]
[]
[]
[]
[]
[]
[]
[]
[]
[]
[]
[]
[]
[]
[]
[]
[]
[]
[]
[]
[]
[]
[]
[]
[]
[]
[]
[]
[]
[]
[]
[]
[]
[]
[]
[]
[]
[]
[]
[]
[]
[]
[]
[]
[]
[]
[]
[]
[]
[]
[]
[]
[]
[]
[]
[]
[]
[]
[]
[]
[]
[]
[]
[]
[]
[]
[]
[]
[]
[]
[]
[]
[]
[]
[]
[]
[]
[]
[]
[]
[]
[]
[]
[]
[]
[]
[]
[]
[]
[]
[]
[]
[]
[]
[]
[]
[]
[]
[]
[]
[]
[]
[]
[]
[]
[]
[]
[]
[]
[]
[]
[]
[]
[]
[]
[]
[]
[]
[]
[]
[]
[]
[]
[]
[]
[]
[]
[]
[]
[]
[]
[]
[]
[]
[]
[]
[]
[]
[]
[]
[]
[]
[]
[]
[]
[]
[]
[]
[]
[]
[]
[]
[]
[]
[]
[]
[]
[]
[]
[]
[]
[]
[]
[]
[]
[]
[]
[]
[]
[]
[]
[]
[]
[]
[]
[]
[]
[]
[]
[]
[]
[]
[]
[]
[]
[]
[]
[]
[]
[]
[]
[]
[]
[]
[]
[]
[]
[]
[]
[]
[]
[]
[]
[]
[]
[]
[]
[]
[]
[]
[]
[]
[]
[]
[]
[]
[]
[]
[]
[]
[]
[]
[]
[]
[]
[]
[]
[]
[]
[]
[]
[]
[]
[]
[]
[]
[]
[]
[]
[]
[]
[]
[]
[]
[]
[]
[]
[]
[]
[]
[]
[]
[]
[]
[]
[]
[]
[]
[]
[]
[]
[]
[]
[]
[]
[]
[]
[]
[]
[]
[]
[]
[]
[]
[]
[]
[]
[]
[]
[]
[]
[]
[]
[]
[]
[]
[]
[]
[]
[]
[]
[]
[]
[]
[]
[]
[]
[]
[]
[]
[]
[]
[]
[]
[]
[]
[]
[]
[]
[]
[]
[]
[]
[]
[]
[]
[]
[]
[]
[]
[]
[]
[]
[]
[]
[]
[]
[]
[]
[]
[]
[]
[]
[]
[]
[]
[]
[]
[]
[]
[]
[]
[]
[]
[]
[]
[]
[]
[]
[]
[]
[]
[]
[]
[]
[]
[]
[]
[]
[]
[]
[]
[]
[]
[]
[]
[]
[]
[]
[]
[]
[]
[]
[]
[]
[]
[]
[]
[]
[]
[]
[]
[]
[]
[]
[]
[]
[]
[]
[]
[]
[]
[]
[]
[]
[]
[]
[]
[]
[]
[]
[]
[]
[]
[]
[]
[]
[]
[]
[]
[]
[]
[]
[]
[]
[]
[]
[]
[]
[]
[]
[]
[]
[]
[]
[]
[]
[]
[]
[]
[]
[]
[]
[]
[]
[]
[]
[]
[]
[]
[]
[]
[]
[]
[]
[]
[]
[]
[]
[]
[]
[]
[]
[]
[]
[]
[]
[]
[]
[]
[]
[]
[]
[]
[]
[]
[]
[]
[]
[]
[]
[]
[]
[]
[]
[]
[]
[]
[]
[]
[]
[]
[]
[]
[]
[]
[]
[]
[]
[]
[]
[]
[]
[]
[]
[]
[]
[]
[]
[]
[]
[]
[]
[]
[]
[]
[]
[]
[]
[]
[]
[]
[]
[]
[]
[]
[]
[]
[]
[]
[]
[]
[]
[]
[]
[]
[]
[]
[]
[]
[]
[]
[]
[]
[]
[]
[]
[]
[]
[]
[]
[]
[]
[]
[]
[]
[]
[]
[]
[]
[]
[]
[]
[]
[]
[]
[]
[]
[]
[]
[]
[]
[]
[]
[]
[]
[]
[]
[]
[]
[]
[]
[]
[]
[]
[]
[]
[]
[]
[]
[]
[]
[]
[]
[]
[]
[]
[]
[]
[]
[]
[]
[]
[]
[]
[]
[]
[]
[]
[]
[]
[]
[]
[]
[]
[]
[]
[]
[]
[]
[]
[]
[]
[]
[]
[]
[]
[]
[]
[]
[]
[]
[]
[]
[]
[]
[]
[]
[]
[]
[]
[]
[]
[]
[]
[]
[]
[]
[]
[]
[]
[]
[]
[]
[]
[]
[]
[]
[]
[]
[]
[]
[]
[]
[]
[]
[]
[]
[]
[]
[]
[]
[]
[]
[]
[]
[]
[]
[]
[]
[]
[]
[]
[]
[]
[]
[]
[]
[]
[]
[]
[]
[]
[]
[]
[]
[]
[]
[]
[]
[]
[]
[]
[]
[]
[]
[]
[]
[]
[]
[]
[]
[]
[]
[]
[]
[]
[]
[]
[]
[]
[]
[]
[]
[]
[]
[]
[]
[]
[]
[]
[]
[]
[]
[]
[]
[]
[]
[]
[]
[]
[]
[]
[]
[]
[]
[]
[]
[]
[]
[]
[]
[]
[]
[]
[]
[]
[]
[]
[]
[]
[]
[]
[]
[]
[]
[]
[]
[]
[]
[]
[]
[]
[]
[]
[]
[]
[]
[]
[]
[]
[]
[]
[]
[]
[]
[]
[]
[]
[]
[]
[]
[]
[]
[]
[]
[]
[]
[]
[]
[]
[]
[]
[]
[]
[]
[]
[]
[]
[]
[]
[]
[]
[]
[]
[]
[]
[]
[]
[]
[]
[]
[]
[]
[]
[]
[]
[]
[]
[]
[]
[]
[]
[]
[]
[]
[]
[]
[]
[]
[]
[]
[]
[]
[]
[]
[]
[]
[]
[]
[]
[]
[]
[]
[]
[]
[]
[]
[]
[]
[]
[]
[]
[]
[]
[]
[]
[]
[]
[]
[]
[]
[]
[]
[]
[]
[]
[]
[]
[]
[]
[]
[]
[]
[]
[]
[]
[]
[]
[]
[]
[]
[]
[]
[]
[]
[]
[]
[]
[]
[]
[]
[]
[]
[]
[]
[]
[]
[]
[]
[]
[]
[]
[]
[]
[]
[]
[]
[]
[]
[]
[]
[]
[]
[]
[]
[]
[]
[]
[]
[]
[]
[]
[]
[]
[]
[]
[]
[]
[]
[]
[]
[]
[]
[]
[]
[]
[]
[]
[]
[]
[]
[]
[]
[]
[]
[]
[]
[]
[]
[]
[]
[]
[]
[]
[]
[]
[]
[]
[]
[]
[]
[]
[]
[]
[]
[]
[]
[]
[]
[]
[]
[]
[]
[]
[]
[]
[]
[]
[]
[]
[]
[]
[]
[]
[]
[]
[]
[]
[]
[]
[]
[]
[]
[]
[]
[]
[]
[]
[]
[]
[]
[]
[]
[]
[]
[]
[]
[]
[]
[]
[]
[]
[]
[]
[]
[]
[]
[]
[]
[]
[]
[]
[]
[]
[]
[]
[]
[]
[]
[]
[]
[]
[]
[]
[]
[]
[]
[]
[]
[]
[]
[]
[]
[]
[]
[]
[]
[]
[]
[]
[]
[]
[]
[]
[]
[]
[]
[]
[]
[]
[]
[]
[]
[]
[]
[]
[]
[]
[]
[]
[]
[]
[]
[]
[]
[]
[]
[]
[]
[]
[]
[]
[]
[]
[]
[]
[]
[]
[]
[]
[]
[]
[]
[]
[]
[]
[]
[]
[]
[]
[]
[]
[]
[]
[]
[]
[]
[]
[]
[]
[]
[]
[]
[]
[]
[]
[]
[]
[]
[]
[]
[]
[]
[]
[]
[]
[]
[]
[]
[]
[]
[]
[]
[]
[]
[]
[]
[]
[]
[]
[]
[]
[]
[]
[]
[]
[]
[]
[]
[]
[]
[]
[]
[]
[]
[]
[]
[]
[]
[]
[]
[]
[]
[]
[]
[]
[]
[]
[]
[]
[]
[]
[]
[]
[]
[]
[]
[]
[]
[]
[]
[]
[]
[]
[]
[]
[]
[]
[]
[]
[]
[]
[]
[]
[]
[]
[]
[]
[]
[]
[]
[]
[]
[]
[]
[]
[]
[]
[]
[]
[]
[]
[]
[]
[]
[]
[]
[]
[]
[]
[]
[]
[]
[]
[]
[]
[]
[]
[]
[]
[]
[]
[]
[]
[]
[]
[]
[]
[]
[]
[]
[]
[]
[]
[]
[]
[]
[]
[]
[]
[]
[]
[]
[]
[]
[]
[]
[]
[]
[]
[]
[]
[]
[]
[]
[]
[]
[]
[]
[]
[]
[]
[]
[]
[]
[]
[]
[]
[]
[]
[]
[]
[]
[]
[]
[]
[]
[]
[]
[]
[]
[]
[]
[]
[]
[]
[]
[]
[]
[]
[]
[]
[]
[]
[]
[]
[]
[]
[]
[]
[]
[]
[]
[]
[]
[]
[]
[]
[]
[]
[]
[]
[]
[]
[]
[]
[]
[]
[]
[]
[]
[]
[]
[]
[]
[]
[]
[]
[]
[]
[]
[]
[]
[]
[]
[]
[]
[]
[]
[]
[]
[]
[]
[]
[]
[]
[]
[]
[]
[]
[]
[]
[]
[]
[]
[]
[]
[]
[]
[]
[]
[]
[]
[]
[]
[]
[]
[]
[]
[]
[]
[]
[]
[]
[]
[]
[]
[]
[]
[]
[]
[]
[]
[]
[]
[]
[]
[]
[]
[]
[]
[]
[]
[]
[]
[]
[]
[]
[]
[]
[]
[]
[]
[]
[]
[]
[]
[]
[]
[]
[]
[]
[]
[]
[]
[]
[]
[]
[]
[]
[]
[]
[]
[]
[]
[]
[]
[]
[]
[]
[]
[]
[]
[]
[]
[]
[]
[]
[]
[]
[]
[]
[]
[]
[]
[]
[]
[]
[]
[]
[]
[]
[]
[]
[]
[]
[]
[]
[]
[]
[]
[]
[]
[]
[]
[]
[]
[]
[]
[]
[]
[]
[]
[]
[]
[]
[]
[]
[]
[]
[]
[]
[]
[]
[]
[]
[]
[]
[]
[]
[]
[]
[]
[]
[]
[]
[]
[]
[]
[]
[]
[]
[]
[]
[]
[]
[]
[]
[]
[]
[]
[]
[]
[]
[]
[]
[]
[]
[]
[]
[]
[]
[]
[]
[]
[]
[]
[]
[]
[]
[]
[]
[]
[]
[]
[]
[]
[]
[]
[]
[]
[]
[]
[]
[]
[]
[]
[]
[]
[]
[]
[]
[]
[]
[]
[]
[]
[]
[]
[]
[]
[]
[]
[]
[]
[]
[]
[]
[]
[]
[]
[]
[]
[]
[]
[]
[]
[]
[]
[]
[]
[]
[]
[]
[]
[]
[]
[]
[]
[]
[]
[]
[]
[]
[]
[]
[]
[]
[]
[]
[]
[]
[]
[]
[]
[]
[]
[]
[]
[]
[]
[]
[]
[]
[]
[]
[]
[]
[]
[]
[]
[]
[]
[]
[]
[]
[]
[]
[]
[]
[]
[]
[]
[]
[]
[]
[]
[]
[]
[]
[]
[]
[]
[]
[]
[]
[]
[]
[]
[]
[]
[]
[]
[]
[]
[]
[]
[]
[]
[]
[]
[]
[]
[]
[]
[]
[]
[]
[]
[]
[]
[]
[]
[]
[]
[]
[]
[]
[]
[]
[]
[]
[]
[]
[]
[]
[]
[]
[]
[]
[]
[]
[]
[]
[]
[]
[]
[]
[]
[]
[]
[]
[]
[]
[]
[]
[]
[]
[]
[]
[]
[]
[]
[]
[]
[]
[]
[]
[]
[]
[]
[]
[]
[]
[]
[]
[]
[]
[]
[]
[]
[]
[]
[]
[]
[]
[]
[]
[]
[]
[]
[]
[]
[]
[]
[]
[]
[]
[]
[]
[]
[]
[]
[]
[]
[]
[]
[]
[]
[]
[]
[]
[]
[]
[]
[]
[]
[]
[]
[]
[]
[]
[]
[]
[]
[]
[]
[]
[]
[]
[]
[]
[]
[]
[]
[]
[]
[]
[]
[]
[]
[]
[]
[]
[]
[]
[]
[]
[]
[]
[]
[]
[]
[]
[]
[]
[]
[]
[]
[]
[]
[]
[]
[]
[]
[]
[]
[]
[]
[]
[]
[]
[]
[]
[]
[]
[]
[]
[]
[]
[]
[]
[]
[]
[]
[]
[]
[]
[]
[]
[]
[]
[]
[]
[]
[]
[]
[]
[]
[]
[]
[]
[]
[]
[]
[]
[]
[]
[]
[]
[]
[]
[]
[]
[]
[]
[]
[]
[]
[]
[]
[]
[]
[]
[]
[]
[]
[]
[]
[]
[]
[]
[]
[]
[]
[]
[]
[]
[]
[]
[]
[]
[]
[]
[]
[]
[]
[]
[]
[]
[]
[]
[]
[]
[]
[]
[]
[]
[]
[]
[]
[]
[]
[]
[]
[]
[]
[]
[]
[]
[]
[]
[]
[]
[]
[]
[]
[]
[]
[]
[]
[]
[]
[]
[]
[]
[]
[]
[]
[]
[]
[]
[]
[]
[]
[]
[]
[]
[]
[]
[]
[]
[]
[]
[]
[]
[]
[]
[]
[]
[]
[]
[]
[]
[]
[]
[]
[]
[]
[]
[]
[]
[]
[]
[]
[]
[]
[]
[]
[]
[]
[]
[]
[]
[]
[]
[]
[]
[]
[]
[]
[]
[]
[]
[]
[]
[]
[]
[]
[]
[]
[]
[]
[]
[]
[]
[]
[]
[]
[]
[]
[]
[]
[]
[]
[]
[]
[]
[]
[]
[]
[]
[]
[]
[]
[]
[]
[]
[]
[]
[]
[]
[]
[]
[]
[]
[]
[]
[]
[]
[]
[]
[]
[]
[]
[]
[]
[]
[]
[]
[]
[]
[]
[]
[]
[]
[]
[]
[]
[]
[]
[]
[]
[]
[]
[]
[]
[]
[]
[]
[]
[]
[]
[]
[]
[]
[]
[]
[]
[]
[]
[]
[]
[]
[]
[]
[]
[]
[]
[]
[]
[]
[]
[]
[]
[]
[]
[]
[]
[]
[]
[]
[]
[]
[]
[]
[]
[]
[]
[]
[]
[]
[]
[]
[]
[]
[]
[]
[]
[]
[]
[]
[]
[]
[]
[]
[]
[]
[]
[]
[]
[]
[]
[]
[]
[]
[]
[]
[]
[]
[]
[]
[]
[]
[]
[]
[]
[]
[]
[]
[]
[]
[]
[]
[]
[]
[]
[]
[]
[]
[]
[]
[]
[]
[]
[]
[]
[]
[]
[]
[]
[]
[]
[]
[]
[]
[]
[]
[]
[]
[]
[]
[]
[]
[]
[]
[]
[]
[]
[]
[]
[]
[]
[]
[]
[]
[]
[]
[]
[]
[]
[]
[]
[]
[]
[]
[]
[]
[]
[]
[]
[]
[]
[]
[]
[]
[]
[]
[]
[]
[]
[]
[]
[]
[]
[]
[]
[]
[]
[]
[]
[]
[]
[]
[]
[]
[]
[]
[]
[]
[]
[]
[]
[]
[]
[]
[]
[]
[]
[]
[]
[]
[]
[]
[]
[]
[]
[]
[]
[]
[]
[]
[]
[]
[]
[]
[]
[]
[]
[]
[]
[]
[]
[]
[]
[]
[]
[]
[]
[]
[]
[]
[]
[]
[]
[]
[]
[]
[]
[]
[]
[]
[]
[]
[]
[]
[]
[]
[]
[]
[]
[]
[]
[]
[]
[]
[]
[]
[]
[]
[]
[]
[]
[]
[]
[]
[]
[]
[]
[]
[]
[]
[]
[]
[]
[]
[]
[]
[]
[]
[]
[]
[]
[]
[]
[]
[]
[]
[]
[]
[]
[]
[]
[]
[]
[]
[]
[]
[]
[]
[]
[]
[]
[]
[]
[]
[]
[]
[]
[]
[]
[]
[]
[]
[]
[]
[]
[]
[]
[]
[]
[]
[]
[]
[]
[]
[]
[]
[]
[]
[]
[]
[]
[]
[]
[]
[]
[]
[]
[]
[]
[]
[]
[]
[]
[]
[]
[]
[]
[]
[]
[]
[]
[]
[]
[]
[]
[]
[]
[]
[]
[]
[]
[]
[]
[]
[]
[]
[]
[]
[]
[]
[]
[]
[]
[]
[]
[]
[]
[]
[]
[]
[]
[]
[]
[]
[]
[]
[]
[]
[]
[]
[]
[]
[]
[]
[]
[]
[]
[]
[]
[]
[]
[]
[]
[]
[]
[]
[]
[]
[]
[]
[]
[]
[]
[]
[]
[]
[]
[]
[]
[]
[]
[]
[]
[]
[]
[]
[]
[]
[]
[]
[]
[]
[]
[]
[]
[]
[]
[]
[]
[]
[]
[]
[]
[]
[]
[]
[]
[]
[]
[]
[]
[]
[]
[]
[]
[]
[]
[]
[]
[]
[]
[]
[]
[]
[]
[]
[]
[]
[]
[]
[]
[]
[]
[]
[]
[]
[]
[]
[]
[]
[]
[]
[]
[]
[]
[]
[]
[]
[]
[]
[]
[]
[]
[]
[]
[]
[]
[]
[]
[]
[]
[]
[]
[]
[]
[]
[]
[]
[]
[]
[]
[]
[]
[]
[]
[]
[]
[]
[]
[]
[]
[]
[]
[]
[]
[]
[]
[]
[]
[]
[]
[]
[]
[]
[]
[]
[]
[]
[]
[]
[]
[]
[]
[]
[]
[]
[]
[]
[]
[]
[]
[]
[]
[]
[]
[]
[]
[]
[]
[]
[]
[]
[]
[]
[]
[]
[]
[]
[]
[]
[]
[]
[]
[]
[]
[]
[]
[]
[]
[]
[]
[]
[]
[]
[]
[]
[]
[]
[]
[]
[]
[]
[]
[]
[]
[]
[]
[]
[]
[]
[]
[]
[]
[]
[]
[]
[]
[]
[]
[]
[]
[]
[]
[]
[]
[]
[]
[]
[]
[]
[]
[]
[]
[]
[]
[]
[]
[]
[]
[]
[]
[]
[]
[]
[]
[]
[]
[]
[]
[]
[]
[]
[]
[]
[]
[]
[]
[]
[]
[]
[]
[]
[]
[]
[]
[]
[]
[]
[]
[]
[]
[]
[]
[]
[]
[]
[]
[]
[]
[]
[]
[]
[]
[]
[]
[]
[]
[]
[]
[]
[]
[]
[]
[]
[]
[]
[]
[]
[]
[]
[]
[]
[]
[]
[]
[]
[]
[]
[]
[]
[]
[]
[]
[]
[]
[]
[]
[]
[]
[]
[]
[]
[]
[]
[]
[]
[]
[]
[]
[]
[]
[]
[]
[]
[]
[]
[]
[]
[]
[]
[]
[]
[]
[]
[]
[]
[]
[]
[]
[]
[]
[]
[]
[]
[]
[]
[]
[]
[]
[]
[]
[]
[]
[]
[]
[]
[]
[]
[]
[]
[]
[]
[]
[]
[]
[]
[]
[]
[]
[]
[]
[]
[]
[]
[]
[]
[]
[]
[]
[]
[]
[]
[]
[]
[]
[]
[]
[]
[]
[]
[]
[]
[]
[]
[]
[]
[]
[]
[]
[]
[]
[]
[]
[]
[]
[]
[]
[]
[]
[]
[]
[]
[]
[]
[]
[]
[]
[]
[]
[]
[]
[]
[]
[]
[]
[]
[]
[]
[]
[]
[]
[]
[]
[]
[]
[]
[]
[]
[]
[]
[]
[]
[]
[]
[]
[]
[]
[]
[]
[]
[]
[]
[]
[]
[]
[]
[]
[]
[]
[]
[]
[]
[]
[]
[]
[]
[]
[]
[]
[]
[]
[]
[]
[]
[]
[]
[]
[]
[]
[]
[]
[]
[]
[]
[]
[]
[]
[]
[]
[]
[]
[]
[]
[]
[]
[]
[]
[]
[]
[]
[]
[]
[]
[]
[]
[]
[]
[]
[]
[]
[]
[]
[]
[]
[]
[]
[]
[]
[]
[]
[]
[]
[]
[]
[]
[]
[]
[]
[]
[]
[]
[]
[]
[]
[]
[]
[]
[]
[]
[]
[]
[]
[]
[]
[]
[]
[]
[]
[]
[]
[]
[]
[]
[]
[]
[]
[]
[]
[]
[]
[]
[]
[]
[]
[]
[]
[]
[]
[]
[]
[]
[]
[]
[]
[]
[]
[]
[]
[]
[]
[]
[]
[]
[]
[]
[]
[]
[]
[]
[]
[]
[]
[]
[]
[]
[]
[]
[]
[]
[]
[]
[]
[]
[]
[]
[]
[]
[]
[]
[]
[]
[]
[]
[]
[]
[]
[]
[]
[]
[]
[]
[]
[]
[]
[]
[]
[]
[]
[]
[]
[]
[]
[]
[]
[]
[]
[]
[]
[]
[]
[]
[]
[]
[]
[]
[]
[]
[]
[]
[]
[]
[]
[]
[]
[]
[]
[]
[]
[]
[]
[]
[]
[]
[]
[]
[]
[]
[]
[]
[]
[]
[]
[]
[]
[]
[]
[]
[]
[]
[]
[]
[]
[]
[]
[]
[]
[]
[]
[]
[]
[]
[]
[]
[]
[]
[]
[]
[]
[]
[]
[]
[]
[]
[]
[]
[]
[]
[]
[]
[]
[]
[]
[]
[]
[]
[]
[]
[]
[]
[]
[]
[]
[]
[]
[]
[]
[]
[]
[]
[]
[]
[]
[]
[]
[]
[]
[]
[]
[]
[]
[]
[]
[]
[]
[]
[]
[]
[]
[]
[]
[]
[]
[]
[]
[]
[]
[]
[]
[]
[]
[]
[]
[]
[]
[]
[]
[]
[]
[]
[]
[]
[]
[]
[]
[]
[]
[]
[]
[]
[]
[]
[]
[]
[]
[]
[]
[]
[]
[]
[]
[]
[]
[]
[]
[]
[]
[]
[]
[]
[]
[]
[]
[]
[]
[]
[]
[]
[]
[]
[]
[]
[]
[]
[]
[]
[]
[]
[]
[]
[]
[]
[]
[]
[]
[]
[]
[]
[]
[]
[]
[]
[]
[]
[]
[]
[]
[]
[]
[]
[]
[]
[]
[]
[]
[]
[]
[]
[]
[]
[]
[]
[]
[]
[]
[]
[]
[]
[]
[]
[]
[]
[]
[]
[]
[]
[]
[]
[]
[]
[]
[]
[]
[]
[]
[]
[]
[]
[]
[]
[]
[]
[]
[]
[]
[]
[]
[]
[]
[]
[]
[]
[]
[]
[]
[]
[]
[]
[]
[]
[]
[]
[]
[]
[]
[]
[]
[]
[]
[]
[]
[]
[]
[]
[]
[]
[]
[]
[]
[]
[]
[]
[]
[]
[]
[]
[]
[]
[]
[]
[]
[]
[]
[]
[]
[]
[]
[]
[]
[]
[]
[]
[]
[]
[]
[]
[]
[]
[]
[]
[]
[]
[]
[]
[]
[]
[]
[]
[]
[]
[]
[]
[]
[]
[]
[]
[]
[]
[]
[]
[]
[]
[]
[]
[]
[]
[]
[]
[]
[]
[]
[]
[]
[]
[]
[]
[]
[]
[]
[]
[]
[]
[]
[]
[]
[]
[]
[]
[]
[]
[]
[]
[]
[]
[]
[]
[]
[]
[]
[]
[]
[]
[]
[]
[]
[]
[]
[]
[]
[]
[]
[]
[]
[]
[]
[]
[]
[]
[]
[]
[]
[]
[]
[]
[]
[]
[]
[]
[]
[]
[]
[]
[]
[]
[]
[]
[]
[]
[]
[]
[]
[]
[]
[]
[]
[]
[]
[]
[]
[]
[]
[]
[]
[]
[]
[]
[]
[]
[]
[]
[]
[]
[]
[]
[]
[]
[]
[]
[]
[]
[]
[]
[]
[]
[]
[]
[]
[]
[]
[]
[]
[]
[]
[]
[]
[]
[]
[]
[]
[]
[]
[]
[]
[]
[]
[]
[]
[]
[]
[]
[]
[]
[]
[]
[]
[]
[]
[]
[]
[]
[]
[]
[]
[]
[]
[]
[]
[]
[]
[]
[]
[]
[]
[]
[]
[]
[]
[]
[]
[]
[]
[]
[]
[]
[]
[]
[]
[]
[]
[]
[]
[]
[]
[]
[]
[]
[]
[]
[]
[]
[]
[]
[]
[]
[]
[]
[]
[]
[]
[]
[]
[]
[]
[]
[]
[]
[]
[]
[]
[]
[]
[]
[]
[]
[]
[]
[]
[]
[]
[]
[]
[]
[]
[]
[]
[]
[]
[]
[]
[]
[]
[]
[]
[]
[]
[]
[]
[]
[]
[]
[]
[]
[]
[]
[]
[]
[]
[]
[]
[]
[]
[]
[]
[]
[]
[]
[]
[]
[]
[]
[]
[]
[]
[]
[]
[]
[]
[]
[]
[]
[]
[]
[]
[]
[]
[]
[]
[]
[]
[]
[]
[]
[]
[]
[]
[]
[]
[]
[]
[]
[]
[]
[]
[]
[]
[]
[]
[]
[]
[]
[]
[]
[]
[]
[]
[]
[]
[]
[]
[]
[]
[]
[]
[]
[]
[]
[]
[]
[]
[]
[]
[]
[]
[]
[]
[]
[]
[]
[]
[]
[]
[]
[]
[]
[]
[]
[]
[]
[]
[]
[]
[]
[]
[]
[]
[]
[]
[]
[]
[]
[]
[]
[]
[]
[]
[]
[]
[]
[]
[]
[]
[]
[]
[]
[]
[]
[]
[]
[]
[]
[]
[]
[]
[]
[]
[]
[]
[]
[]
[]
[]
[]
[]
[]
[]
[]
[]
[]
[]
[]
[]
[]
[]
[]
[]
[]
[]
[]
[]
[]
[]
[]
[]
[]
[]
[]
[]
[]
[]
[]
[]
[]
[]
[]
[]
[]
[]
[]
[]
[]
[]
[]
[]
[]
[]
[]
[]
[]
[]
[]
[]
[]
[]
[]
[]
[]
[]
[]
[]
[]
[]
[]
[]
[]
[]
[]
[]
[]
[]
[]
[]
[]
[]
[]
[]
[]
[]
[]
[]
[]
[]
[]
[]
[]
[]
[]
[]
[]
[]
[]
[]
[]
[]
[]
[]
[]
[]
[]
[]
[]
[]
[]
[]
[]
[]
[]
[]
[]
[]
[]
[]
[]
[]
[]
[]
[]
[]
[]
[]
[]
[]
[]
[]
[]
[]
[]
[]
[]
[]
[]
[]
[]
[]
[]
[]
[]
[]
[]
[]
[]
[]
[]
[]
[]
[]
[]
[]
[]
[]
[]
[]
[]
[]
[]
[]
[]
[]
[]
[]
[]
[]
[]
[]
[]
[]
[]
[]
[]
[]
[]
[]
[]
[]
[]
[]
[]
[]
[]
[]
[]
[]
[]
[]
[]
[]
[]
[]
[]
[]
[]
[]
[]
[]
[]
[]
[]
[]
[]
[]
[]
[]
[]
[]
[]
[]
[]
[]
[]
[]
[]
[]
[]
[]
[]
[]
[]
[]
[]
[]
[]
[]
[]
[]
[]
[]
[]
[]
[]
[]
[]
[]
[]
[]
[]
[]
[]
[]
[]
[]
[]
[]
[]
[]
[]
[]
[]
[]
[]
[]
[]
[]
[]
[]
[]
[]
[]
[]
[]
[]
[]
[]
[]
[]
[]
[]
[]
[]
[]
[]
[]
[]
[]
[]
[]
[]
[]
[]
[]
[]
[]
[]
[]
[]
[]
[]
[]
[]
[]
[]
[]
[]
[]
[]
[]
[]
[]
[]
[]
[]
[]
[]
[]
[]
[]
[]
[]
[]
[]
[]
[]
[]
[]
[]
[]
[]
[]
[]
[]
[]
[]
[]
[]
[]
[]
[]
[]
[]
[]
[]
[]
[]
[]
[]
[]
[]
[]
[]
[]
[]
[]
[]
[]
[]
[]
[]
[]
[]
[]
[]
[]
[]
[]
[]
[]
[]
[]
[]
[]
[]
[]
[]
[]
[]
[]
[]
[]
[]
[]
[]
[]
[]
[]
[]
[]
[]
[]
[]
[]
[]
[]
[]
[]
[]
[]
[]
[]
[]
[]
[]
[]
[]
[]
[]
[]
[]
[]
[]
[]
[]
[]
[]
[]
[]
[]
[]
[]
[]
[]
[]
[]
[]
[]
[]
[]
[]
[]
[]
[]
[]
[]
[]
[]
[]
[]
[]
[]
[]
[]
[]
[]
[]
[]
[]
[]
[]
[]
[]
[]
[]
[]
[]
[]
[]
[]
[]
[]
[]
[]
[]
[]
[]
[]
[]
[]
[]
[]
[]
[]
[]
[]
[]
[]
[]
[]
[]
[]
[]
[]
[]
[]
[]
[]
[]
[]
[]
[]
[]
[]
[]
[]
[]
[]
[]
[]
[]
[]
[]
[]
[]
[]
[]
[]
[]
[]
[]
[]
[]
[]
[]
[]
[]
[]
[]
[]
[]
[]
[]
[]
[]
[]
[]
[]
[]
[]
[]
[]
[]
[]
[]
[]
[]
[]
[]
[]
[]
[]
[]
[]
[]
[]
[]
[]
[]
[]
[]
[]
[]
[]
[]
[]
[]
[]
[]
[]
[]
[]
[]
[]
[]
[]
[]
[]
[]
[]
[]
[]
[]
[]
[]
[]
[]
[]
[]
[]
[]
[]
[]
[]
[]
[]
[]
[]
[]
[]
[]
[]
[]
[]
[]
[]
[]
[]
[]
[]
[]
[]
[]
[]
[]
[]
[]
[]
[]
[]
[]
[]
[]
[]
[]
[]
[]
[]
[]
[]
[]
[]
[]
[]
[]
[]
[]
[]
[]
[]
[]
[]
[]
[]
[]
[]
[]
[]
[]
[]
[]
[]
[]
[]
[]
[]
[]
[]
[]
[]
[]
[]
[]
[]
[]
[]
[]
[]
[]
[]
[]
[]
[]
[]
[]
[]
[]
[]
[]
[]
[]
[]
[]
[]
[]
[]
[]
[]
[]
[]
[]
[]
[]
[]
[]
[]
[]
[]
[]
[]
[]
[]
[]
[]
[]
[]
[]
[]
[]
[]
[]
[]
[]
[]
[]
[]
[]
[]
[]
[]
[]
[]
[]
[]
[]
[]
[]
[]
[]
[]
[]
[]
[]
[]
[]
[]
[]
[]
[]
[]
[]
[]
[]
[]
[]
[]
[]
[]
[]
[]
[]
[]
[]
[]
[]
[]
[]
[]
[]
[]
[]
[]
[]
[]
[]
[]
[]
[]
[]
[]
[]
[]
[]
[]
[]
[]
[]
[]
[]
[]
[]
[]
[]
[]
[]
[]
[]
[]
[]
[]
[]
[]
[]
[]
[]
[]
[]
[]
[]
[]
[]
[]
[]
[]
[]
[]
[]
[]
[]
[]
[]
[]
[]
[]
[]
[]
[]
[]
[]
[]
[]
[]
[]
[]
[]
[]
[]
[]
[]
[]
[]
[]
[]
[]
[]
[]
[]
[]
[]
[]
[]
[]
[]
[]
[]
[]
[]
[]
[]
[]
[]
[]
[]
[]
[]
[]
[]
[]
[]
[]
[]
[]
[]
[]
[]
[]
[]
[]
[]
[]
[]
[]
[]
[]
[]
[]
[]
[]
[]
[]
[]
[]
[]
[]
[]
[]
[]
[]
[]
[]
[]
[]
[]
[]
[]
[]
[]
[]
[]
[]
[]
[]
[]
[]
[]
[]
[]
[]
[]
[]
[]
[]
[]
[]
[]
[]
[]
[]
[]
[]
[]
[]
[]
[]
[]
[]
[]
[]
[]
[]
[]
[]
[]
[]
[]
[]
[]
[]
[]
[]
[]
[]
[]
[]
[]
[]
[]
[]
[]
[]
[]
[]
[]
[]
[]
[]
[]
[]
[]
[]
[]
[]
[]
[]
[]
[]
[]
[]
[]
[]
[]
[]
[]
[]
[]
[]
[]
[]
[]
[]
[]
[]
[]
[]
[]
[]
[]
[]
[]
[]
[]
[]
[]
[]
[]
[]
[]
[]
[]
[]
[]
[]
[]
[]
[]
[]
[]
[]
[]
[]
[]
[]
[]
[]
[]
[]
[]
[]
[]
[]
[]
[]
[]
[]
[]
[]
[]
[]
[]
[]
[]
[]
[]
[]
[]
[]
[]
[]
[]
[]
[]
[]
[]
[]
[]
[]
[]
[]
[]
[]
[]
[]
[]
[]
[]
[]
[]
[]
[]
[]
[]
[]
[]
[]
[]
[]
[]
[]
[]
[]
[]
[]
[]
[]
[]
[]
[]
[]
[]
[]
[]
[]
[]
[]
[]
[]
[]
[]
[]
[]
[]
[]
[]
[]
[]
[]
[]
[]
[]
[]
[]
[]
[]
[]
[]
[]
[]
[]
[]
[]
[]
[]
[]
[]
[]
[]
[]
[]
[]
[]
[]
[]
[]
[]
[]
[]
[]
[]
[]
[]
[]
[]
[]
[]
[]
[]
[]
[]
[]
[]
[]
[]
[]
[]
[]
[]
[]
[]
[]
[]
[]
[]
[]
[]
[]
[]
[]
[]
[]
[]
[]
[]
[]
[]
[]
[]
[]
[]
[]
[]
[]
[]
[]
[]
[]
[]
[]
[]
[]
[]
[]
[]
[]
[]
[]
[]
[]
[]
[]
[]
[]
[]
[]
[]
[]
[]
[]
[]
[]
[]
[]
[]
[]
[]
[]
[]
[]
[]
[]
[]
[]
[]
[]
[]
[]
[]
[]
[]
[]
[]
[]
[]
[]
[]
[]
[]
[]
[]
[]
[]
[]
[]
[]
[]
[]
[]
[]
[]
[]
[]
[]
[]
[]
[]
[]
[]
[]
[]
[]
[]
[]
[]
[]
[]
[]
[]
[]
[]
[]
[]
[]
[]
[]
[]
[]
[]
[]
[]
[]
[]
[]
[]
[]
[]
[]
[]
[]
[]
[]
[]
[]
[]
[]
[]
[]
[]
[]
[]
[]
[]
[]
[]
[]
[]
[]
[]
[]
[]
[]
[]
[]
[]
[]
[]
[]
[]
[]
[]
[]
[]
[]
[]
[]
[]
[]
[]
[]
[]
[]
[]
[]
[]
[]
[]
[]
[]
[]
[]
[]
[]
[]
[]
[]
[]
[]
[]
[]
[]
[]
[]
[]
[]
[]
[]
[]
[]
[]
[]
[]
[]
[]
[]
[]
[]
[]
[]
[]
[]
[]
[]
[]
[]
[]
[]
[]
[]
[]
[]
[]
[]
[]
[]
[]
[]
[]
[]
[]
[]
[]
[]
[]
[]
[]
[]
[]
[]
[]
[]
[]
[]
[]
[]
[]
[]
[]
[]
[]
[]
[]
[]
[]
[]
[]
[]
[]
[]
[]
[]
[]
[]
[]
[]
[]
[]
[]
[]
[]
[]
[]
[]
[]
[]
[]
[]
[]
[]
[]
[]
[]
[]
[]
[]
[]
[]
[]
[]
[]
[]
[]
[]
[]
[]
[]
[]
[]
[]
[]
[]
[]
[]
[]
[]
[]
[]
[]
[]
[]
[]
[]
[]
[]
[]
[]
[]
[]
[]
[]
[]
[]
[]
[]
[]
[]
[]
[]
[]
[]
[]
[]
[]
[]
[]
[]
[]
[]
[]
[]
[]
[]
[]
[]
[]
[]
[]
[]
[]
[]
[]
[]
[]
[]
[]
[]
[]
[]
[]
[]
[]
[]
[]
[]
[]
[]
[]
[]
[]
[]
[]
[]
[]
[]
[]
[]
[]
[]
[]
[]
[]
[]
[]
[]
[]
[]
[]
[]
[]
[]
[]
[]
[]
[]
[]
[]
[]
[]
[]
[]
[]
[]
[]
[]
[]
[]
[]
[]
[]
[]
[]
[]
[]
[]
[]
[]
[]
[]
[]
[]
[]
[]
[]
[]
[]
[]
[]
[]
[]
[]
[]
[]
[]
[]
[]
[]
[]
[]
[]
[]
[]
[]
[]
[]
[]
[]
[]
[]
[]
[]
[]
[]
[]
[]
[]
[]
[]
[]
[]
[]
[]
[]
[]
[]
[]
[]
[]
[]
[]
[]
[]
[]
[]
[]
[]
[]
[]
[]
[]
[]
[]
[]
[]
[]
[]
[]
[]
[]
[]
[]
[]
[]
[]
[]
[]
[]
[]
[]
[]
[]
[]
[]
[]
[]
[]
[]
[]
[]
[]
[]
[]
[]
[]
[]
[]
[]
[]
[]
[]
[]
[]
[]
[]
[]
[]
[]
[]
[]
[]
[]
[]
[]
[]
[]
[]
[]
[]
[]
[]
[]
[]
[]
[]
[]
[]
[]
[]
[]
[]
[]
[]
[]
[]
[]
[]
[]
[]
[]
[]
[]
[]
[]
[]
[]
[]
[]
[]
[]
[]
[]
[]
[]
[]
[]
[]
[]
[]
[]
[]
[]
[]
[]
[]
[]
[]
[]
[]
[]
[]
[]
[]
[]
[]
[]
[]
[]
[]
[]
[]
[]
[]
[]
[]
[]
[]
[]
[]
[]
[]
[]
[]
[]
[]
[]
[]
[]
[]
[]
[]
[]
[]
[]
[]
[]
[]
[]
[]
[]
[]
[]
[]
[]
[]
[]
[]
[]
[]
[]
[]
[]
[]
[]
[]
[]
[]
[]
[]
[]
[]
[]
[]
[]
[]
[]
[]
[]
[]
[]
[]
[]
[]
[]
[]
[]
[]
[]
[]
[]
[]
[]
[]
[]
[]
[]
[]
[]
[]
[]
[]
[]
[]
[]
[]
[]
[]
[]
[]
[]
[]
[]
[]
[]
[]
[]
[]
[]
[]
[]
[]
[]
[]
[]
[]
[]
[]
[]
[]
[]
[]
[]
[]
[]
[]
[]
[]
[]
[]
[]
[]
[]
[]
[]
[]
[]
[]
[]
[]
[]
[]
[]
[]
[]
[]
[]
[]
[]
[]
[]
[]
[]
[]
[]
[]
[]
[]
[]
[]
[]
[]
[]
[]
[]
[]
[]
[]
[]
[]
[]
[]
[]
[]
[]
[]
[]
[]
[]
[]
[]
[]
[]
[]
[]
[]
[]
[]
[]
[]
[]
[]
[]
[]
[]
[]
[]
[]
[]
[]
[]
[]
[]
[]
[]
[]
[]
[]
[]
[]
[]
[]
[]
[]
[]
[]
[]
[]
[]
[]
[]
[]
[]
[]
[]
[]
[]
[]
[]
[]
[]
[]
[]
[]
[]
[]
[]
[]
[]
[]
[]
[]
[]
[]
[]
[]
[]
[]
[]
[]
[]
[]
[]
[]
[]
[]
[]
[]
[]
[]
[]
[]
[]
[]
[]
[]
[]
[]
[]
[]
[]
[]
[]
[]
[]
[]
[]
[]
[]
[]
[]
[]
[]
[]
[]
[]
[]
[]
[]
[]
[]
[]
[]
[]
[]
[]
[]
[]
[]
[]
[]
[]
[]
[]
[]
[]
[]
[]
[]
[]
[]
[]
[]
[]
[]
[]
[]
[]
[]
[]
[]
[]
[]
[]
[]
[]
[]
[]
[]
[]
[]
[]
[]
[]
[]
[]
[]
[]
[]
[]
[]
[]
[]
[]
[]
[]
[]
[]
[]
[]
[]
[]
[]
[]
[]
[]
[]
[]
[]
[]
[]
[]
[]
[]
[]
[]
[]
[]
[]
[]
[]
[]
[]
[]
[]
[]
[]
[]
[]
[]
[]
[]
[]
[]
[]
[]
[]
[]
[]
[]
[]
[]
[]
[]
[]
[]
[]
[]
[]
[]
[]
[]
[]
[]
[]
[]
[]
[]
[]
[]
[]
[]
[]
[]
[]
[]
[]
[]
[]
[]
[]
[]
[]
[]
[]
[]
[]
[]
[]
[]
[]
[]
[]
[]
[]
[]
[]
[]
[]
[]
[]
[]
[]
[]
[]
[]
[]
[]
[]
[]
[]
[]
[]
[]
[]
[]
[]
[]
[]
[]
[]
[]
[]
[]
[]
[]
[]
[]
[]
[]
[]
[]
[]
[]
[]
[]
[]
[]
[]
[]
[]
[]
[]
[]
[]
[]
[]
[]
[]
[]
[]
[]
[]
[]
[]
[]
[]
[]
[]
[]
[]
[]
[]
[]
[]
[]
[]
[]
[]
[]
[]
[]
[]
[]
[]
[]
[]
[]
[]
[]
[]
[]
[]
[]
[]
[]
[]
[]
[]
[]
[]
[]
[]
[]
[]
[]
[]
[]
[]
[]
[]
[]
[]
[]
[]
[]
[]
[]
[]
[]
[]
[]
[]
[]
[]
[]
[]
[]
[]
[]
[]
[]
[]
[]
[]
[]
[]
[]
[]
[]
[]
[]
[]
[]
[]
[]
[]
[]
[]
[]
[]
[]
[]
[]
[]
[]
[]
[]
[]
[]
[]
[]
[]
[]
[]
[]
[]
[]
[]
[]
[]
[]
[]
[]
[]
[]
[]
[]
[]
[]
[]
[]
[]
[]
[]
[]
[]
[]
[]
[]
[]
[]
[]
[]
[]
[]
[]
[]
[]
[]
[]
[]
[]
[]
[]
[]
[]
[]
[]
[]
[]
[]
[]
[]
[]
[]
[]
[]
[]
[]
[]
[]
[]
[]
[]
[]
[]
[]
[]
[]
[]
[]
[]
[]
[]
[]
[]
[]
[]
[]
[]
[]
[]
[]
[]
[]
[]
[]
[]
[]
[]
[]
[]
[]
[]
[]
[]
[]
[]
[]
[]
[]
[]
[]
[]
[]
[]
[]
[]
[]
[]
[]
[]
[]
[]
[]
[]
[]
[]
[]
[]
[]
[]
[]
[]
[]
[]
[]
[]
[]
[]
[]
[]
[]
[]
[]
[]
[]
[]
[]
[]
[]
[]
[]
[]
[]
[]
[]
[]
[]
[]
[]
[]
[]
[]
[]
[]
[]
[]
[]
[]
[]
[]
[]
[]
[]
[]
[]
[]
[]
[]
[]
[]
[]
[]
[]
[]
[]
[]
[]
[]
[]
[]
[]
[]
[]
[]
[]
[]
[]
[]
[]
[]
[]
[]
[]
[]
[]
[]
[]
[]
[]
[]
[]
[]
[]
[]
[]
[]
[]
[]
[]
[]
[]
[]
[]
[]
[]
[]
[]
[]
[]
[]
[]
[]
[]
[]
[]
[]
[]
[]
[]
[]
[]
[]
[]
[]
[]
[]
[]
[]
[]
[]
[]
[]
[]
[]
[]
[]
[]
[]
[]
[]
[]
[]
[]
[]
[]
[]
[]
[]
[]
[]
[]
[]
[]
[]
[]
[]
[]
[]
[]
[]
[]
[]
[]
[]
[]
[]
[]
[]
[]
[]
[]
[]
[]
[]
[]
[]
[]
[]
[]
[]
[]
[]
[]
[]
[]
[]
[]
[]
[]
[]
[]
[]
[]
[]
[]
[]
[]
[]
[]
[]
[]
[]
[]
[]
[]
[]
[]
[]
[]
[]
[]
[]
[]
[]
[]
[]
[]
[]
[]
[]
[]
[]
[]
[]
[]
[]
[]
[]
[]
[]
[]
[]
[]
[]
[]
[]
[]
[]
[]
[]
[]
[]
[]
[]
[]
[]
[]
[]
[]
[]
[]
[]
[]
[]
[]
[]
[]
[]
[]
[]
[]
[]
[]
[]
[]
[]
[]
[]
[]
[]
[]
[]
[]
[]
[]
[]
[]
[]
[]
[]
[]
[]
[]
[]
[]
[]
[]
[]
[]
[]
[]
[]
[]
[]
[]
[]
[]
[]
[]
[]
[]
[]
[]
[]
[]
[]
[]
[]
[]
[]
[]
[]
[]
[]
[]
[]
[]
[]
[]
[]
[]
[]
[]
[]
[]
[]
[]
[]
[]
[]
[]
[]
[]
[]
[]
[]
[]
[]
[]
[]
[]
[]
[]
[]
[]
[]
[]
[]
[]
[]
[]
[]
[]
[]
[]
[]
[]
[]
[]
[]
[]
[]
[]
[]
[]
[]
[]
[]
[]
[]
[]
[]
[]
[]
[]
[]
[]
[]
[]
[]
[]
[]
[]
[]
[]
[]
[]
[]
[]
[]
[]
[]
[]
[]
[]
[]
[]
[]
[]
[]
[]
[]
[]
[]
[]
[]
[]
[]
[]
[]
[]
[]
[]
[]
[]
[]
[]
[]
[]
[]
[]
[]
[]
[]
[]
[]
[]
[]
[]
[]
[]
[]
[]
[]
[]
[]
[]
[]
[]
[]
[]
[]
[]
[]
[]
[]
[]
[]
[]
[]
[]
[]
[]
[]
[]
[]
[]
[]
[]
[]
[]
[]
[]
[]
[]
[]
[]
[]
[]
[]
[]
[]
[]
[]
[]
[]
[]
[]
[]
[]
[]
[]
[]
[]
[]
[]
[]
[]
[]
[]
[]
[]
[]
[]
[]
[]
[]
[]
[]
[]
[]
[]
[]
[]
[]
[]
[]
[]
[]
[]
[]
[]
[]
[]
[]
[]
[]
[]
[]
[]
[]
[]
[]
[]
[]
[]
[]
[]
[]
[]
[]
[]
[]
[]
[]
[]
[]
[]
[]
[]
[]
[]
[]
[]
[]
[]
[]
[]
[]
[]
[]
[]
[]
[]
[]
[]
[]
[]
[]
[]
[]
[]
[]
[]
[]
[]
[]
[]
[]
[]
[]
[]
[]
[]
[]
[]
[]
[]
[]
[]
[]
[]
[]
[]
[]
[]
[]
[]
[]
[]
[]
[]
[]
[]
[]
[]
[]
[]
[]
[]
[]
[]
[]
[]
[]
[]
[]
[]
[]
[]
[]
[]
[]
[]
[]
[]
[]
[]
[]
[]
[]
[]
[]
[]
[]
[]
[]
[]
[]
[]
[]
[]
[]
[]
[]
[]
[]
[]
[]
[]
[]
[]
[]
[]
[]
[]
[]
[]
[]
[]
[]
[]
[]
[]
[]
[]
[]
[]
[]
[]
[]
[]
[]
[]
[]
[]
[]
[]
[]
[]
[]
[]
[]
[]
[]
[]
[]
[]
[]
[]
[]
[]
[]
[]
[]
[]
[]
[]
[]
[]
[]
[]
[]
[]
[]
[]
[]
[]
[]
[]
[]
[]
[]
[]
[]
[]
[]
[]
[]
[]
[]
[]
[]
[]
[]
[]
[]
[]
[]
[]
[]
[]
[]
[]
[]
[]
[]
[]
[]
[]
[]
[]
[]
[]
[]
[]
[]
[]
[]
[]
[]
[]
[]
[]
[]
[]
[]
[]
[]
[]
[]
[]
[]
[]
[]
[]
[]
[]
[]
[]
[]
[]
[]
[]
[]
[]
[]
[]
[]
[]
[]
[]
[]
[]
[]
[]
[]
[]
[]
[]
[]
[]
[]
[]
[]
[]
[]
[]
[]
[]
[]
[]
[]
[]
[]
[]
[]
[]
[]
[]
[]
[]
[]
[]
[]
[]
[]
[]
[]
[]
[]
[]
[]
[]
[]
[]
[]
[]
[]
[]
[]
[]
[]
[]
[]
[]
[]
[]
[]
[]
[]
[]
[]
[]
[]
[]
[]
[]
[]
[]
[]
[]
[]
[]
[]
[]
[]
[]
[]
[]
[]
[]
[]
[]
[]
[]
[]
[]
[]
[]
[]
[]
[]
[]
[]
[]
[]
[]
[]
[]
[]
[]
[]
[]
[]
[]
[]
[]
[]
[]
[]
[]
[]
[]
[]
[]
[]
[]
[]
[]
[]
[]
[]
[]
[]
[]
[]
[]
[]
[]
[]
[]
[]
[]
[]
[]
[]
[]
[]
[]
[]
[]
[]
[]
[]
[]
[]
[]
[]
[]
[]
[]
[]
[]
[]
[]
[]
[]
[]
[]
[]
[]
[]
[]
[]
[]
[]
[]
[]
[]
[]
[]
[]
[]
[]
[]
[]
[]
[]
[]
[]
[]
[]
[]
[]
[]
[]
[]
[]
[]
[]
[]
[]
[]
[]
[]
[]
[]
[]
[]
[]
[]
[]
[]
[]
[]
[]
[]
[]
[]
[]
[]
[]
[]
[]
[]
[]
[]
[]
[]
[]
[]
[]
[]
[]
[]
[]
[]
[]
[]
[]
[]
[]
[]
[]
[]
[]
[]
[]
[]
[]
[]
[]
[]
[]
[]
[]
[]
[]
[]
[]
[]
[]
[]
[]
[]
[]
[]
[]
[]
[]
[]
[]
[]
[]
[]
[]
[]
[]
[]
[]
[]
[]
[]
[]
[]
[]
[]
[]
[]
[]
[]
[]
[]
[]
[]
[]
[]
[]
[]
[]
[]
[]
[]
[]
[]
[]
[]
[]
[]
[]
[]
[]
[]
[]
[]
[]
[]
[]
[]
[]
[]
[]
[]
[]
[]
[]
[]
[]
[]
[]
[]
[]
[]
[]
[]
[]
[]
[]
[]
[]
[]
[]
[]
[]
[]
[]
[]
[]
[]
[]
[]
[]
[]
[]
[]
[]
[]
[]
[]
[]
[]
[]
[]
[]
[]
[]
[]
[]
[]
[]
[]
[]
[]
[]
[]
[]
[]
[]
[]
[]
[]
[]
[]
[]
[]
[]
[]
[]
[]
[]
[]
[]
[]
[]
[]
[]
[]
[]
[]
[]
[]
[]
[]
[]
[]
[]
[]
[]
[]
[]
[]
[]
[]
[]
[]
[]
[]
[]
[]
[]
[]
[]
[]
[]
[]
[]
[]
[]
[]
[]
[]
[]
[]
[]
[]
[]
[]
[]
[]
[]
[]
[]
[]
[]
[]
[]
[]
[]
[]
[]
[]
[]
[]
[]
[]
[]
[]
[]
[]
[]
[]
[]
[]
[]
[]
[]
[]
[]
[]
[]
[]
[]
[]
[]
[]
[]
[]
[]
[]
[]
[]
[]
[]
[]
[]
[]
[]
[]
[]
[]
[]
[]
[]
[]
[]
[]
[]
[]
[]
[]
[]
[]
[]
[]
[]
[]
[]
[]
[]
[]
[]
[]
[]
[]
[]
[]
[]
[]
[]
[]
[]
[]
[]
[]
[]
[]
[]
[]
[]
[]
[]
[]
[]
[]
[]
[]
[]
[]
[]
[]
[]
[]
[]
[]
[]
[]
[]
[]
[]
[]
[]
[]
[]
[]
[]
[]
[]
[]
[]
[]
[]
[]
[]
[]
[]
[]
[]
[]
[]
[]
[]
[]
[]
[]
[]
[]
[]
[]
[]
[]
[]
[]
[]
[]
[]
[]
[]
[]
[]
[]
[]
[]
[]
[]
[]
[]
[]
[]
[]
[]
[]
[]
[]
[]
[]
[]
[]
[]
[]
[]
[]
[]
[]
[]
[]
[]
[]
[]
[]
[]
[]
[]
[]
[]
[]
[]
[]
[]
[]
[]
[]
[]
[]
[]
[]
[]
[]
[]
[]
[]
[]
[]
[]
[]
[]
[]
[]
[]
[]
[]
[]
[]
[]
[]
[]
[]
[]
[]
[]
[]
[]
[]
[]
[]
[]
[]
[]
[]
[]
[]
[]
[]
[]
[]
[]
[]
[]
[]
[]
[]
[]
[]
[]
[]
[]
[]
[]
[]
[]
[]
[]
[]
[]
[]
[]
[]
[]
[]
[]
[]
[]
[]
[]
[]
[]
[]
[]
[]
[]
[]
[]
[]
[]
[]
[]
[]
[]
[]
[]
[]
[]
[]
[]
[]
[]
[]
[]
[]
[]
[]
[]
[]
[]
[]
[]
[]
[]
[]
[]
[]
[]
[]
[]
[]
[]
[]
[]
[]
[]
[]
[]
[]
[]
[]
[]
[]
[]
[]
[]
[]
[]
[]
[]
[]
[]
[]
[]
[]
[]
[]
[]
[]
[]
[]
[]
[]
[]
[]
[]
[]
[]
[]
[]
[]
[]
[]
[]
[]
[]
[]
[]
[]
[]
[]
[]
[]
[]
[]
[]
[]
[]
[]
[]
[]
[]
[]
[]
[]
[]
[]
[]
[]
[]
[]
[]
[]
[]
[]
[]
[]
[]
[]
[]
[]
[]
[]
[]
[]
[]
[]
[]
[]
[]
[]
[]
[]
[]
[]
[]
[]
[]
[]
[]
[]
[]
[]
[]
[]
[]
[]
[]
[]
[]
[]
[]
[]
[]
[]
[]
[]
[]
[]
[]
[]
[]
[]
[]
[]
[]
[]
[]
[]
[]
[]
[]
[]
[]
[]
[]
[]
[]
[]
[]
[]
[]
[]
[]
[]
[]
[]
[]
[]
[]
[]
[]
[]
[]
[]
[]
[]
[]
[]
[]
[]
[]
[]
[]
[]
[]
[]
[]
[]
[]
[]
[]
[]
[]
[]
[]
[]
[]
[]
[]
[]
[]
[]
[]
[]
[]
[]
[]
[]
[]
[]
[]
[]
[]
[]
[]
[]
[]
[]
[]
[]
[]
[]
[]
[]
[]
[]
[]
[]
[]
[]
[]
[]
[]
[]
[]
[]
[]
[]
[]
[]
[]
[]
[]
[]
[]
[]
[]
[]
[]
[]
[]
[]
[]
[]
[]
[]
[]
[]
[]
[]
[]
[]
[]
[]
[]
[]
[]
[]
[]
[]
[]
[]
[]
[]
[]
[]
[]
[]
[]
[]
[]
[]
[]
[]
[]
[]
[]
[]
[]
[]
[]
[]
[]
[]
[]
[]
[]
[]
[]
[]
[]
[]
[]
[]
[]
[]
[]
[]
[]
[]
[]
[]
[]
[]
[]
[]
[]
[]
[]
[]
[]
[]
[]
[]
[]
[]
[]
[]
[]
[]
[]
[]
[]
[]
[]
[]
[]
[]
[]
[]
[]
[]
[]
[]
[]
[]
[]
[]
[]
[]
[]
[]
[]
[]
[]
[]
[]
[]
[]
[]
[]
[]
[]
[]
[]
[]
[]
[]
[]
[]
[]
[]
[]
[]
[]
[]
[]
[]
[]
[]
[]
[]
[]
[]
[]
[]
[]
[]
[]
[]
[]
[]
[]
[]
[]
[]
[]
[]
[]
[]
[]
[]
[]
[]
[]
[]
[]
[]
[]
[]
[]
[]
[]
[]
[]
[]
[]
[]
[]
[]
[]
[]
[]
[]
[]
[]
[]
[]
[]
[]
[]
[]
[]
[]
[]
[]
[]
[]
[]
[]
[]
[]
[]
[]
[]
[]
[]
[]
[]
[]
[]
[]
[]
[]
[]
[]
[]
[]
[]
[]
[]
[]
[]
[]
[]
[]
[]
[]
[]
[]
[]
[]
[]
[]
[]
[]
[]
[]
[]
[]
[]
[]
[]
[]
[]
[]
[]
[]
[]
[]
[]
[]
[]
[]
[]
[]
[]
[]
[]
[]
[]
[]
[]
[]
[]
[]
[]
[]
[]
[]
[]
[]
[]
[]
[]
[]
[]
[]
[]
[]
[]
[]
[]
[]
[]
[]
[]
[]
[]
[]
[]
[]
[]
[]
[]
[]
[]
[]
[]
[]
[]
[]
[]
[]
[]
[]
[]
[]
[]
[]
[]
[]
[]
[]
[]
[]
[]
[]
[]
[]
[]
[]
[]
[]
[]
[]
[]
[]
[]
[]
[]
[]
[]
[]
[]
[]
[]
[]
[]
[]
[]
[]
[]
[]
[]
[]
[]
[]
[]
[]
[]
[]
[]
[]
[]
[]
[]
[]
[]
[]
[]
[]
[]
[]
[]
[]
[]
[]
[]
[]
[]
[]
[]
[]
[]
[]
[]
[]
[]
[]
[]
[]
[]
[]
[]
[]
[]
[]
[]
[]
[]
[]
[]
[]
[]
[]
[]
[]
[]
[]
[]
[]
[]
[]
[]
[]
[]
[]
[]
[]
[]
[]
[]
[]
[]
[]
[]
[]
[]
[]
[]
[]
[]
[]
[]
[]
[]
[]
[]
[]
[]
[]
[]
[]
[]
[]
[]
[]
[]
[]
[]
[]
[]
[]
[]
[]
[]
[]
[]
[]
[]
[]
[]
[]
[]
[]
[]
[]
[]
[]
[]
[]
[]
[]
[]
[]
[]
[]
[]
[]
[]
[]
[]
[]
[]
[]
[]
[]
[]
[]
[]
[]
[]
[]
[]
[]
[]
[]
[]
[]
[]
[]
[]
[]
[]
[]
[]
[]
[]
[]
[]
[]
[]
[]
[]
[]
[]
[]
[]
[]
[]
[]
[]
[]
[]
[]
[]
[]
[]
[]
[]
[]
[]
[]
[]
[]
[]
[]
[]
[]
[]
[]
[]
[]
[]
[]
[]
[]
[]
[]
[]
[]
[]
[]
[]
[]
[]
[]
[]
[]
[]
[]
[]
[]
[]
[]
[]
[]
[]
[]
[]
[]
[]
[]
[]
[]
[]
[]
[]
[]
[]
[]
[]
[]
[]
[]
[]
[]
[]
[]
[]
[]
[]
[]
[]
[]
[]
[]
[]
[]
[]
[]
[]
[]
[]
[]
[]
[]
[]
[]
[]
[]
[]
[]
[]
[]
[]
[]
[]
[]
[]
[]
[]
[]
[]
[]
[]
[]
[]
[]
[]
[]
[]
[]
[]
[]
[]
[]
[]
[]
[]
[]
[]
[]
[]
[]
[]
[]
[]
[]
[]
[]
[]
[]
[]
[]
[]
[]
[]
[]
[]
[]
[]
[]
[]
[]
[]
[]
[]
[]
[]
[]
[]
[]
[]
[]
[]
[]
[]
[]
[]
[]
[]
[]
[]
[]
[]
[]
[]
[]
[]
[]
[]
[]
[]
[]
[]
[]
[]
[]
[]
[]
[]
[]
[]
[]
[]
[]
[]
[]
[]
[]
[]
[]
[]
[]
[]
[]
[]
[]
[]
[]
[]
[]
[]
[]
[]
[]
[]
[]
[]
[]
[]
[]
[]
[]
[]
[]
[]
[]
[]
[]
[]
[]
[]
[]
[]
[]
[]
[]
[]
[]
[]
[]
[]
[]
[]
[]
[]
[]
[]
[]
[]
[]
[]
[]
[]
[]
[]
[]
[]
[]
[]
[]
[]
[]
[]
[]
[]
[]
[]
[]
[]
[]
[]
[]
[]
[]
[]
[]
[]
[]
[]
[]
[]
[]
[]
[]
[]
[]
[]
[]
[]
[]
[]
[]
[]
[]
[]
[]
[]
[]
[]
[]
[]
[]
[]
[]
[]
[]
[]
[]
[]
[]
[]
[]
[]
[]
[]
[]
[]
[]
[]
[]
[]
[]
[]
[]
[]
[]
[]
[]
[]
[]
[]
[]
[]
[]
[]
[]
[]
[]
[]
[]
[]
[]
[]
[]
[]
[]
[]
[]
[]
[]
[]
[]
[]
[]
[]
[]
[]
[]
[]
[]
[]
[]
[]
[]
[]
[]
[]
[]
[]
[]
[]
[]
[]
[]
[]
[]
[]
[]
[]
[]
[]
[]
[]
[]
[]
[]
[]
[]
[]
[]
[]
[]
[]
[]
[]
[]
[]
[]
[]
[]
[]
[]
[]
[]
[]
[]
[]
[]
[]
[]
[]
[]
[]
[]
[]
[]
[]
[]
[]
[]
[]
[]
[]
[]
[]
[]
[]
[]
[]
[]
[]
[]
[]
[]
[]
[]
[]
[]
[]
[]
[]
[]
[]
[]
[]
[]
[]
[]
[]
[]
[]
[]
[]
[]
[]
[]
[]
[]
[]
[]
[]
[]
[]
[]
[]
[]
[]
[]
[]
[]
[]
[]
[]
[]
[]
[]
[]
[]
[]
[]
[]
[]
[]
[]
[]
[]
[]
[]
[]
[]
[]
[]
[]
[]
[]
[]
[]
[]
[]
[]
[]
[]
[]
[]
[]
[]
[]
[]
[]
[]
[]
[]
[]
[]
[]
[]
[]
[]
[]
[]
[]
[]
[]
[]
[]
[]
[]
[]
[]
[]
[]
[]
[]
[]
[]
[]
[]
[]
[]
[]
[]
[]
[]
[]
[]
[]
[]
[]
[]
[]
[]
[]
[]
[]
[]
[]
[]
[]
[]
[]
[]
[]
[]
[]
[]
[]
[]
[]
[]
[]
[]
[]
[]
[]
[]
[]
[]
[]
[]
[]
[]
[]
[]
[]
[]
[]
[]
[]
[]
[]
[]
[]
[]
[]
[]
[]
[]
[]
[]
[]
[]
[]
[]
[]
[]
[]
[]
[]
[]
[]
[]
[]
[]
[]
[]
[]
[]
[]
[]
[]
[]
[]
[]
[]
[]
[]
[]
[]
[]
[]
[]
[]
[]
[]
[]
[]
[]
[]
[]
[]
[]
[]
[]
[]
[]
[]
[]
[]
[]
[]
[]
[]
[]
[]
[]
[]
[]
[]
[]
[]
[]
[]
[]
[]
[]
[]
[]
[]
[]
[]
[]
[]
[]
[]
[]
[]
[]
[]
[]
[]
[]
[]
[]
[]
[]
[]
[]
[]
[]
[]
[]
[]
[]
[]
[]
[]
[]
[]
[]
[]
[]
[]
[]
[]
[]
[]
[]
[]
[]
[]
[]
[]
[]
[]
[]
[]
[]
[]
[]
[]
[]
[]
[]
[]
[]
[]
[]
[]
[]
[]
[]
[]
[]
[]
[]
[]
[]
[]
[]
[]
[]
[]
[]
[]
[]
[]
[]
[]
[]
[]
[]
[]
[]
[]
[]
[]
[]
[]
[]
[]
[]
[]
[]
[]
[]
[]
[]
[]
[]
[]
[]
[]
[]
[]
[]
[]
[]
[]
[]
[]
[]
[]
[]
[]
[]
[]
[]
[]
[]
[]
[]
[]
[]
[]
[]
[]
[]
[]
[]
[]
[]
[]
[]
[]
[]
[]
[]
[]
[]
[]
[]
[]
[]
[]
[]
[]
[]
[]
[]
[]
[]
[]
[]
[]
[]
[]
[]
[]
[]
[]
[]
[]
[]
[]
[]
[]
[]
[]
[]
[]
[]
[]
[]
[]
[]
[]
[]
[]
[]
[]
[]
[]
[]
[]
[]
[]
[]
[]
[]
[]
[]
[]
[]
[]
[]
[]
[]
[]
[]
[]
[]
[]
[]
[]
[]
[]
[]
[]
[]
[]
[]
[]
[]
[]
[]
[]
[]
[]
[]
[]
[]
[]
[]
[]
[]
[]
[]
[]
[]
[]
[]
[]
[]
[]
[]
[]
[]
[]
[]
[]
[]
[]
[]
[]
[]
[]
[]
[]
[]
[]
[]
[]
[]
[]
[]
[]
[]
[]
[]
[]
[]
[]
[]
[]
[]
[]
[]
[]
[]
[]
[]
[]
[]
[]
[]
[]
[]
[]
[]
[]
[]
[]
[]
[]
[]
[]
[]
[]
[]
[]
[]
[]
[]
[]
[]
[]
[]
[]
[]
[]
[]
[]
[]
[]
[]
[]
[]
[]
[]
[]
[]
[]
[]
[]
[]
[]
[]
[]
[]
[]
[]
[]
[]
[]
[]
[]
[]
[]
[]
[]
[]
[]
[]
[]
[]
[]
[]
[]
[]
[]
[]
[]
[]
[]
[]
[]
[]
[]
[]
[]
[]
[]
[]
[]
[]
[]
[]
[]
[]
[]
[]
[]
[]
[]
[]
[]
[]
[]
[]
[]
[]
[]
[]
[]
[]
[]
[]
[]
[]
[]
[]
[]
[]
[]
[]
[]
[]
[]
[]
[]
[]
[]
[]
[]
[]
[]
[]
[]
[]
[]
[]
[]
[]
[]
[]
[]
[]
[]
[]
[]
[]
[]
[]
[]
[]
[]
[]
[]
[]
[]
[]
[]
[]
[]
[]
[]
[]
[]
[]
[]
[]
[]
[]
[]
[]
[]
[]
[]
[]
[]
[]
[]
[]
[]
[]
[]
[]
[]
[]
[]
[]
[]
[]
[]
[]
[]
[]
[]
[]
[]
[]
[]
[]
[]
[]
[]
[]
[]
[]
[]
[]
[]
[]
[]
[]
[]
[]
[]
[]
[]
[]
[]
[]
[]
[]
[]
[]
[]
[]
[]
[]
[]
[]
[]
[]
[]
[]
[]
[]
[]
[]
[]
[]
[]
[]
[]
[]
[]
[]
[]
[]
[]
[]
[]
[]
[]
[]
[]
[]
[]
[]
[]
[]
[]
[]
[]
[]
[]
[]
[]
[]
[]
[]
[]
[]
[]
[]
[]
[]
[]
[]
[]
[]
[]
[]
[]
[]
[]
[]
[]
[]
[]
[]
[]
[]
[]
[]
[]
[]
[]
[]
[]
[]
[]
[]
[]
[]
[]
[]
[]
[]
[]
[]
[]
[]
[]
[]
[]
[]
[]
[]
[]
[]
[]
[]
[]
[]
[]
[]
[]
[]
[]
[]
[]
[]
[]
[]
[]
[]
[]
[]
[]
[]
[]
[]
[]
[]
[]
[]
[]
[]
[]
[]
[]
[]
[]
[]
[]
[]
[]
[]
[]
[]
[]
[]
[]
[]
[]
[]
[]
[]
[]
[]
[]
[]
[]
[]
[]
[]
[]
[]
[]
[]
[]
[]
[]
[]
[]
[]
[]
[]
[]
[]
[]
[]
[]
[]
[]
[]
[]
[]
[]
[]
[]
[]
[]
[]
[]
[]
[]
[]
[]
[]
[]
[]
[]
[]
[]
[]
[]
[]
[]
[]
[]
[]
[]
[]
[]
[]
[]
[]
[]
[]
[]
[]
[]
[]
[]
[]
[]
[]
[]
[]
[]
[]
[]
[]
[]
[]
[]
[]
[]
[]
[]
[]
[]
[]
[]
[]
[]
[]
[]
[]
[]
[]
[]
[]
[]
[]
[]
[]
[]
[]
[]
[]
[]
[]
[]
[]
[]
[]
[]
[]
[]
[]
[]
[]
[]
[]
[]
[]
[]
[]
[]
[]
[]
[]
[]
[]
[]
[]
[]
[]
[]
[]
[]
[]
[]
[]
[]
[]
[]
[]
[]
[]
[]
[]
[]
[]
[]
[]
[]
[]
[]
[]
[]
[]
[]
[]
[]
[]
[]
[]
[]
[]
[]
[]
[]
[]
[]
[]
[]
[]
[]
[]
[]
[]
[]
[]
[]
[]
[]
[]
[]
[]
[]
[]
[]
[]
[]
[]
[]
[]
[]
[]
[]
[]
[]
[]
[]
[]
[]
[]
[]
[]
[]
[]
[]
[]
[]
[]
[]
[]
[]
[]
[]
[]
[]
[]
[]
[]
[]
[]
[]
[]
[]
[]
[]
[]
[]
[]
[]
[]
[]
[]
[]
[]
[]
[]
[]
[]
[]
[]
[]
[]
[]
[]
[]
[]
[]
[]
[]
[]
[]
[]
[]
[]
[]
[]
[]
[]
[]
[]
[]
[]
[]
[]
[]
[]
[]
[]
[]
[]
[]
[]
[]
[]
[]
[]
[]
[]
[]
[]
[]
[]
[]
[]
[]
[]
[]
[]
[]
[]
[]
[]
[]
[]
[]
[]
[]
[]
[]
[]
[]
[]
[]
[]
[]
[]
[]
[]
[]
[]
[]
[]
[]
[]
[]
[]
[]
[]
[]
[]
[]
[]
[]
[]
[]
[]
[]
[]
[]
[]
[]
[]
[]
[]
[]
[]
[]
[]
[]
[]
[]
[]
[]
[]
[]
[]
[]
[]
[]
[]
[]
[]
[]
[]
[]
[]
[]
[]
[]
[]
[]
[]
[]
[]
[]
[]
[]
[]
[]
[]
[]
[]
[]
[]
[]
[]
[]
[]
[]
[]
[]
[]
[]
[]
[]
[]
[]
[]
[]
[]
[]
[]
[]
[]
[]
[]
[]
[]
[]
[]
[]
[]
[]
[]
[]
[]
[]
[]
[]
[]
[]
[]
[]
[]
[]
[]
[]
[]
[]
[]
[]
[]
[]
[]
[]
[]
[]
[]
[]
[]
[]
[]
[]
[]
[]
[]
[]
[]
[]
[]
[]
[]
[]
[]
[]
[]
[]
[]
[]
[]
[]
[]
[]
[]
[]
[]
[]
[]
[]
[]
[]
[]
[]
[]
[]
[]
[]
[]
[]
[]
[]
[]
[]
[]
[]
[]
[]
[]
[]
[]
[]
[]
[]
[]
[]
[]
[]
[]
[]
[]
[]
[]
[]
[]
[]
[]
[]
[]
[]
[]
[]
[]
[]
[]
[]
[]
[]
[]
[]
[]
[]
[]
[]
[]
[]
[]
[]
[]
[]
[]
[]
[]
[]
[]
[]
[]
[]
[]
[]
[]
[]
[]
[]
[]
[]
[]
[]
[]
[]
[]
[]
[]
[]
[]
[]
[]
[]
[]
[]
[]
[]
[]
[]
[]
[]
[]
[]
[]
[]
[]
[]
[]
[]
[]
[]
[]
[]
[]
[]
[]
[]
[]
[]
[]
[]
[]
[]
[]
[]
[]
[]
[]
[]
[]
[]
[]
[]
[]
[]
[]
[]
[]
[]
[]
[]
[]
[]
[]
[]
[]
[]
[]
[]
[]
[]
[]
[]
[]
[]
[]
[]
[]
[]
[]
[]
[]
[]
[]
[]
[]
[]
[]
[]
[]
[]
[]
[]
[]
[]
[]
[]
[]
[]
[]
[]
[]
[]
[]
[]
[]
[]
[]
[]
[]
[]
[]
[]
[]
[]
[]
[]
[]
[]
[]
[]
[]
[]
[]
[]
[]
[]
[]
[]
[]
[]
[]
[]
[]
[]
[]
[]
[]
[]
[]
[]
[]
[]
[]
[]
[]
[]
[]
[]
[]
[]
[]
[]
[]
[]
[]
[]
[]
[]
[]
[]
[]
[]
[]
[]
[]
[]
[]
[]
[]
[]
[]
[]
[]
[]
[]
[]
[]
[]
[]
[]
[]
[]
[]
[]
[]
[]
[]
[]
[]
[]
[]
[]
[]
[]
[]
[]
[]
[]
[]
[]
[]
[]
[]
[]
[]
[]
[]
[]
[]
[]
[]
[]
[]
[]
[]
[]
[]
[]
[]
[]
[]
[]
[]
[]
[]
[]
[]
[]
[]
[]
[]
[]
[]
[]
[]
[]
[]
[]
[]
[]
[]
[]
[]
[]
[]
[]
[]
[]
[]
[]
[]
[]
[]
[]
[]
[]
[]
[]
[]
[]
[]
[]
[]
[]
[]
[]
[]
[]
[]
[]
[]
[]
[]
[]
[]
[]
[]
[]
[]
[]
[]
[]
[]
[]
[]
[]
[]
[]
[]
[]
[]
[]
[]
[]
[]
[]
[]
[]
[]
[]
[]
[]
[]
[]
[]
[]
[]
[]
[]
[]
[]
[]
[]
[]
[]
[]
[]
[]
[]
[]
[]
[]
[]
[]
[]
[]
[]
[]
[]
[]
[]
[]
[]
[]
[]
[]
[]
[]
[]
[]
[]
[]
[]
[]
[]
[]
[]
[]
[]
[]
[]
[]
[]
[]
[]
[]
[]
[]
[]
[]
[]
[]
[]
[]
[]
[]
[]
[]
[]
[]
[]
[]
[]
[]
[]
[]
[]
[]
[]
[]
[]
[]
[]
[]
[]
[]
[]
[]
[]
[]
[]
[]
[]
[]
[]
[]
[]
[]
[]
[]
[]
[]
[]
[]
[]
[]
[]
[]
[]
[]
[]
[]
[]
[]
[]
[]
[]
[]
[]
[]
[]
[]
[]
[]
[]
[]
[]
[]
[]
[]
[]
[]
[]
[]
[]
[]
[]
[]
[]
[]
[]
[]
[]
[]
[]
[]
[]
[]
[]
[]
[]
[]
[]
[]
[]
[]
[]
[]
[]
[]
[]
[]
[]
[]
[]
[]
[]
[]
[]
[]
[]
[]
[]
[]
[]
[]
[]
[]
[]
[]
[]
[]
[]
[]
[]
[]
[]
[]
[]
[]
[]
[]
[]
[]
[]
[]
[]
[]
[]
[]
[]
[]
[]
[]
[]
[]
[]
[]
[]
[]
[]
[]
[]
[]
[]
[]
[]
[]
[]
[]
[]
[]
[]
[]
[]
[]
[]
[]
[]
[]
[]
[]
[]
[]
[]
[]
[]
[]
[]
[]
[]
[]
[]
[]
[]
[]
[]
[]
[]
[]
[]
[]
[]
[]
[]
[]
[]
[]
[]
[]
[]
[]
[]
[]
[]
[]
[]
[]
[]
[]
[]
[]
[]
[]
[]
[]
[]
[]
[]
[]
[]
[]
[]
[]
[]
[]
[]
[]
[]
[]
[]
[]
[]
[]
[]
[]
[]
[]
[]
[]
[]
[]
[]
[]
[]
[]
[]
[]
[]
[]
[]
[]
[]
[]
[]
[]
[]
[]
[]
[]
[]
[]
[]
[]
[]
[]
[]
[]
[]
[]
[]
[]
[]
[]
[]
[]
[]
[]
[]
[]
[]
[]
[]
[]
[]
[]
[]
[]
[]
[]
[]
[]
[]
[]
[]
[]
[]
[]
[]
[]
[]
[]
[]
[]
[]
[]
[]
[]
[]
[]
[]
[]
[]
[]
[]
[]
[]
[]
[]
[]
[]
[]
[]
[]
[]
[]
[]
[]
[]
[]
[]
[]
[]
[]
[]
[]
[]
[]
[]
[]
[]
[]
[]
[]
[]
[]
[]
[]
[]
[]
[]
[]
[]
[]
[]
[]
[]
[]
[]
[]
[]
[]
[]
[]
[]
[]
[]
[]
[]
[]
[]
[]
[]
[]
[]
[]
[]
[]
[]
[]
[]
[]
[]
[]
[]
[]
[]
[]
[]
[]
[]
[]
[]
[]
[]
[]
[]
[]
[]
[]
[]
[]
[]
[]
[]
[]
[]
[]
[]
[]
[]
[]
[]
[]
[]
[]
[]
[]
[]
[]
[]
[]
[]
[]
[]
[]
[]
[]
[]
[]
[]
[]
[]
[]
[]
[]
[]
[]
[]
[]
[]
[]
[]
[]
[]
[]
[]
[]
[]
[]
[]
[]
[]
[]
[]
[]
[]
[]
[]
[]
[]
[]
[]
[]
[]
[]
[]
[]
[]
[]
[]
[]
[]
[]
[]
[]
[]
[]
[]
[]
[]
[]
[]
[]
[]
[]
[]
[]
[]
[]
[]
[]
[]
[]
[]
[]
[]
[]
[]
[]
[]
[]
[]
[]
[]
[]
[]
[]
[]
[]
[]
[]
[]
[]
[]
[]
[]
[]
[]
[]
[]
[]
[]
[]
[]
[]
[]
[]
[]
[]
[]
[]
[]
[]
[]
[]
[]
[]
[]
[]
[]
[]
[]
[]
[]
[]
[]
[]
[]
[]
[]
[]
[]
[]
[]
[]
[]
[]
[]
[]
[]
[]
[]
[]
[]
[]
[]
[]
[]
[]
[]
[]
[]
[]
[]
[]
[]
[]
[]
[]
[]
[]
[]
[]
[]
[]
[]
[]
[]
[]
[]
[]
[]
[]
[]
[]
[]
[]
[]
[]
[]
[]
[]
[]
[]
[]
[]
[]
[]
[]
[]
[]
[]
[]
[]
[]
[]
[]
[]
[]
[]
[]
[]
[]
[]
[]
[]
[]
[]
[]
[]
[]
[]
[]
[]
[]
[]
[]
[]
[]
[]
[]
[]
[]
[]
[]
[]
[]
[]
[]
[]
[]
[]
[]
[]
[]
[]
[]
[]
[]
[]
[]
[]
[]
[]
[]
[]
[]
[]
[]
[]
[]
[]
[]
[]
[]
[]
[]
[]
[]
[]
[]
[]
[]
[]
[]
[]
[]
[]
[]
[]
[]
[]
[]
[]
[]
[]
[]
[]
[]
[]
[]
[]
[]
[]
[]
[]
[]
[]
[]
[]
[]
[]
[]
[]
[]
[]
[]
[]
[]
[]
[]
[]
[]
[]
[]
[]
[]
[]
[]
[]
[]
[]
[]
[]
[]
[]
[]
[]
[]
[]
[]
[]
[]
[]
[]
[]
[]
[]
[]
[]
[]
[]
[]
[]
[]
[]
[]
[]
[]
[]
[]
[]
[]
[]
[]
[]
[]
[]
[]
[]
[]
[]
[]
[]
[]
[]
[]
[]
[]
[]
[]
[]
[]
[]
[]
[]
[]
[]
[]
[]
[]
[]
[]
[]
[]
[]
[]
[]
[]
[]
[]
[]
[]
[]
[]
[]
[]
[]
[]
[]
[]
[]
[]
[]
[]
[]
[]
[]
[]
[]
[]
[]
[]
[]
[]
[]
[]
[]
[]
[]
[]
[]
[]
[]
[]
[]
[]
[]
[]
[]
[]
[]
[]
[]
[]
[]
[]
[]
[]
[]
[]
[]
[]
[]
[]
[]
[]
[]
[]
[]
[]
[]
[]
[]
[]
[]
[]
[]
[]
[]
[]
[]
[]
[]
[]
[]
[]
[]
[]
[]
[]
[]
[]
[]
[]
[]
[]
[]
[]
[]
[]
[]
[]
[]
[]
[]
[]
[]
[]
[]
[]
[]
[]
[]
[]
[]
[]
[]
[]
[]
[]
[]
[]
[]
[]
[]
[]
[]
[]
[]
[]
[]
[]
[]
[]
[]
[]
[]
[]
[]
[]
[]
[]
[]
[]
[]
[]
[]
[]
[]
[]
[]
[]
[]
[]
[]
[]
[]
[]
[]
[]
[]
[]
[]
[]
[]
[]
[]
[]
[]
[]
[]
[]
[]
[]
[]
[]
[]
[]
[]
[]
[]
[]
[]
[]
[]
[]
[]
[]
[]
[]
[]
[]
[]
[]
[]
[]
[]
[]
[]
[]
[]
[]
[]
[]
[]
[]
[]
[]
[]
[]
[]
[]
[]
[]
[]
[]
[]
[]
[]
[]
[]
[]
[]
[]
[]
[]
[]
[]
[]
[]
[]
[]
[]
[]
[]
[]
[]
[]
[]
[]
[]
[]
[]
[]
[]
[]
[]
[]
[]
[]
[]
[]
[]
[]
[]
[]
[]
[]
[]
[]
[]
[]
[]
[]
[]
[]
[]
[]
[]
[]
[]
[]
[]
[]
[]
[]
[]
[]
[]
[]
[]
[]
[]
[]
[]
[]
[]
[]
[]
[]
[]
[]
[]
[]
[]
[]
[]
[]
[]
[]
[]
[]
[]
[]
[]
[]
[]
[]
[]
[]
[]
[]
[]
[]
[]
[]
[]
[]
[]
[]
[]
[]
[]
[]
[]
[]
[]
[]
[]
[]
[]
[]
[]
[]
[]
[]
[]
[]
[]
[]
[]
[]
[]
[]
[]
[]
[]
[]
[]
[]
[]
[]
[]
[]
[]
[]
[]
[]
[]
[]
[]
[]
[]
[]
[]
[]
[]
[]
[]
[]
[]
[]
[]
[]
[]
[]
[]
[]
[]
[]
[]
[]
[]
[]
[]
[]
[]
[]
[]
[]
[]
[]
[]
[]
[]
[]
[]
[]
[]
[]
[]
[]
[]
[]
[]
[]
[]
[]
[]
[]
[]
[]
[]
[]
[]
[]
[]
[]
[]
[]
[]
[]
[]
[]
[]
[]
[]
[]
[]
[]
[]
[]
[]
[]
[]
[]
[]
[]
[]
[]
[]
[]
[]
[]
[]
[]
[]
[]
[]
[]
[]
[]
[]
[]
[]
[]
[]
[]
[]
[]
[]
[]
[]
[]
[]
[]
[]
[]
[]
[]
[]
[]
[]
[]
[]
[]
[]
[]
[]
[]
[]
[]
[]
[]
[]
[]
[]
[]
[]
[]
[]
[]
[]
[]
[]
[]
[]
[]
[]
[]
[]
[]
[]
[]
[]
[]
[]
[]
[]
[]
[]
[]
[]
[]
[]
[]
[]
[]
[]
[]
[]
[]
[]
[]
[]
[]
[]
[]
[]
[]
[]
[]
[]
[]
[]
[]
[]
[]
[]
[]
[]
[]
[]
[]
[]
[]
[]
[]
[]
[]
[]
[]
[]
[]
[]
[]
[]
[]
[]
[]
[]
[]
[]
[]
[]
[]
[]
[]
[]
[]
[]
[]
[]
[]
[]
[]
[]
[]
[]
[]
[]
[]
[]
[]
[]
[]
[]
[]
[]
[]
[]
[]
[]
[]
[]
[]
[]
[]
[]
[]
[]
[]
[]
[]
[]
[]
[]
[]
[]
[]
[]
[]
[]
[]
[]
[]
[]
[]
[]
[]
[]
[]
[]
[]
[]
[]
[]
[]
[]
[]
[]
[]
[]
[]
[]
[]
[]
[]
[]
[]
[]
[]
[]
[]
[]
[]
[]
[]
[]
[]
[]
[]
[]
[]
[]
[]
[]
[]
[]
[]
[]
[]
[]
[]
[]
[]
[]
[]
[]
[]
[]
[]
[]
[]
[]
[]
[]
[]
[]
[]
[]
[]
[]
[]
[]
[]
[]
[]
[]
[]
[]
[]
[]
[]
[]
[]
[]
[]
[]
[]
[]
[]
[]
[]
[]
[]
[]
[]
[]
[]
[]
[]
[]
[]
[]
[]
[]
[]
[]
[]
[]
[]
[]
[]
[]
[]
[]
[]
[]
[]
[]
[]
[]
[]
[]
[]
[]
[]
[]
[]
[]
[]
[]
[]
[]
[]
[]
[]
[]
[]
[]
[]
[]
[]
[]
[]
[]
[]
[]
[]
[]
[]
[]
[]
[]
[]
[]
[]
[]
[]
[]
[]
[]
[]
[]
[]
[]
[]
[]
[]
[]
[]
[]
[]
[]
[]
[]
[]
[]
[]
[]
[]
[]
[]
[]
[]
[]
[]
[]
[]
[]
[]
[]
[]
[]
[]
[]
[]
[]
[]
[]
[]
[]
[]
[]
[]
[]
[]
[]
[]
[]
[]
[]
[]
[]
[]
[]
[]
[]
[]
[]
[]
[]
[]
[]
[]
[]
[]
[]
[]
[]
[]
[]
[]
[]
[]
[]
[]
[]
[]
[]
[]
[]
[]
[]
[]
[]
[]
[]
[]
[]
[]
[]
[]
[]
[]
[]
[]
[]
[]
[]
[]
[]
[]
[]
[]
[]
[]
[]
[]
[]
[]
[]
[]
[]
[]
[]
[]
[]
[]
[]
[]
[]
[]
[]
[]
[]
[]
[]
[]
[]
[]
[]
[]
[]
[]
[]
[]
[]
[]
[]
[]
[]
[]
[]
[]
[]
[]
[]
[]
[]
[]
[]
[]
[]
[]
[]
[]
[]
[]
[]
[]
[]
[]
[]
[]
[]
[]
[]
[]
[]
[]
[]
[]
[]
[]
[]
[]
[]
[]
[]
[]
[]
[]
[]
[]
[]
[]
[]
[]
[]
[]
[]
[]
[]
[]
[]
[]
[]
[]
[]
[]
[]
[]
[]
[]
[]
[]
[]
[]
[]
[]
[]
[]
[]
[]
[]
[]
[]
[]
[]
[]
[]
[]
[]
[]
[]
[]
[]
[]
[]
[]
[]
[]
[]
[]
[]
[]
[]
[]
[]
[]
[]
[]
[]
[]
[]
[]
[]
[]
[]
[]
[]
[]
[]
[]
[]
[]
[]
[]
[]
[]
[]
[]
[]
[]
[]
[]
[]
[]
[]
[]
[]
[]
[]
[]
[]
[]
[]
[]
[]
[]
[]
[]
[]
[]
[]
[]
[]
[]
[]
[]
[]
[]
[]
[]
[]
[]
[]
[]
[]
[]
[]
[]
[]
[]
[]
[]
[]
[]
[]
[]
[]
[]
[]
[]
[]
[]
[]
[]
[]
[]
[]
[]
[]
[]
[]
[]
[]
[]
[]
[]
[]
[]
[]
[]
[]
[]
[]
[]
[]
[]
[]
[]
[]
[]
[]
[]
[]
[]
[]
[]
[]
[]
[]
[]
[]
[]
[]
[]
[]
[]
[]
[]
[]
[]
[]
[]
[]
[]
[]
[]
[]
[]
[]
[]
[]
[]
[]
[]
[]
[]
[]
[]
[]
[]
[]
[]
[]
[]
[]
[]
[]
[]
[]
[]
[]
[]
[]
[]
[]
[]
[]
[]
[]
[]
[]
[]
[]
[]
[]
[]
[]
[]
[]
[]
[]
[]
[]
[]
[]
[]
[]
[]
[]
[]
[]
[]
[]
[]
[]
[]
[]
[]
[]
[]
[]
[]
[]
[]
[]
[]
[]
[]
[]
[]
[]
[]
[]
[]
[]
[]
[]
[]
[]
[]
[]
[]
[]
[]
[]
[]
[]
[]
[]
[]
[]
[]
[]
[]
[]
[]
[]
[]
[]
[]
[]
[]
[]
[]
[]
[]
[]
[]
[]
[]
[]
[]
[]
[]
[]
[]
[]
[]
[]
[]
[]
[]
[]
[]
[]
[]
[]
[]
[]
[]
[]
[]
[]
[]
[]
[]
[]
[]
[]
[]
[]
[]
[]
[]
[]
[]
[]
[]
[]
[]
[]
[]
[]
[]
[]
[]
[]
[]
[]
[]
[]
[]
[]
[]
[]
[]
[]
[]
[]
[]
[]
[]
[]
[]
[]
[]
[]
[]
[]
[]
[]
[]
[]
[]
[]
[]
[]
[]
[]
[]
[]
[]
[]
[]
[]
[]
[]
[]
[]
[]
[]
[]
[]
[]
[]
[]
[]
[]
[]
[]
[]
[]
[]
[]
[]
[]
[]
[]
[]
[]
[]
[]
[]
[]
[]
[]
[]
[]
[]
[]
[]
[]
[]
[]
[]
[]
[]
[]
[]
[]
[]
[]
[]
[]
[]
[]
[]
[]
[]
[]
[]
[]
[]
[]
[]
[]
[]
[]
[]
[]
[]
[]
[]
[]
[]
[]
[]
[]
[]
[]
[]
[]
[]
[]
[]
[]
[]
[]
[]
[]
[]
[]
[]
[]
[]
[]
[]
[]
[]
[]
[]
[]
[]
[]
[]
[]
[]
[]
[]
[]
[]
[]
[]
[]
[]
[]
[]
[]
[]
[]
[]
[]
[]
[]
[]
[]
[]
[]
[]
[]
[]
[]
[]
[]
[]
[]
[]
[]
[]
[]
[]
[]
[]
[]
[]
[]
[]
[]
[]
[]
[]
[]
[]
[]
[]
[]
[]
[]
[]
[]
[]
[]
[]
[]
[]
[]
[]
[]
[]
[]
[]
[]
[]
[]
[]
[]
[]
[]
[]
[]
[]
[]
[]
[]
[]
[]
[]
[]
[]
[]
[]
[]
[]
[]
[]
[]
[]
[]
[]
[]
[]
[]
[]
[]
[]
[]
[]
[]
[]
[]
[]
[]
[]
[]
[]
[]
[]
[]
[]
[]
[]
[]
[]
[]
[]
[]
[]
[]
[]
[]
[]
[]
[]
[]
[]
[]
[]
[]
[]
[]
[]
[]
[]
[]
[]
[]
[]
[]
[]
[]
[]
[]
[]
[]
[]
[]
[]
[]
[]
[]
[]
[]
[]
[]
[]
[]
[]
[]
[]
[]
[]
[]
[]
[]
[]
[]
[]
[]
[]
[]
[]
[]
[]
[]
[]
[]
[]
[]
[]
[]
[]
[]
[]
[]
[]
[]
[]
[]
[]
[]
[]
[]
[]
[]
[]
[]
[]
[]
[]
[]
[]
[]
[]
[]
[]
[]
[]
[]
[]
[]
[]
[]
[]
[]
[]
[]
[]
[]
[]
[]
[]
[]
[]
[]
[]
[]
[]
[]
[]
[]
[]
[]
[]
[]
[]
[]
[]
[]
[]
[]
[]
[]
[]
[]
[]
[]
[]
[]
[]
[]
[]
[]
[]
[]
[]
[]
[]
[]
[]
[]
[]
[]
[]
[]
[]
[]
[]
[]
[]
[]
[]
[]
[]
[]
[]
[]
[]
[]
[]
[]
[]
[]
[]
[]
[]
[]
[]
[]
[]
[]
[]
[]
[]
[]
[]
[]
[]
[]
[]
[]
[]
[]
[]
[]
[]
[]
[]
[]
[]
[]
[]
[]
[]
[]
[]
[]
[]
[]
[]
[]
[]
[]
[]
[]
[]
[]
[]
[]
[]
[]
[]
[]
[]
[]
[]
[]
[]
[]
[]
[]
[]
[]
[]
[]
[]
[]
[]
[]
[]
[]
[]
[]
[]
[]
[]
[]
[]
[]
[]
[]
[]
[]
[]
[]
[]
[]
[]
[]
[]
[]
[]
[]
[]
[]
[]
[]
[]
[]
[]
[]
[]
[]
[]
[]
[]
[]
[]
[]
[]
[]
[]
[]
[]
[]
[]
[]
[]
[]
[]
[]
[]
[]
[]
[]
[]
[]
[]
[]
[]
[]
[]
[]
[]
[]
[]
[]
[]
[]
[]
[]
[]
[]
[]
[]
[]
[]
[]
[]
[]
[]
[]
[]
[]
[]
[]
[]
[]
[]
[]
[]
[]
[]
[]
[]
[]
[]
[]
[]
[]
[]
[]
[]
[]
[]
[]
[]
[]
[]
[]
[]
[]
[]
[]
[]
[]
[]
[]
[]
[]
[]
[]
[]
[]
[]
[]
[]
[]
[]
[]
[]
[]
[]
[]
[]
[]
[]
[]
[]
[]
[]
[]
[]
[]
[]
[]
[]
[]
[]
[]
[]
[]
[]
[]
[]
[]
[]
[]
[]
[]
[]
[]
[]
[]
[]
[]
[]
[]
[]
[]
[]
[]
[]
[]
[]
[]
[]
[]
[]
[]
[]
[]
[]
[]
[]
[]
[]
[]
[]
[]
[]
[]
[]
[]
[]
[]
[]
[]
[]
[]
[]
[]
[]
[]
[]
[]
[]
[]
[]
[]
[]
[]
[]
[]
[]
[]
[]
[]
[]
[]
[]
[]
[]
[]
[]
[]
[]
[]
[]
[]
[]
[]
[]
[]
[]
[]
[]
[]
[]
[]
[]
[]
[]
[]
[]
[]
[]
[]
[]
[]
[]
[]
[]
[]
[]
[]
[]
[]
[]
[]
[]
[]
[]
[]
[]
[]
[]
[]
[]
[]
[]
[]
[]
[]
[]
[]
[]
[]
[]
[]
[]
[]
[]
[]
[]
[]
[]
[]
[]
[]
[]
[]
[]
[]
[]
[]
[]
[]
[]
[]
[]
[]
[]
[]
[]
[]
[]
[]
[]
[]
[]
[]
[]
[]
[]
[]
[]
[]
[]
[]
[]
[]
[]
[]
[]
[]
[]
[]
[]
[]
[]
[]
[]
[]
[]
[]
[]
[]
[]
[]
[]
[]
[]
[]
[]
[]
[]
[]
[]
[]
[]
[]
[]
[]
[]
[]
[]
[]
[]
[]
[]
[]
[]
[]
[]
[]
[]
[]
[]
[]
[]
[]
[]
[]
[]
[]
[]
[]
[]
[]
[]
[]
[]
[]
[]
[]
[]
[]
[]
[]
[]
[]
[]
[]
[]
[]
[]
[]
[]
[]
[]
[]
[]
[]
[]
[]
[]
[]
[]
[]
[]
[]
[]
[]
[]
[]
[]
[]
[]
[]
[]
[]
[]
[]
[]
[]
[]
[]
[]
[]
[]
[]
[]
[]
[]
[]
[]
[]
[]
[]
[]
[]
[]
[]
[]
[]
[]
[]
[]
[]
[]
[]
[]
[]
[]
[]
[]
[]
[]
[]
[]
[]
[]
[]
[]
[]
[]
[]
[]
[]
[]
[]
[]
[]
[]
[]
[]
[]
[]
[]
[]
[]
[]
[]
[]
[]
[]
[]
[]
[]
[]
[]
[]
[]
[]
[]
[]
[]
[]
[]
[]
[]
[]
[]
[]
[]
[]
[]
[]
[]
[]
[]
[]
[]
[]
[]
[]
[]
[]
[]
[]
[]
[]
[]
[]
[]
[]
[]
[]
[]
[]
[]
[]
[]
[]
[]
[]
[]
[]
[]
[]
[]
[]
[]
[]
[]
[]
[]
[]
[]
[]
[]
[]
[]
[]
[]
[]
[]
[]
[]
[]
[]
[]
[]
[]
[]
[]
[]
[]
[]
[]
[]
[]
[]
[]
[]
[]
[]
[]
[]
[]
[]
[]
[]
[]
[]
[]
[]
[]
[]
[]
[]
[]
[]
[]
[]
[]
[]
[]
[]
[]
[]
[]
[]
[]
[]
[]
[]
[]
[]
[]
[]
[]
[]
[]
[]
[]
[]
[]
[]
[]
[]
[]
[]
[]
[]
[]
[]
[]
[]
[]
[]
[]
[]
[]
[]
[]
[]
[]
[]
[]
[]
[]
[]
[]
[]
[]
[]
[]
[]
[]
[]
[]
[]
[]
[]
[]
[]
[]
[]
[]
[]
[]
[]
[]
[]
[]
[]
[]
[]
[]
[]
[]
[]
[]
[]
[]
[]
[]
[]
[]
[]
[]
[]
[]
[]
[]
[]
[]
[]
[]
[]
[]
[]
[]
[]
[]
[]
[]
[]
[]
[]
[]
[]
[]
[]
[]
[]
[]
[]
[]
[]
[]
[]
[]
[]
[]
[]
[]
[]
[]
[]
[]
[]
[]
[]
[]
[]
[]
[]
[]
[]
[]
[]
[]
[]
[]
[]
[]
[]
[]
[]
[]
[]
[]
[]
[]
[]
[]
[]
[]
[]
[]
[]
[]
[]
[]
[]
[]
[]
[]
[]
[]
[]
[]
[]
[]
[]
[]
[]
[]
[]
[]
[]
[]
[]
[]
[]
[]
[]
[]
[]
[]
[]
[]
[]
[]
[]
[]
[]
[]
[]
[]
[]
[]
[]
[]
[]
[]
[]
[]
[]
[]
[]
[]
[]
[]
[]
[]
[]
[]
[]
[]
[]
[]
[]
[]
[]
[]
[]
[]
[]
[]
[]
[]
[]
[]
[]
[]
[]
[]
[]
[]
[]
[]
[]
[]
[]
[]
[]
[]
[]
[]
[]
[]
[]
[]
[]
[]
[]
[]
[]
[]
[]
[]
[]
[]
[]
[]
[]
[]
[]
[]
[]
[]
[]
[]
[]
[]
[]
[]
[]
[]
[]
[]
[]
[]
[]
[]
[]
[]
[]
[]
[]
[]
[]
[]
[]
[]
[]
[]
[]
[]
[]
[]
[]
[]
[]
[]
[]
[]
[]
[]
[]
[]
[]
[]
[]
[]
[]
[]
[]
[]
[]
[]
[]
[]
[]
[]
[]
[]
[]
[]
[]
[]
[]
[]
[]
[]
[]
[]
[]
[]
[]
[]
[]
[]
[]
[]
[]
[]
[]
[]
[]
[]
[]
[]
[]
[]
[]
[]
[]
[]
[]
[]
[]
[]
[]
[]
[]
[]
[]
[]
[]
[]
[]
[]
[]
[]
[]
[]
[]
[]
[]
[]
[]
[]
[]
[]
[]
[]
[]
[]
[]
[]
[]
[]
[]
[]
[]
[]
[]
[]
[]
[]
[]
[]
[]
[]
[]
[]
[]
[]
[]
[]
[]
[]
[]
[]
[]
[]
[]
[]
[]
[]
[]
[]
[]
[]
[]
[]
[]
[]
[]
[]
[]
[]
[]
[]
[]
[]
[]
[]
[]
[]
[]
[]
[]
[]
[]
[]
[]
[]
[]
[]
[]
[]
[]
[]
[]
[]
[]
[]
[]
[]
[]
[]
[]
[]
[]
[]
[]
[]
[]
[]
[]
[]
[]
[]
[]
[]
[]
[]
[]
[]
[]
[]
[]
[]
[]
[]
[]
[]
[]
[]
[]
[]
[]
[]
[]
[]
[]
[]
[]
[]
[]
[]
[]
[]
[]
[]
[]
[]
[]
[]
[]
[]
[]
[]
[]
[]
[]
[]
[]
[]
[]
[]
[]
[]
[]
[]
[]
[]
[]
[]
[]
[]
[]
[]
[]
[]
[]
[]
[]
[]
[]
[]
[]
[]
[]
[]
[]
[]
[]
[]
[]
[]
[]
[]
[]
[]
[]
[]
[]
[]
[]
[]
[]
[]
[]
[]
[]
[]
[]
[]
[]
[]
[]
[]
[]
[]
[]
[]
[]
[]
[]
[]
[]
[]
[]
[]
[]
[]
[]
[]
[]
[]
[]
[]
[]
[]
[]
[]
[]
[]
[]
[]
[]
[]
[]
[]
[]
[]
[]
[]
[]
[]
[]
[]
[]
[]
[]
[]
[]
[]
[]
[]
[]
[]
[]
[]
[]
[]
[]
[]
[]
[]
[]
[]
[]
[]
[]
[]
[]
[]
[]
[]
[]
[]
[]
[]
[]
[]
[]
[]
[]
[]
[]
[]
[]
[]
[]
[]
[]
[]
[]
[]
[]
[]
[]
[]
[]
[]
[]
[]
[]
[]
[]
[]
[]
[]
[]
[]
[]
[]
[]
[]
[]
[]
[]
[]
[]
[]
[]
[]
[]
[]
[]
[]
[]
[]
[]
[]
[]
[]
[]
[]
[]
[]
[]
[]
[]
[]
[]
[]
[]
[]
[]
[]
[]
[]
[]
[]
[]
[]
[]
[]
[]
[]
[]
[]
[]
[]
[]
[]
[]
[]
[]
[]
[]
[]
[]
[]
[]
[]
[]
[]
[]
[]
[]
[]
[]
[]
[]
[]
[]
[]
[]
[]
[]
[]
[]
[]
[]
[]
[]
[]
[]
[]
[]
[]
[]
[]
[]
[]
[]
[]
[]
[]
[]
[]
[]
[]
[]
[]
[]
[]
[]
[]
[]
[]
[]
[]
[]
[]
[]
[]
[]
[]
[]
[]
[]
[]
[]
[]
[]
[]
[]
[]
[]
[]
[]
[]
[]
[]
[]
[]
[]
[]
[]
[]
[]
[]
[]
[]
[]
[]
[]
[]
[]
[]
[]
[]
[]
[]
[]
[]
[]
[]
[]
[]
[]
[]
[]
[]
[]
[]
[]
[]
[]
[]
[]
[]
[]
[]
[]
[]
[]
[]
[]
[]
[]
[]
[]
[]
[]
[]
[]
[]
[]
[]
[]
[]
[]
[]
[]
[]
[]
[]
[]
[]
[]
[]
[]
[]
[]
[]
[]
[]
[]
[]
[]
[]
[]
[]
[]
[]
[]
[]
[]
[]
[]
[]
[]
[]
[]
[]
[]
[]
[]
[]
[]
[]
[]
[]
[]
[]
[]
[]
[]
[]
[]
[]
[]
[]
[]
[]
[]
[]
[]
[]
[]
[]
[]
[]
[]
[]
[]
[]
[]
[]
[]
[]
[]
[]
[]
[]
[]
[]
[]
[]
[]
[]
[]
[]
[]
[]
[]
[]
[]
[]
[]
[]
[]
[]
[]
[]
[]
[]
[]
[]
[]
[]
[]
[]
[]
[]
[]
[]
[]
[]
[]
[]
[]
[]
[]
[]
[]
[]
[]
[]
[]
[]
[]
[]
[]
[]
[]
[]
[]
[]
[]
[]
[]
[]
[]
[]
[]
[]
[]
[]
[]
[]
[]
[]
[]
[]
[]
[]
[]
[]
[]
[]
[]
[]
[]
[]
[]
[]
[]
[]
[]
[]
[]
[]
[]
[]
[]
[]
[]
[]
[]
[]
[]
[]
[]
[]
[]
[]
[]
[]
[]
[]
[]
[]
[]
[]
[]
[]
[]
[]
[]
[]
[]
[]
[]
[]
[]
[]
[]
[]
[]
[]
[]
[]
[]
[]
[]
[]
[]
[]
[]
[]
[]
[]
[]
[]
[]
[]
[]
[]
[]
[]
[]
[]
[]
[]
[]
[]
[]
[]
[]
[]
[]
[]
[]
[]
[]
[]
[]
[]
[]
[]
[]
[]
[]
[]
[]
[]
[]
[]
[]
[]
[]
[]
[]
[]
[]
[]
[]
[]
[]
[]
[]
[]
[]
[]
[]
[]
[]
[]
[]
[]
[]
[]
[]
[]
[]
[]
[]
[]
[]
[]
[]
[]
[]
[]
[]
[]
[]
[]
[]
[]
[]
[]
[]
[]
[]
[]
[]
[]
[]
[]
[]
[]
[]
[]
[]
[]
[]
[]
[]
[]
[]
[]
[]
[]
[]
[]
[]
[]
[]
[]
[]
[]
[]
[]
[]
[]
[]
[]
[]
[]
[]
[]
[]
[]
[]
[]
[]
[]
[]
[]
[]
[]
[]
[]
[]
[]
[]
[]
[]
[]
[]
[]
[]
[]
[]
[]
[]
[]
[]
[]
[]
[]
[]
[]
[]
[]
[]
[]
[]
[]
[]
[]
[]
[]
[]
[]
[]
[]
[]
[]
[]
[]
[]
[]
[]
[]
[]
[]
[]
[]
[]
[]
[]
[]
[]
[]
[]
[]
[]
[]
[]
[]
[]
[]
[]
[]
[]
[]
[]
[]
[]
[]
[]
[]
[]
[]
[]
[]
[]
[]
[]
[]
[]
[]
[]
[]
[]
[]
[]
[]
[]
[]
[]
[]
[]
[]
[]
[]
[]
[]
[]
[]
[]
[]
[]
[]
[]
[]
[]
[]
[]
[]
[]
[]
[]
[]
[]
[]
[]
[]
[]
[]
[]
[]
[]
[]
[]
[]
[]
[]
[]
[]
[]
[]
[]
[]
[]
[]
[]
[]
[]
[]
[]
[]
[]
[]
[]
[]
[]
[]
[]
[]
[]
[]
[]
[]
[]
[]
[]
[]
[]
[]
[]
[]
[]
[]
[]
[]
[]
[]
[]
[]
[]
[]
[]
[]
[]
[]
[]
[]
[]
[]
[]
[]
[]
[]
[]
[]
[]
[]
[]
[]
[]
[]
[]
[]
[]
[]
[]
[]
[]
[]
[]
[]
[]
[]
[]
[]
[]
[]
[]
[]
[]
[]
[]
[]
[]
[]
[]
[]
[]
[]
[]
[]
[]
[]
[]
[]
[]
[]
[]
[]
[]
[]
[]
[]
[]
[]
[]
[]
[]
[]
[]
[]
[]
[]
[]
[]
[]
[]
[]
[]
[]
[]
[]
[]
[]
[]
[]
[]
[]
[]
[]
[]
[]
[]
[]
[]
[]
[]
[]
[]
[]
[]
[]
[]
[]
[]
[]
[]
[]
[]
[]
[]
[]
[]
[]
[]
[]
[]
[]
[]
[]
[]
[]
[]
[]
[]
[]
[]
[]
[]
[]
[]
[]
[]
[]
[]
[]
[]
[]
[]
[]
[]
[]
[]
[]
[]
[]
[]
[]
[]
[]
[]
[]
[]
[]
[]
[]
[]
[]
[]
[]
[]
[]
[]
[]
[]
[]
[]
[]
[]
[]
[]
[]
[]
[]
[]
[]
[]
[]
[]
[]
[]
[]
[]
[]
[]
[]
[]
[]
[]
[]
[]
[]
[]
[]
[]
[]
[]
[]
[]
[]
[]
[]
[]
[]
[]
[]
[]
[]
[]
[]
[]
[]
[]
[]
[]
[]
[]
[]
[]
[]
[]
[]
[]
[]
[]
[]
[]
[]
[]
[]
[]
[]
[]
[]
[]
[]
[]
[]
[]
[]
[]
[]
[]
[]
[]
[]
[]
[]
[]
[]
[]
[]
[]
[]
[]
[]
[]
[]
[]
[]
[]
[]
[]
[]
[]
[]
[]
[]
[]
[]
[]
[]
[]
[]
[]
[]
[]
[]
[]
[]
[]
[]
[]
[]
[]
[]
[]
[]
[]
[]
[]
[]
[]
[]
[]
[]
[]
[]
[]
[]
[]
[]
[]
[]
[]
[]
[]
[]
[]
[]
[]
[]
[]
[]
[]
[]
[]
[]
[]
[]
[]
[]
[]
[]
[]
[]
[]
[]
[]
[]
[]
[]
[]
[]
[]
[]
[]
[]
[]
[]
[]
[]
[]
[]
[]
[]
[]
[]
[]
[]
[]
[]
[]
[]
[]
[]
[]
[]
[]
[]
[]
[]
[]
[]
[]
[]
[]
[]
[]
[]
[]
[]
[]
[]
[]
[]
[]
[]
[]
[]
[]
[]
[]
[]
[]
[]
[]
[]
[]
[]
[]
[]
[]
[]
[]
[]
[]
[]
[]
[]
[]
[]
[]
[]
[]
[]
[]
[]
[]
[]
[]
[]
[]
[]
[]
[]
[]
[]
[]
[]
[]
[]
[]
[]
[]
[]
[]
[]
[]
[]
[]
[]
[]
[]
[]
[]
[]
[]
[]
[]
[]
[]
[]
[]
[]
[]
[]
[]
[]
[]
[]
[]
[]
[]
[]
[]
[]
[]
[]
[]
[]
[]
[]
[]
[]
[]
[]
[]
[]
[]
[]
[]
[]
[]
[]
[]
[]
[]
[]
[]
[]
[]
[]
[]
[]
[]
[]
[]
[]
[]
[]
[]
[]
[]
[]
[]
[]
[]
[]
[]
[]
[]
[]
[]
[]
[]
[]
[]
[]
[]
[]
[]
[]
[]
[]
[]
[]
[]
[]
[]
[]
[]
[]
[]
[]
[]
[]
[]
[]
[]
[]
[]
[]
[]
[]
[]
[]
[]
[]
[]
[]
[]
[]
[]
[]
[]
[]
[]
[]
[]
[]
[]
[]
[]
[]
[]
[]
[]
[]
[]
[]
[]
[]
[]
[]
[]
[]
[]
[]
[]
[]
[]
[]
[]
[]
[]
[]
[]
[]
[]
[]
[]
[]
[]
[]
[]
[]
[]
[]
[]
[]
[]
[]
[]
[]
[]
[]
[]
[]
[]
[]
[]
[]
[]
[]
[]
[]
[]
[]
[]
[]
[]
[]
[]
[]
[]
[]
[]
[]
[]
[]
[]
[]
[]
[]
[]
[]
[]
[]
[]
[]
[]
[]
[]
[]
[]
[]
[]
[]
[]
[]
[]
[]
[]
[]
[]
[]
[]
[]
[]
[]
[]
[]
[]
[]
[]
[]
[]
[]
[]
[]
[]
[]
[]
[]
[]
[]
[]
[]
[]
[]
[]
[]
[]
[]
[]
[]
[]
[]
[]
[]
[]
[]
[]
[]
[]
[]
[]
[]
[]
[]
[]
[]
[]
[]
[]
[]
[]
[]
[]
[]
[]
[]
[]
[]
[]
[]
[]
[]
[]
[]
[]
[]
[]
[]
[]
[]
[]
[]
[]
[]
[]
[]
[]
[]
[]
[]
[]
[]
[]
[]
[]
[]
[]
[]
[]
[]
[]
[]
[]
[]
[]
[]
[]
[]
[]
[]
[]
[]
[]
[]
[]
[]
[]
[]
[]
[]
[]
[]
[]
[]
[]
[]
[]
[]
[]
[]
[]
[]
[]
[]
[]
[]
[]
[]
[]
[]
[]
[]
[]
[]
[]
[]
[]
[]
[]
[]
[]
[]
[]
[]
[]
[]
[]
[]
[]
[]
[]
[]
[]
[]
[]
[]
[]
[]
[]
[]
[]
[]
[]
[]
[]
[]
[]
[]
[]
[]
[]
[]
[]
[]
[]
[]
[]
[]
[]
[]
[]
[]
[]
[]
[]
[]
[]
[]
[]
[]
[]
[]
[]
[]
[]
[]
[]
[]
[]
[]
[]
[]
[]
[]
[]
[]
[]
[]
[]
[]
[]
[]
[]
[]
[]
[]
[]
[]
[]
[]
[]
[]
[]
[]
[]
[]
[]
[]
[]
[]
[]
[]
[]
[]
[]
[]
[]
[]
[]
[]
[]
[]
[]
[]
[]
[]
[]
[]
[]
[]
[]
[]
[]
[]
[]
[]
[]
[]
[]
[]
[]
[]
[]
[]
[]
[]
[]
[]
[]
[]
[]
[]
[]
[]
[]
[]
[]
[]
[]
[]
[]
[]
[]
[]
[]
[]
[]
[]
[]
[]
[]
[]
[]
[]
[]
[]
[]
[]
[]
[]
[]
[]
[]
[]
[]
[]
[]
[]
[]
[]
[]
[]
[]
[]
[]
[]
[]
[]
[]
[]
[]
[]
[]
[]
[]
[]
[]
[]
[]
[]
[]
[]
[]
[]
[]
[]
[]
[]
[]
[]
[]
[]
[]
[]
[]
[]
[]
[]
[]
[]
[]
[]
[]
[]
[]
[]
[]
[]
[]
[]
[]
[]
[]
[]
[]
[]
[]
[]
[]
[]
[]
[]
[]
[]
[]
[]
[]
[]
[]
[]
[]
[]
[]
[]
[]
[]
[]
[]
[]
[]
[]
[]
[]
[]
[]
[]
[]
[]
[]
[]
[]
[]
[]
[]
[]
[]
[]
[]
[]
[]
[]
[]
[]
[]
[]
[]
[]
[]
[]
[]
[]
[]
[]
[]
[]
[]
[]
[]
[]
[]
[]
[]
[]
[]
[]
[]
[]
[]
[]
[]
[]
[]
[]
[]
[]
[]
[]
[]
[]
[]
[]
[]
[]
[]
[]
[]
[]
[]
[]
[]
[]
[]
[]
[]
[]
[]
[]
[]
[]
[]
[]
[]
[]
[]
[]
[]
[]
[]
[]
[]
[]
[]
[]
[]
[]
[]
[]
[]
[]
[]
[]
[]
[]
[]
[]
[]
[]
[]
[]
[]
[]
[]
[]
[]
[]
[]
[]
[]
[]
[]
[]
[]
[]
[]
[]
[]
[]
[]
[]
[]
[]
[]
[]
[]
[]
[]
[]
[]
[]
[]
[]
[]
[]
[]
[]
[]
[]
[]
[]
[]
[]
[]
[]
[]
[]
[]
[]
[]
[]
[]
[]
[]
[]
[]
[]
[]
[]
[]
[]
[]
[]
[]
[]
[]
[]
[]
[]
[]
[]
[]
[]
[]
[]
[]
[]
[]
[]
[]
[]
[]
[]
[]
[]
[]
[]
[]
[]
[]
[]
[]
[]
[]
[]
[]
[]
[]
[]
[]
[]
[]
[]
[]
[]
[]
[]
[]
[]
[]
[]
[]
[]
[]
[]
[]
[]
[]
[]
[]
[]
[]
[]
[]
[]
[]
[]
[]
[]
[]
[]
[]
[]
[]
[]
[]
[]
[]
[]
[]
[]
[]
[]
[]
[]
[]
[]
[]
[]
[]
[]
[]
[]
[]
[]
[]
[]
[]
[]
[]
[]
[]
[]
[]
[]
[]
[]
[]
[]
[]
[]
[]
[]
[]
[]
[]
[]
[]
[]
[]
[]
[]
[]
[]
[]
[]
[]
[]
[]
[]
[]
[]
[]
[]
[]
[]
[]
[]
[]
[]
[]
[]
[]
[]
[]
[]
[]
[]
[]
[]
[]
[]
[]
[]
[]
[]
[]
[]
[]
[]
[]
[]
[]
[]
[]
[]
[]
[]
[]
[]
[]
[]
[]
[]
[]
[]
[]
[]
[]
[]
[]
[]
[]
[]
[]
[]
[]
[]
[]
[]
[]
[]
[]
[]
[]
[]
[]
[]
[]
[]
[]
[]
[]
[]
[]
[]
[]
[]
[]
[]
[]
[]
[]
[]
[]
[]
[]
[]
[]
[]
[]
[]
[]
[]
[]
[]
[]
[]
[]
[]
[]
[]
[]
[]
[]
[]
[]
[]
[]
[]
[]
[]
[]
[]
[]
[]
[]
[]
[]
[]
[]
[]
[]
[]
[]
[]
[]
[]
[]
[]
[]
[]
[]
[]
[]
[]
[]
[]
[]
[]
[]
[]
[]
[]
[]
[]
[]
[]
[]
[]
[]
[]
[]
[]
[]
[]
[]
[]
[]
[]
[]
[]
[]
[]
[]
[]
[]
[]
[]
[]
[]
[]
[]
[]
[]
[]
[]
[]
[]
[]
[]
[]
[]
[]
[]
[]
[]
[]
[]
[]
[]
[]
[]
[]
[]
[]
[]
[]
[]
[]
[]
[]
[]
[]
[]
[]
[]
[]
[]
[]
[]
[]
[]
[]
[]
[]
[]
[]
[]
[]
[]
[]
[]
[]
[]
[]
[]
[]
[]
[]
[]
[]
[]
[]
[]
[]
[]
[]
[]
[]
[]
[]
[]
[]
[]
[]
[]
[]
[]
[]
[]
[]
[]
[]
[]
[]
[]
[]
[]
[]
[]
[]
[]
[]
[]
[]
[]
[]
[]
[]
[]
[]
[]
[]
[]
[]
[]
[]
[]
[]
[]
[]
[]
[]
[]
[]
[]
[]
[]
[]
[]
[]
[]
[]
[]
[]
[]
[]
[]
[]
[]
[]
[]
[]
[]
[]
[]
[]
[]
[]
[]
[]
[]
[]
[]
[]
[]
[]
[]
[]
[]
[]
[]
[]
[]
[]
[]
[]
[]
[]
[]
[]
[]
[]
[]
[]
[]
[]
[]
[]
[]
[]
[]
[]
[]
[]
[]
[]
[]
[]
[]
[]
[]
[]
[]
[]
[]
[]
[]
[]
[]
[]
[]
[]
[]
[]
[]
[]
[]
[]
[]
[]
[]
[]
[]
[]
[]
[]
[]
[]
[]
[]
[]
[]
[]
[]
[]
[]
[]
[]
[]
[]
[]
[]
[]
[]
[]
[]
[]
[]
[]
[]
[]
[]
[]
[]
[]
[]
[]
[]
[]
[]
[]
[]
[]
[]
[]
[]
[]
[]
[]
[]
[]
[]
[]
[]
[]
[]
[]
[]
[]
[]
[]
[]
[]
[]
[]
[]
[]
[]
[]
[]
[]
[]
[]
[]
[]
[]
[]
[]
[]
[]
[]
[]
[]
[]
[]
[]
[]
[]
[]
[]
[]
[]
[]
[]
[]
[]
[]
[]
[]
[]
[]
[]
[]
[]
[]
[]
[]
[]
[]
[]
[]
[]
[]
[]
[]
[]
[]
[]
[]
[]
[]
[]
[]
[]
[]
[]
[]
[]
[]
[]
[]
[]
[]
[]
[]
[]
[]
[]
[]
[]
[]
[]
[]
[]
[]
[]
[]
[]
[]
[]
[]
[]
[]
[]
[]
[]
[]
[]
[]
[]
[]
[]
[]
[]
[]
[]
[]
[]
[]
[]
[]
[]
[]
[]
[]
[]
[]
[]
[]
[]
[]
[]
[]
[]
[]
[]
[]
[]
[]
[]
[]
[]
[]
[]
[]
[]
[]
[]
[]
[]
[]
[]
[]
[]
[]
[]
[]
[]
[]
[]
[]
[]
[]
[]
[]
[]
[]
[]
[]
[]
[]
[]
[]
[]
[]
[]
[]
[]
[]
[]
[]
[]
[]
[]
[]
[]
[]
[]
[]
[]
[]
[]
[]
[]
[]
[]
[]
[]
[]
[]
[]
[]
[]
[]
[]
[]
[]
[]
[]
[]
[]
[]
[]
[]
[]
[]
[]
[]
[]
[]
[]
[]
[]
[]
[]
[]
[]
[]
[]
[]
[]
[]
[]
[]
[]
[]
[]
[]
[]
[]
[]
[]
[]
[]
[]
[]
[]
[]
[]
[]
[]
[]
[]
[]
[]
[]
[]
[]
[]
[]
[]
[]
[]
[]
[]
[]
[]
[]
[]
[]
[]
[]
[]
[]
[]
[]
[]
[]
[]
[]
[]
[]
[]
[]
[]
[]
[]
[]
[]
[]
[]
[]
[]
[]
[]
[]
[]
[]
[]
[]
[]
[]
[]
[]
[]
[]
[]
[]
[]
[]
[]
[]
[]
[]
[]
[]
[]
[]
[]
[]
[]
[]
[]
[]
[]
[]
[]
[]
[]
[]
[]
[]
[]
[]
[]
[]
[]
[]
[]
[]
[]
[]
[]
[]
[]
[]
[]
[]
[]
[]
[]
[]
[]
[]
[]
[]
[]
[]
[]
[]
[]
[]
[]
[]
[]
[]
[]
[]
[]
[]
[]
[]
[]
[]
[]
[]
[]
[]
[]
[]
[]
[]
[]
[]
[]
[]
[]
[]
[]
[]
[]
[]
[]
[]
[]
[]
[]
[]
[]
[]
[]
[]
[]
[]
[]
[]
[]
[]
[]
[]
[]
[]
[]
[]
[]
[]
[]
[]
[]
[]
[]
[]
[]
[]
[]
[]
[]
[]
[]
[]
[]
[]
[]
[]
[]
[]
[]
[]
[]
[]
[]
[]
[]
[]
[]
[]
[]
[]
[]
[]
[]
[]
[]
[]
[]
[]
[]
[]
[]
[]
[]
[]
[]
[]
[]
[]
[]
[]
[]
[]
[]
[]
[]
[]
[]
[]
[]
[]
[]
[]
[]
[]
[]
[]
[]
[]
[]
[]
[]
[]
[]
[]
[]
[]
[]
[]
[]
[]
[]
[]
[]
[]
[]
[]
[]
[]
[]
[]
[]
[]
[]
[]
[]
[]
[]
[]
[]
[]
[]
[]
[]
[]
[]
[]
[]
[]
[]
[]
[]
[]
[]
[]
[]
[]
[]
[]
[]
[]
[]
[]
[]
[]
[]
[]
[]
[]
[]
[]
[]
[]
[]
[]
[]
[]
[]
[]
[]
[]
[]
[]
[]
[]
[]
[]
[]
[]
[]
[]
[]
[]
[]
[]
[]
[]
[]
[]
[]
[]
[]
[]
[]
[]
[]
[]
[]
[]
[]
[]
[]
[]
[]
[]
[]
[]
[]
[]
[]
[]
[]
[]
[]
[]
[]
[]
[]
[]
[]
[]
[]
[]
[]
[]
[]
[]
[]
[]
[]
[]
[]
[]
[]
[]
[]
[]
[]
[]
[]
[]
[]
[]
[]
[]
[]
[]
[]
[]
[]
[]
[]
[]
[]
[]
[]
[]
[]
[]
[]
[]
[]
[]
[]
[]
[]
[]
[]
[]
[]
[]
[]
[]
[]
[]
[]
[]
[]
[]
[]
[]
[]
[]
[]
[]
[]
[]
[]
[]
[]
[]
[]
[]
[]
[]
[]
[]
[]
[]
[]
[]
[]
[]
[]
[]
[]
[]
[]
[]
[]
[]
[]
[]
[]
[]
[]
[]
[]
[]
[]
[]
[]
[]
[]
[]
[]
[]
[]
[]
[]
[]
[]
[]
[]
[]
[]
[]
[]
[]
[]
[]
[]
[]
[]
[]
[]
[]
[]
[]
[]
[]
[]
[]
[]
[]
[]
[]
[]
[]
[]
[]
[]
[]
[]
[]
[]
[]
[]
[]
[]
[]
[]
[]
[]
[]
[]
[]
[]
[]
[]
[]
[]
[]
[]
[]
[]
[]
[]
[]
[]
[]
[]
[]
[]
[]
[]
[]
[]
[]
[]
[]
[]
[]
[]
[]
[]
[]
[]
[]
[]
[]
[]
[]
[]
[]
[]
[]
[]
[]
[]
[]
[]
[]
[]
[]
[]
[]
[]
[]
[]
[]
[]
[]
[]
[]
[]
[]
[]
[]
[]
[]
[]
[]
[]
[]
[]
[]
[]
[]
[]
[]
[]
[]
[]
[]
[]
[]
[]
[]
[]
[]
[]
[]
[]
[]
[]
[]
[]
[]
[]
[]
[]
[]
[]
[]
[]
[]
[]
[]
[]
[]
[]
[]
[]
[]
[]
[]
[]
[]
[]
[]
[]
[]
[]
[]
[]
[]
[]
[]
[]
[]
[]
[]
[]
[]
[]
[]
[]
[]
[]
[]
[]
[]
[]
[]
[]
[]
[]
[]
[]
[]
[]
[]
[]
[]
[]
[]
[]
[]
[]
[]
[]
[]
[]
[]
[]
[]
[]
[]
[]
[]
[]
[]
[]
[]
[]
[]
[]
[]
[]
[]
[]
[]
[]
[]
[]
[]
[]
[]
[]
[]
[]
[]
[]
[]
[]
[]
[]
[]
[]
[]
[]
[]
[]
[]
[]
[]
[]
[]
[]
[]
[]
[]
[]
[]
[]
[]
[]
[]
[]
[]
[]
[]
[]
[]
[]
[]
[]
[]
[]
[]
[]
[]
[]
[]
[]
[]
[]
[]
[]
[]
[]
[]
[]
[]
[]
[]
[]
[]
[]
[]
[]
[]
[]
[]
[]
[]
[]
[]
[]
[]
[]
[]
[]
[]
[]
[]
[]
[]
[]
[]
[]
[]
[]
[]
[]
[]
[]
[]
[]
[]
[]
[]
[]
[]
[]
[]
[]
[]
[]
[]
[]
[]
[]
[]
[]
[]
[]
[]
[]
[]
[]
[]
[]
[]
[]
[]
[]
[]
[]
[]
[]
[]
[]
[]
[]
[]
[]
[]
[]
[]
[]
[]
[]
[]
[]
[]
[]
[]
[]
[]
[]
[]
[]
[]
[]
[]
[]
[]
[]
[]
[]
[]
[]
[]
[]
[]
[]
[]
[]
[]
[]
[]
[]
[]
[]
[]
[]
[]
[]
[]
[]
[]
[]
[]
[]
[]
[]
[]
[]
[]
[]
[]
[]
[]
[]
[]
[]
[]
[]
[]
[]
[]
[]
[]
[]
[]
[]
[]
[]
[]
[]
[]
[]
[]
[]
[]
[]
[]
[]
[]
[]
[]
[]
[]
[]
[]
[]
[]
[]
[]
[]
[]
[]
[]
[]
[]
[]
[]
[]
[]
[]
[]
[]
[]
[]
[]
[]
[]
[]
[]
[]
[]
[]
[]
[]
[]
[]
[]
[]
[]
[]
[]
[]
[]
[]
[]
[]
[]
[]
[]
[]
[]
[]
[]
[]
[]
[]
[]
[]
[]
[]
[]
[]
[]
[]
[]
[]
[]
[]
[]
[]
[]
[]
[]
[]
[]
[]
[]
[]
[]
[]
[]
[]
[]
[]
[]
[]
[]
[]
[]
[]
[]
[]
[]
[]
[]
[]
[]
[]
[]
[]
[]
[]
[]
[]
[]
[]
[]
[]
[]
[]
[]
[]
[]
[]
[]
[]
[]
[]
[]
[]
[]
[]
[]
[]
[]
[]
[]
[]
[]
[]
[]
[]
[]
[]
[]
[]
[]
[]
[]
[]
[]
[]
[]
[]
[]
[]
[]
[]
[]
[]
[]
[]
[]
[]
[]
[]
[]
[]
[]
[]
[]
[]
[]
[]
[]
[]
[]
[]
[]
[]
[]
[]
[]
[]
[]
[]
[]
[]
[]
[]
[]
[]
[]
[]
[]
[]
[]
[]
[]
[]
[]
[]
[]
[]
[]
[]
[]
[]
[]
[]
[]
[]
[]
[]
[]
[]
[]
[]
[]
[]
[]
[]
[]
[]
[]
[]
[]
[]
[]
[]
[]
[]
[]
[]
[]
[]
[]
[]
[]
[]
[]
[]
[]
[]
[]
[]
[]
[]
[]
[]
[]
[]
[]
[]
[]
[]
[]
[]
[]
[]
[]
[]
[]
[]
[]
[]
[]
[]
[]
[]
[]
[]
[]
[]
[]
[]
[]
[]
[]
[]
[]
[]
[]
[]
[]
[]
[]
[]
[]
[]
[]
[]
[]
[]
[]
[]
[]
[]
[]
[]
[]
[]
[]
[]
[]
[]
[]
[]
[]
[]
[]
[]
[]
[]
[]
[]
[]
[]
[]
[]
[]
[]
[]
[]
[]
[]
[]
[]
[]
[]
[]
[]
[]
[]
[]
[]
[]
[]
[]
[]
[]
[]
[]
[]
[]
[]
[]
[]
[]
[]
[]
[]
[]
[]
[]
[]
[]
[]
[]
[]
[]
[]
[]
[]
[]
[]
[]
[]
[]
[]
[]
[]
[]
[]
[]
[]
[]
[]
[]
[]
[]
[]
[]
[]
[]
[]
[]
[]
[]
[]
[]
[]
[]
[]
[]
[]
[]
[]
[]
[]
[]
[]
[]
[]
[]
[]
[]
[]
[]
[]
[]
[]
[]
[]
[]
[]
[]
[]
[]
[]
[]
[]
[]
[]
[]
[]
[]
[]
[]
[]
[]
[]
[]
[]
[]
[]
[]
[]
[]
[]
[]
[]
[]
[]
[]
[]
[]
[]
[]
[]
[]
[]
[]
[]
[]
[]
[]
[]
[]
[]
[]
[]
[]
[]
[]
[]
[]
[]
[]
[]
[]
[]
[]
[]
[]
[]
[]
[]
[]
[]
[]
[]
[]
[]
[]
[]
[]
[]
[]
[]
[]
[]
[]
[]
[]
[]
[]
[]
[]
[]
[]
[]
[]
[]
[]
[]
[]
[]
[]
[]
[]
[]
[]
[]
[]
[]
[]
[]
[]
[]
[]
[]
[]
[]
[]
[]
[]
[]
[]
[]
[]
[]
[]
[]
[]
[]
[]
[]
[]
[]
[]
[]
[]
[]
[]
[]
[]
[]
[]
[]
[]
[]
[]
[]
[]
[]
[]
[]
[]
[]
[]
[]
[]
[]
[]
[]
[]
[]
[]
[]
[]
[]
[]
[]
[]
[]
[]
[]
[]
[]
[]
[]
[]
[]
[]
[]
[]
[]
[]
[]
[]
[]
[]
[]
[]
[]
[]
[]
[]
[]
[]
[]
[]
[]
[]
[]
[]
[]
[]
[]
[]
[]
[]
[]
[]
[]
[]
[]
[]
[]
[]
[]
[]
[]
[]
[]
[]
[]
[]
[]
[]
[]
[]
[]
[]
[]
[]
[]
[]
[]
[]
[]
[]
[]
[]
[]
[]
[]
[]
[]
[]
[]
[]
[]
[]
[]
[]
[]
[]
[]
[]
[]
[]
[]
[]
[]
[]
[]
[]
[]
[]
[]
[]
[]
[]
[]
[]
[]
[]
[]
[]
[]
[]
[]
[]
[]
[]
[]
[]
[]
[]
[]
[]
[]
[]
[]
[]
[]
[]
[]
[]
[]
[]
[]
[]
[]
[]
[]
[]
[]
[]
[]
[]
[]
[]
[]
[]
[]
[]
[]
[]
[]
[]
[]
[]
[]
[]
[]
[]
[]
[]
[]
[]
[]
[]
[]
[]
[]
[]
[]
[]
[]
[]
[]
[]
[]
[]
[]
[]
[]
[]
[]
[]
[]
[]
[]
[]
[]
[]
[]
[]
[]
[]
[]
[]
[]
[]
[]
[]
[]
[]
[]
[]
[]
[]
[]
[]
[]
[]
[]
[]
[]
[]
[]
[]
[]
[]
[]
[]
[]
[]
[]
[]
[]
[]
[]
[]
[]
[]
[]
[]
[]
[]
[]
[]
[]
[]
[]
[]
[]
[]
[]
[]
[]
[]
[]
[]
[]
[]
[]
[]
[]
[]
[]
[]
[]
[]
[]
[]
[]
[]
[]
[]
[]
[]
[]
[]
[]
[]
[]
[]
[]
[]
[]
[]
[]
[]
[]
[]
[]
[]
[]
[]
[]
[]
[]
[]
[]
[]
[]
[]
[]
[]
[]
[]
[]
[]
[]
[]
[]
[]
[]
[]
[]
[]
[]
[]
[]
[]
[]
[]
[]
[]
[]
[]
[]
[]
[]
[]
[]
[]
[]
[]
[]
[]
[]
[]
[]
[]
[]
[]
[]
[]
[]
[]
[]
[]
[]
[]
[]
[]
[]
[]
[]
[]
[]
[]
[]
[]
[]
[]
[]
[]
[]
[]
[]
[]
[]
[]
[]
[]
[]
[]
[]
[]
[]
[]
[]
[]
[]
[]
[]
[]
[]
[]
[]
[]
[]
[]
[]
[]
[]
[]
[]
[]
[]
[]
[]
[]
[]
[]
[]
[]
[]
[]
[]
[]
[]
[]
[]
[]
[]
[]
[]
[]
[]
[]
[]
[]
[]
[]
[]
[]
[]
[]
[]
[]
[]
[]
[]
[]
[]
[]
[]
[]
[]
[]
[]
[]
[]
[]
[]
[]
[]
[]
[]
[]
[]
[]
[]
[]
[]
[]
[]
[]
[]
[]
[]
[]
[]
[]
[]
[]
[]
[]
[]
[]
[]
[]
[]
[]
[]
[]
[]
[]
[]
[]
[]
[]
[]
[]
[]
[]
[]
[]
[]
[]
[]
[]
[]
[]
[]
[]
[]
[]
[]
[]
[]
[]
[]
[]
[]
[]
[]
[]
[]
[]
[]
[]
[]
[]
[]
[]
[]
[]
[]
[]
[]
[]
[]
[]
[]
[]
[]
[]
[]
[]
[]
[]
[]
[]
[]
[]
[]
[]
[]
[]
[]
[]
[]
[]
[]
[]
[]
[]
[]
[]
[]
[]
[]
[]
[]
[]
[]
[]
[]
[]
[]
[]
[]
[]
[]
[]
[]
[]
[]
[]
[]
[]
[]
[]
[]
[]
[]
[]
[]
[]
[]
[]
[]
[]
[]
[]
[]
[]
[]
[]
[]
[]
[]
[]
[]
[]
[]
[]
[]
[]
[]
[]
[]
[]
[]
[]
[]
[]
[]
[]
[]
[]
[]
[]
[]
[]
[]
[]
[]
[]
[]
[]
[]
[]
[]
[]
[]
[]
[]
[]
[]
[]
[]
[]
[]
[]
[]
[]
[]
[]
[]
[]
[]
[]
[]
[]
[]
[]
[]
[]
[]
[]
[]
[]
[]
[]
[]
[]
[]
[]
[]
[]
[]
[]
[]
[]
[]
[]
[]
[]
[]
[]
[]
[]
[]
[]
[]
[]
[]
[]
[]
[]
[]
[]
[]
[]
[]
[]
[]
[]
[]
[]
[]
[]
[]
[]
[]
[]
[]
[]
[]
[]
[]
[]
[]
[]
[]
[]
[]
[]
[]
[]
[]
[]
[]
[]
[]
[]
[]
[]
[]
[]
[]
[]
[]
[]
[]
[]
[]
[]
[]
[]
[]
[]
[]
[]
[]
[]
[]
[]
[]
[]
[]
[]
[]
[]
[]
[]
[]
[]
[]
[]
[]
[]
[]
[]
[]
[]
[]
[]
[]
[]
[]
[]
[]
[]
[]
[]
[]
[]
[]
[]
[]
[]
[]
[]
[]
[]
[]
[]
[]
[]
[]
[]
[]
[]
[]
[]
[]
[]
[]
[]
[]
[]
[]
[]
[]
[]
[]
[]
[]
[]
[]
[]
[]
[]
[]
[]
[]
[]
[]
[]
[]
[]
[]
[]
[]
[]
[]
[]
[]
[]
[]
[]
[]
[]
[]
[]
[]
[]
[]
[]
[]
[]
[]
[]
[]
[]
[]
[]
[]
[]
[]
[]
[]
[]
[]
[]
[]
[]
[]
[]
[]
[]
[]
[]
[]
[]
[]
[]
[]
[]
[]
[]
[]
[]
[]
[]
[]
[]
[]
[]
[]
[]
[]
[]
[]
[]
[]
[]
[]
[]
[]
[]
[]
[]
[]
[]
[]
[]
[]
[]
[]
[]
[]
[]
[]
[]
[]
[]
[]
[]
[]
[]
[]
[]
[]
[]
[]
[]
[]
[]
[]
[]
[]
[]
[]
[]
[]
[]
[]
[]
[]
[]
[]
[]
[]
[]
[]
[]
[]
[]
[]
[]
[]
[]
[]
[]
[]
[]
[]
[]
[]
[]
[]
[]
[]
[]
[]
[]
[]
[]
[]
[]
[]
[]
[]
[]
[]
[]
[]
[]
[]
[]
[]
[]
[]
[]
[]
[]
[]
[]
[]
[]
[]
[]
[]
[]
[]
[]
[]
[]
[]
[]
[]
[]
[]
[]
[]
[]
[]
[]
[]
[]
[]
[]
[]
[]
[]
[]
[]
[]
[]
[]
[]
[]
[]
[]
[]
[]
[]
[]
[]
[]
[]
[]
[]
[]
[]
[]
[]
[]
[]
[]
[]
[]
[]
[]
[]
[]
[]
[]
[]
[]
[]
[]
[]
[]
[]
[]
[]
[]
[]
[]
[]
[]
[]
[]
[]
[]
[]
[]
[]
[]
[]
[]
[]
[]
[]
[]
[]
[]
[]
[]
[]
[]
[]
[]
[]
[]
[]
[]
[]
[]
[]
[]
[]
[]
[]
[]
[]
[]
[]
[]
[]
[]
[]
[]
[]
[]
[]
[]
[]
[]
[]
[]
[]
[]
[]
[]
[]
[]
[]
[]
[]
[]
[]
[]
[]
[]
[]
[]
[]
[]
[]
[]
[]
[]
[]
[]
[]
[]
[]
[]
[]
[]
[]
[]
[]
[]
[]
[]
[]
[]
[]
[]
[]
[]
[]
[]
[]
[]
[]
[]
[]
[]
[]
[]
[]
[]
[]
[]
[]
[]
[]
[]
[]
[]
[]
[]
[]
[]
[]
[]
[]
[]
[]
[]
[]
[]
[]
[]
[]
[]
[]
[]
[]
[]
[]
[]
[]
[]
[]
[]
[]
[]
[]
[]
[]
[]
[]
[]
[]
[]
[]
[]
[]
[]
[]
[]
[]
[]
[]
[]
[]
[]
[]
[]
[]
[]
[]
[]
[]
[]
[]
[]
[]
[]
[]
[]
[]
[]
[]
[]
[]
[]
[]
[]
[]
[]
[]
[]
[]
[]
[]
[]
[]
[]
[]
[]
[]
[]
[]
[]
[]
[]
[]
[]
[]
[]
[]
[]
[]
[]
[]
[]
[]
[]
[]
[]
[]
[]
[]
[]
[]
[]
[]
[]
[]
[]
[]
[]
[]
[]
[]
[]
[]
[]
[]
[]
[]
[]
[]
[]
[]
[]
[]
[]
[]
[]
[]
[]
[]
[]
[]
[]
[]
[]
[]
[]
[]
[]
[]
[]
[]
[]
[]
[]
[]
[]
[]
[]
[]
[]
[]
[]
[]
[]
[]
[]
[]
[]
[]
[]
[]
[]
[]
[]
[]
[]
[]
[]
[]
[]
[]
[]
[]
[]
[]
[]
[]
[]
[]
[]
[]
[]
[]
[]
[]
[]
[]
[]
[]
[]
[]
[]
[]
[]
[]
[]
[]
[]
[]
[]
[]
[]
[]
[]
[]
[]
[]
[]
[]
[]
[]
[]
[]
[]
[]
[]
[]
[]
[]
[]
[]
[]
[]
[]
[]
[]
[]
[]
[]
[]
[]
[]
[]
[]
[]
[]
[]
[]
[]
[]
[]
[]
[]
[]
[]
[]
[]
[]
[]
[]
[]
[]
[]
[]
[]
[]
[]
[]
[]
[]
[]
[]
[]
[]
[]
[]
[]
[]
[]
[]
[]
[]
[]
[]
[]
[]
[]
[]
[]
[]
[]
[]
[]
[]
[]
[]
[]
[]
[]
[]
[]
[]
[]
[]
[]
[]
[]
[]
[]
[]
[]
[]
[]
[]
[]
[]
[]
[]
[]
[]
[]
[]
[]
[]
[]
[]
[]
[]
[]
[]
[]
[]
[]
[]
[]
[]
[]
[]
[]
[]
[]
[]
[]
[]
[]
[]
[]
[]
[]
[]
[]
[]
[]
[]
[]
[]
[]
[]
[]
[]
[]
[]
[]
[]
[]
[]
[]
[]
[]
[]
[]
[]
[]
[]
[]
[]
[]
[]
[]
[]
[]
[]
[]
[]
[]
[]
[]
[]
[]
[]
[]
[]
[]
[]
[]
[]
[]
[]
[]
[]
[]
[]
[]
[]
[]
[]
[]
[]
[]
[]
[]
[]
[]
[]
[]
[]
[]
[]
[]
[]
[]
[]
[]
[]
[]
[]
[]
[]
[]
[]
[]
[]
[]
[]
[]
[]
[]
[]
[]
[]
[]
[]
[]
[]
[]
[]
[]
[]
[]
[]
[]
[]
[]
[]
[]
[]
[]
[]
[]
[]
[]
[]
[]
[]
[]
[]
[]
[]
[]
[]
[]
[]
[]
[]
[]
[]
[]
[]
[]
[]
[]
[]
[]
[]
[]
[]
[]
[]
[]
[]
[]
[]
[]
[]
[]
[]
[]
[]
[]
[]
[]
[]
[]
[]
[]
[]
[]
[]
[]
[]
[]
[]
[]
[]
[]
[]
[]
[]
[]
[]
[]
[]
[]
[]
[]
[]
[]
[]
[]
[]
[]
[]
[]
[]
[]
[]
[]
[]
[]
[]
[]
[]
[]
[]
[]
[]
[]
[]
[]
[]
[]
[]
[]
[]
[]
[]
[]
[]
[]
[]
[]
[]
[]
[]
[]
[]
[]
[]
[]
[]
[]
[]
[]
[]
[]
[]
[]
[]
[]
[]
[]
[]
[]
[]
[]
[]
[]
[]
[]
[]
[]
[]
[]
[]
[]
[]
[]
[]
[]
[]
[]
[]
[]
[]
[]
[]
[]
[]
[]
[]
[]
[]
[]
[]
[]
[]
[]
[]
[]
[]
[]
[]
[]
[]
[]
[]
[]
[]
[]
[]
[]
[]
[]
[]
[]
[]
[]
[]
[]
[]
[]
[]
[]
[]
[]
[]
[]
[]
[]
[]
[]
[]
[]
[]
[]
[]
[]
[]
[]
[]
[]
[]
[]
[]
[]
[]
[]
[]
[]
[]
[]
[]
[]
[]
[]
[]
[]
[]
[]
[]
[]
[]
[]
[]
[]
[]
[]
[]
[]
[]
[]
[]
[]
[]
[]
[]
[]
[]
[]
[]
[]
[]
[]
[]
[]
[]
[]
[]
[]
[]
[]
[]
[]
[]
[]
[]
[]
[]
[]
[]
[]
[]
[]
[]
[]
[]
[]
[]
[]
[]
[]
[]
[]
[]
[]
[]
[]
[]
[]
[]
[]
[]
[]
[]
[]
[]
[]
[]
[]
[]
[]
[]
[]
[]
[]
[]
[]
[]
[]
[]
[]
[]
[]
[]
[]
[]
[]
[]
[]
[]
[]
[]
[]
[]
[]
[]
[]
[]
[]
[]
[]
[]
[]
[]
[]
[]
[]
[]
[]
[]
[]
[]
[]
[]
[]
[]
[]
[]
[]
[]
[]
[]
[]
[]
[]
[]
[]
[]
[]
[]
[]
[]
[]
[]
[]
[]
[]
[]
[]
[]
[]
[]
[]
[]
[]
[]
[]
[]
[]
[]
[]
[]
[]
[]
[]
[]
[]
[]
[]
[]
[]
[]
[]
[]
[]
[]
[]
[]
[]
[]
[]
[]
[]
[]
[]
[]
[]
[]
[]
[]
[]
[]
[]
[]
[]
[]
[]
[]
[]
[]
[]
[]
[]
[]
[]
[]
[]
[]
[]
[]
[]
[]
[]
[]
[]
[]
[]
[]
[]
[]
[]
[]
[]
[]
[]
[]
[]
[]
[]
[]
[]
[]
[]
[]
[]
[]
[]
[]
[]
[]
[]
[]
[]
[]
[]
[]
[]
[]
[]
[]
[]
[]
[]
[]
[]
[]
[]
[]
[]
[]
[]
[]
[]
[]
[]
[]
[]
[]
[]
[]
[]
[]
[]
[]
[]
[]
[]
[]
[]
[]
[]
[]
[]
[]
[]
[]
[]
[]
[]
[]
[]
[]
[]
[]
[]
[]
[]
[]
[]
[]
[]
[]
[]
[]
[]
[]
[]
[]
[]
[]
[]
[]
[]
[]
[]
[]
[]
[]
[]
[]
[]
[]
[]
[]
[]
[]
[]
[]
[]
[]
[]
[]
[]
[]
[]
[]
[]
[]
[]
[]
[]
[]
[]
[]
[]
[]
[]
[]
[]
[]
[]
[]
[]
[]
[]
[]
[]
[]
[]
[]
[]
[]
[]
[]
[]
[]
[]
[]
[]
[]
[]
[]
[]
[]
[]
[]
[]
[]
[]
[]
[]
[]
[]
[]
[]
[]
[]
[]
[]
[]
[]
[]
[]
[]
[]
[]
[]
[]
[]
[]
[]
[]
[]
[]
[]
[]
[]
[]
[]
[]
[]
[]
[]
[]
[]
[]
[]
[]
[]
[]
[]
[]
[]
[]
[]
[]
[]
[]
[]
[]
[]
[]
[]
[]
[]
[]
[]
[]
[]
[]
[]
[]
[]
[]
[]
[]
[]
[]
[]
[]
[]
[]
[]
[]
[]
[]
[]
[]
[]
[]
[]
[]
[]
[]
[]
[]
[]
[]
[]
[]
[]
[]
[]
[]
[]
[]
[]
[]
[]
[]
[]
[]
[]
[]
[]
[]
[]
[]
[]
[]
[]
[]
[]
[]
[]
[]
[]
[]
[]
[]
[]
[]
[]
[]
[]
[]
[]
[]
[]
[]
[]
[]
[]
[]
[]
[]
[]
[]
[]
[]
[]
[]
[]
[]
[]
[]
[]
[]
[]
[]
[]
[]
[]
[]
[]
[]
[]
[]
[]
[]
[]
[]
[]
[]
[]
[]
[]
[]
[]
[]
[]
[]
[]
[]
[]
[]
[]
[]
[]
[]
[]
[]
[]
[]
[]
[]
[]
[]
[]
[]
[]
[]
[]
[]
[]
[]
[]
[]
[]
[]
[]
[]
[]
[]
[]
[]
[]
[]
[]
[]
[]
[]
[]
[]
[]
[]
[]
[]
[]
[]
[]
[]
[]
[]
[]
[]
[]
[]
[]
[]
[]
[]
[]
[]
[]
[]
[]
[]
[]
[]
[]
[]
[]
[]
[]
[]
[]
[]
[]
[]
[]
[]
[]
[]
[]
[]
[]
[]
[]
[]
[]
[]
[]
[]
[]
[]
[]
[]
[]
[]
[]
[]
[]
[]
[]
[]
[]
[]
[]
[]
[]
[]
[]
[]
[]
[]
[]
[]
[]
[]
[]
[]
[]
[]
[]
[]
[]
[]
[]
[]
[]
[]
[]
[]
[]
[]
[]
[]
[]
[]
[]
[]
[]
[]
[]
[]
[]
[]
[]
[]
[]
[]
[]
[]
[]
[]
[]
[]
[]
[]
[]
[]
[]
[]
[]
[]
[]
[]
[]
[]
[]
[]
[]
[]
[]
[]
[]
[]
[]
[]
[]
[]
[]
[]
[]
[]
[]
[]
[]
[]
[]
[]
[]
[]
[]
[]
[]
[]
[]
[]
[]
[]
[]
[]
[]
[]
[]
[]
[]
[]
[]
[]
[]
[]
[]
[]
[]
[]
[]
[]
[]
[]
[]
[]
[]
[]
[]
[]
[]
[]
[]
[]
[]
[]
[]
[]
[]
[]
[]
[]
[]
[]
[]
[]
[]
[]
[]
[]
[]
[]
[]
[]
[]
[]
[]
[]
[]
[]
[]
[]
[]
[]
[]
[]
[]
[]
[]
[]
[]
[]
[]
[]
[]
[]
[]
[]
[]
[]
[]
[]
[]
[]
[]
[]
[]
[]
[]
[]
[]
[]
[]
[]
[]
[]
[]
[]
[]
[]
[]
[]
[]
[]
[]
[]
[]
[]
[]
[]
[]
[]
[]
[]
[]
[]
[]
[]
[]
[]
[]
[]
[]
[]
[]
[]
[]
[]
[]
[]
[]
[]
[]
[]
[]
[]
[]
[]
[]
[]
[]
[]
[]
[]
[]
[]
[]
[]
[]
[]
[]
[]
[]
[]
[]
[]
[]
[]
[]
[]
[]
[]
[]
[]
[]
[]
[]
[]
[]
[]
[]
[]
[]
[]
[]
[]
[]
[]
[]
[]
[]
[]
[]
[]
[]
[]
[]
[]
[]
[]
[]
[]
[]
[]
[]
[]
[]
[]
[]
[]
[]
[]
[]
[]
[]
[]
[]
[]
[]
[]
[]
[]
[]
[]
[]
[]
[]
[]
[]
[]
[]
[]
[]
[]
[]
[]
[]
[]
[]
[]
[]
[]
[]
[]
[]
[]
[]
[]
[]
[]
[]
[]
[]
[]
[]
[]
[]
[]
[]
[]
[]
[]
[]
[]
[]
[]
[]
[]
[]
[]
[]
[]
[]
[]
[]
[]
[]
[]
[]
[]
[]
[]
[]
[]
[]
[]
[]
[]
[]
[]
[]
[]
[]
[]
[]
[]
[]
[]
[]
[]
[]
[]
[]
[]
[]
[]
[]
[]
[]
[]
[]
[]
[]
[]
[]
[]
[]
[]
[]
[]
[]
[]
[]
[]
[]
[]
[]
[]
[]
[]
[]
[]
[]
[]
[]
[]
[]
[]
[]
[]
[]
[]
[]
[]
[]
[]
[]
[]
[]
[]
[]
[]
[]
[]
[]
[]
[]
[]
[]
[]
[]
[]
[]
[]
[]
[]
[]
[]
[]
[]
[]
[]
[]
[]
[]
[]
[]
[]
[]
[]
[]
[]
[]
[]
[]
[]
[]
[]
[]
[]
[]
[]
[]
[]
[]
[]
[]
[]
[]
[]
[]
[]
[]
[]
[]
[]
[]
[]
[]
[]
[]
[]
[]
[]
[]
[]
[]
[]
[]
[]
[]
[]
[]
[]
[]
[]
[]
[]
[]
[]
[]
[]
[]
[]
[]
[]
[]
[]
[]
[]
[]
[]
[]
[]
[]
[]
[]
[]
[]
[]
[]
[]
[]
[]
[]
[]
[]
[]
[]
[]
[]
[]
[]
[]
[]
[]
[]
[]
[]
[]
[]
[]
[]
[]
[]
[]
[]
[]
[]
[]
[]
[]
[]
[]
[]
[]
[]
[]
[]
[]
[]
[]
[]
[]
[]
[]
[]
[]
[]
[]
[]
[]
[]
[]
[]
[]
[]
[]
[]
[]
[]
[]
[]
[]
[]
[]
[]
[]
[]
[]
[]
[]
[]
[]
[]
[]
[]
[]
[]
[]
[]
[]
[]
[]
[]
[]
[]
[]
[]
[]
[]
[]
[]
[]
[]
[]
[]
[]
[]
[]
[]
[]
[]
[]
[]
[]
[]
[]
[]
[]
[]
[]
[]
[]
[]
[]
[]
[]
[]
[]
[]
[]
[]
[]
[]
[]
[]
[]
[]
[]
[]
[]
[]
[]
[]
[]
[]
[]
[]
[]
[]
[]
[]
[]
[]
[]
[]
[]
[]
[]
[]
[]
[]
[]
[]
[]
[]
[]
[]
[]
[]
[]
[]
[]
[]
[]
[]
[]
[]
[]
[]
[]
[]
[]
[]
[]
[]
[]
[]
[]
[]
[]
[]
[]
[]
[]
[]
[]
[]
[]
[]
[]
[]
[]
[]
[]
[]
[]
[]
[]
[]
[]
[]
[]
[]
[]
[]
[]
[]
[]
[]
[]
[]
[]
[]
[]
[]
[]
[]
[]
[]
[]
[]
[]
[]
[]
[]
[]
[]
[]
[]
[]
[]
[]
[]
[]
[]
[]
[]
[]
[]
[]
[]
[]
[]
[]
[]
[]
[]
[]
[]
[]
[]
[]
[]
[]
[]
[]
[]
[]
[]
[]
[]
[]
[]
[]
[]
[]
[]
[]
[]
[]
[]
[]
[]
[]
[]
[]
[]
[]
[]
[]
[]
[]
[]
[]
[]
[]
[]
[]
[]
[]
[]
[]
[]
[]
[]
[]
[]
[]
[]
[]
[]
[]
[]
[]
[]
[]
[]
[]
[]
[]
[]
[]
[]
[]
[]
[]
[]
[]
[]
[]
[]
[]
[]
[]
[]
[]
[]
[]
[]
[]
[]
[]
[]
[]
[]
[]
[]
[]
[]
[]
[]
[]
[]
[]
[]
[]
[]
[]
[]
[]
[]
[]
[]
[]
[]
[]
[]
[]
[]
[]
[]
[]
[]
[]
[]
[]
[]
[]
[]
[]
[]
[]
[]
[]
[]
[]
[]
[]
[]
[]
[]
[]
[]
[]
[]
[]
[]
[]
[]
[]
[]
[]
[]
[]
[]
[]
[]
[]
[]
[]
[]
[]
[]
[]
[]
[]
[]
[]
[]
[]
[]
[]
[]
[]
[]
[]
[]
[]
[]
[]
[]
[]
[]
[]
[]
[]
[]
[]
[]
[]
[]
[]
[]
[]
[]
[]
[]
[]
[]
[]
[]
[]
[]
[]
[]
[]
[]
[]
[]
[]
[]
[]
[]
[]
[]
[]
[]
[]
[]
[]
[]
[]
[]
[]
[]
[]
[]
[]
[]
[]
[]
[]
[]
[]
[]
[]
[]
[]
[]
[]
[]
[]
[]
[]
[]
[]
[]
[]
[]
[]
[]
[]
[]
[]
[]
[]
[]
[]
[]
[]
[]
[]
[]
[]
[]
[]
[]
[]
[]
[]
[]
[]
[]
[]
[]
[]
[]
[]
[]
[]
[]
[]
[]
[]
[]
[]
[]
[]
[]
[]
[]
[]
[]
[]
[]
[]
[]
[]
[]
[]
[]
[]
[]
[]
[]
[]
[]
[]
[]
[]
[]
[]
[]
[]
[]
[]
[]
[]
[]
[]
[]
[]
[]
[]
[]
[]
[]
[]
[]
[]
[]
[]
[]
[]
[]
[]
[]
[]
[]
[]
[]
[]
[]
[]
[]
[]
[]
[]
[]
[]
[]
[]
[]
[]
[]
[]
[]
[]
[]
[]
[]
[]
[]
[]
[]
[]
[]
[]
[]
[]
[]
[]
[]
[]
[]
[]
[]
[]
[]
[]
[]
[]
[]
[]
[]
[]
[]
[]
[]
[]
[]
[]
[]
[]
[]
[]
[]
[]
[]
[]
[]
[]
[]
[]
[]
[]
[]
[]
[]
[]
[]
[]
[]
[]
[]
[]
[]
[]
[]
[]
[]
[]
[]
[]
[]
[]
[]
[]
[]
[]
[]
[]
[]
[]
[]
[]
[]
[]
[]
[]
[]
[]
[]
[]
[]
[]
[]
[]
[]
[]
[]
[]
[]
[]
[]
[]
[]
[]
[]
[]
[]
[]
[]
[]
[]
[]
[]
[]
[]
[]
[]
[]
[]
[]
[]
[]
[]
[]
[]
[]
[]
[]
[]
[]
[]
[]
[]
[]
[]
[]
[]
[]
[]
[]
[]
[]
[]
[]
[]
[]
[]
[]
[]
[]
[]
[]
[]
[]
[]
[]
[]
[]
[]
[]
[]
[]
[]
[]
[]
[]
[]
[]
[]
[]
[]
[]
[]
[]
[]
[]
[]
[]
[]
[]
[]
[]
[]
[]
[]
[]
[]
[]
[]
[]
[]
[]
[]
[]
[]
[]
[]
[]
[]
[]
[]
[]
[]
[]
[]
[]
[]
[]
[]
[]
[]
[]
[]
[]
[]
[]
[]
[]
[]
[]
[]
[]
[]
[]
[]
[]
[]
[]
[]
[]
[]
[]
[]
[]
[]
[]
[]
[]
[]
[]
[]
[]
[]
[]
[]
[]
[]
[]
[]
[]
[]
[]
[]
[]
[]
[]
[]
[]
[]
[]
[]
[]
[]
[]
[]
[]
[]
[]
[]
[]
[]
[]
[]
[]
[]
[]
[]
[]
[]
[]
[]
[]
[]
[]
[]
[]
[]
[]
[]
[]
[]
[]
[]
[]
[]
[]
[]
[]
[]
[]
[]
[]
[]
[]
[]
[]
[]
[]
[]
[]
[]
[]
[]
[]
[]
[]
[]
[]
[]
[]
[]
[]
[]
[]
[]
[]
[]
[]
[]
[]
[]
[]
[]
[]
[]
[]
[]
[]
[]
[]
[]
[]
[]
[]
[]
[]
[]
[]
[]
[]
[]
[]
[]
[]
[]
[]
[]
[]
[]
[]
[]
[]
[]
[]
[]
[]
[]
[]
[]
[]
[]
[]
[]
[]
[]
[]
[]
[]
[]
[]
[]
[]
[]
[]
[]
[]
[]
[]
[]
[]
[]
[]
[]
[]
[]
[]
[]
[]
[]
[]
[]
[]
[]
[]
[]
[]
[]
[]
[]
[]
[]
[]
[]
[]
[]
[]
[]
[]
[]
[]
[]
[]
[]
[]
[]
[]
[]
[]
[]
[]
[]
[]
[]
[]
[]
[]
[]
[]
[]
[]
[]
[]
[]
[]
[]
[]
[]
[]
[]
[]
[]
[]
[]
[]
[]
[]
[]
[]
[]
[]
[]
[]
[]
[]
[]
[]
[]
[]
[]
[]
[]
[]
[]
[]
[]
[]
[]
[]
[]
[]
[]
[]
[]
[]
[]
[]
[]
[]
[]
[]
[]
[]
[]
[]
[]
[]
[]
[]
[]
[]
[]
[]
[]
[]
[]
[]
[]
[]
[]
[]
[]
[]
[]
[]
[]
[]
[]
[]
[]
[]
[]
[]
[]
[]
[]
[]
[]
[]
[]
[]
[]
[]
[]
[]
[]
[]
[]
[]
[]
[]
[]
[]
[]
[]
[]
[]
[]
[]
[]
[]
[]
[]
[]
[]
[]
[]
[]
[]
[]
[]
[]
[]
[]
[]
[]
[]
[]
[]
[]
[]
[]
[]
[]
[]
[]
[]
[]
[]
[]
[]
[]
[]
[]
[]
[]
[]
[]
[]
[]
[]
[]
[]
[]
[]
[]
[]
[]
[]
[]
[]
[]
[]
[]
[]
[]
[]
[]
[]
[]
[]
[]
[]
[]
[]
[]
[]
[]
[]
[]
[]
[]
[]
[]
[]
[]
[]
[]
[]
[]
[]
[]
[]
[]
[]
[]
[]
[]
[]
[]
[]
[]
[]
[]
[]
[]
[]
[]
[]
[]
[]
[]
[]
[]
[]
[]
[]
[]
[]
[]
[]
[]
[]
[]
[]
[]
[]
[]
[]
[]
[]
[]
[]
[]
[]
[]
[]
[]
[]
[]
[]
[]
[]
[]
[]
[]
[]
[]
[]
[]
[]
[]
[]
[]
[]
[]
[]
[]
[]
[]
[]
[]
[]
[]
[]
[]
[]
[]
[]
[]
[]
[]
[]
[]
[]
[]
[]
[]
[]
[]
[]
[]
[]
[]
[]
[]
[]
[]
[]
[]
[]
[]
[]
[]
[]
[]
[]
[]
[]
[]
[]
[]
[]
[]
[]
[]
[]
[]
[]
[]
[]
[]
[]
[]
[]
[]
[]
[]
[]
[]
[]
[]
[]
[]
[]
[]
[]
[]
[]
[]
[]
[]
[]
[]
[]
[]
[]
[]
[]
[]
[]
[]
[]
[]
[]
[]
[]
[]
[]
[]
[]
[]
[]
[]
[]
[]
[]
[]
[]
[]
[]
[]
[]
[]
[]
[]
[]
[]
[]
[]
[]
[]
[]
[]
[]
[]
[]
[]
[]
[]
[]
[]
[]
[]
[]
[]
[]
[]
[]
[]
[]
[]
[]
[]
[]
[]
[]
[]
[]
[]
[]
[]
[]
[]
[]
[]
[]
[]
[]
[]
[]
[]
[]
[]
[]
[]
[]
[]
[]
[]
[]
[]
[]
[]
[]
[]
[]
[]
[]
[]
[]
[]
[]
[]
[]
[]
[]
[]
[]
[]
[]
[]
[]
[]
[]
[]
[]
[]
[]
[]
[]
[]
[]
[]
[]
[]
[]
[]
[]
[]
[]
[]
[]
[]
[]
[]
[]
[]
[]
[]
[]
[]
[]
[]
[]
[]
[]
[]
[]
[]
[]
[]
[]
[]
[]
[]
[]
[]
[]
[]
[]
[]
[]
[]
[]
[]
[]
[]
[]
[]
[]
[]
[]
[]
[]
[]
[]
[]
[]
[]
[]
[]
[]
[]
[]
[]
[]
[]
[]
[]
[]
[]
[]
[]
[]
[]
[]
[]
[]
[]
[]
[]
[]
[]
[]
[]
[]
[]
[]
[]
[]
[]
[]
[]
[]
[]
[]
[]
[]
[]
[]
[]
[]
[]
[]
[]
[]
[]
[]
[]
[]
[]
[]
[]
[]
[]
[]
[]
[]
[]
[]
[]
[]
[]
[]
[]
[]
[]
[]
[]
[]
[]
[]
[]
[]
[]
[]
[]
[]
[]
[]
[]
[]
[]
[]
[]
[]
[]
[]
[]
[]
[]
[]
[]
[]
[]
[]
[]
[]
[]
[]
[]
[]
[]
[]
[]
[]
[]
[]
[]
[]
[]
[]
[]
[]
[]
[]
[]
[]
[]
[]
[]
[]
[]
[]
[]
[]
[]
[]
[]
[]
[]
[]
[]
[]
[]
[]
[]
[]
[]
[]
[]
[]
[]
[]
[]
[]
[]
[]
[]
[]
[]
[]
[]
[]
[]
[]
[]
[]
[]
[]
[]
[]
[]
[]
[]
[]
[]
[]
[]
[]
[]
[]
[]
[]
[]
[]
[]
[]
[]
[]
[]
[]
[]
[]
[]
[]
[]
[]
[]
[]
[]
[]
[]
[]
[]
[]
[]
[]
[]
[]
[]
[]
[]
[]
[]
[]
[]
[]
[]
[]
[]
[]
[]
[]
[]
[]
[]
[]
[]
[]
[]
[]
[]
[]
[]
[]
[]
[]
[]
[]
[]
[]
[]
[]
[]
[]
[]
[]
[]
[]
[]
[]
[]
[]
[]
[]
[]
[]
[]
[]
[]
[]
[]
[]
[]
[]
[]
[]
[]
[]
[]
[]
[]
[]
[]
[]
[]
[]
[]
[]
[]
[]
[]
[]
[]
[]
[]
[]
[]
[]
[]
[]
[]
[]
[]
[]
[]
[]
[]
[]
[]
[]
[]
[]
[]
[]
[]
[]
[]
[]
[]
[]
[]
[]
[]
[]
[]
[]
[]
[]
[]
[]
[]
[]
[]
[]
[]
[]
[]
[]
[]
[]
[]
[]
[]
[]
[]
[]
[]
[]
[]
[]
[]
[]
[]
[]
[]
[]
[]
[]
[]
[]
[]
[]
[]
[]
[]
[]
[]
[]
[]
[]
[]
[]
[]
[]
[]
[]
[]
[]
[]
[]
[]
[]
[]
[]
[]
[]
[]
[]
[]
[]
[]
[]
[]
[]
[]
[]
[]
[]
[]
[]
[]
[]
[]
[]
[]
[]
[]
[]
[]
[]
[]
[]
[]
[]
[]
[]
[]
[]
[]
[]
[]
[]
[]
[]
[]
[]
[]
[]
[]
[]
[]
[]
[]
[]
[]
[]
[]
[]
[]
[]
[]
[]
[]
[]
[]
[]
[]
[]
[]
[]
[]
[]
[]
[]
[]
[]
[]
[]
[]
[]
[]
[]
[]
[]
[]
[]
[]
[]
[]
[]
[]
[]
[]
[]
[]
[]
[]
[]
[]
[]
[]
[]
[]
[]
[]
[]
[]
[]
[]
[]
[]
[]
[]
[]
[]
[]
[]
[]
[]
[]
[]
[]
[]
[]
[]
[]
[]
[]
[]
[]
[]
[]
[]
[]
[]
[]
[]
[]
[]
[]
[]
[]
[]
[]
[]
[]
[]
[]
[]
[]
[]
[]
[]
[]
[]
[]
[]
[]
[]
[]
[]
[]
[]
[]
[]
[]
[]
[]
[]
[]
[]
[]
[]
[]
[]
[]
[]
[]
[]
[]
[]
[]
[]
[]
[]
[]
[]
[]
[]
[]
[]
[]
[]
[]
[]
[]
[]
[]
[]
[]
[]
[]
[]
[]
[]
[]
[]
[]
[]
[]
[]
[]
[]
[]
[]
[]
[]
[]
[]
[]
[]
[]
[]
[]
[]
[]
[]
[]
[]
[]
[]
[]
[]
[]
[]
[]
[]
[]
[]
[]
[]
[]
[]
[]
[]
[]
[]
[]
[]
[]
[]
[]
[]
[]
[]
[]
[]
[]
[]
[]
[]
[]
[]
[]
[]
[]
[]
[]
[]
[]
[]
[]
[]
[]
[]
[]
[]
[]
[]
[]
[]
[]
[]
[]
[]
[]
[]
[]
[]
[]
[]
[]
[]
[]
[]
[]
[]
[]
[]
[]
[]
[]
[]
[]
[]
[]
[]
[]
[]
[]
[]
[]
[]
[]
[]
[]
[]
[]
[]
[]
[]
[]
[]
[]
[]
[]
[]
[]
[]
[]
[]
[]
[]
[]
[]
[]
[]
[]
[]
[]
[]
[]
[]
[]
[]
[]
[]
[]
[]
[]
[]
[]
[]
[]
[]
[]
[]
[]
[]
[]
[]
[]
[]
[]
[]
[]
[]
[]
[]
[]
[]
[]
[]
[]
[]
[]
[]
[]
[]
[]
[]
[]
[]
[]
[]
[]
[]
[]
[]
[]
[]
[]
[]
[]
[]
[]
[]
[]
[]
[]
[]
[]
[]
[]
[]
[]
[]
[]
[]
[]
[]
[]
[]
[]
[]
[]
[]
[]
[]
[]
[]
[]
[]
[]
[]
[]
[]
[]
[]
[]
[]
[]
[]
[]
[]
[]
[]
[]
[]
[]
[]
[]
[]
[]
[]
[]
[]
[]
[]
[]
[]
[]
[]
[]
[]
[]
[]
[]
[]
[]
[]
[]
[]
[]
[]
[]
[]
[]
[]
[]
[]
[]
[]
[]
[]
[]
[]
[]
[]
[]
[]
[]
[]
[]
[]
[]
[]
[]
[]
[]
[]
[]
[]
[]
[]
[]
[]
[]
[]
[]
[]
[]
[]
[]
[]
[]
[]
[]
[]
[]
[]
[]
[]
[]
[]
[]
[]
[]
[]
[]
[]
[]
[]
[]
[]
[]
[]
[]
[]
[]
[]
[]
[]
[]
[]
[]
[]
[]
[]
[]
[]
[]
[]
[]
[]
[]
[]
[]
[]
[]
[]
[]
[]
[]
[]
[]
[]
[]
[]
[]
[]
[]
[]
[]
[]
[]
[]
[]
[]
[]
[]
[]
[]
[]
[]
[]
[]
[]
[]
[]
[]
[]
[]
[]
[]
[]
[]
[]
[]
[]
[]
[]
[]
[]
[]
[]
[]
[]
[]
[]
[]
[]
[]
[]
[]
[]
[]
[]
[]
[]
[]
[]
[]
[]
[]
[]
[]
[]
[]
[]
[]
[]
[]
[]
[]
[]
[]
[]
[]
[]
[]
[]
[]
[]
[]
[]
[]
[]
[]
[]
[]
[]
[]
[]
[]
[]
[]
[]
[]
[]
[]
[]
[]
[]
[]
[]
[]
[]
[]
[]
[]
[]
[]
[]
[]
[]
[]
[]
[]
[]
[]
[]
[]
[]
[]
[]
[]
[]
[]
[]
[]
[]
[]
[]
[]
[]
[]
[]
[]
[]
[]
[]
[]
[]
[]
[]
[]
[]
[]
[]
[]
[]
[]
[]
[]
[]
[]
[]
[]
[]
[]
[]
[]
[]
[]
[]
[]
[]
[]
[]
[]
[]
[]
[]
[]
[]
[]
[]
[]
[]
[]
[]
[]
[]
[]
[]
[]
[]
[]
[]
[]
[]
[]
[]
[]
[]
[]
[]
[]
[]
[]
[]
[]
[]
[]
[]
[]
[]
[]
[]
[]
[]
[]
[]
[]
[]
[]
[]
[]
[]
[]
[]
[]
[]
[]
[]
[]
[]
[]
[]
[]
[]
[]
[]
[]
[]
[]
[]
[]
[]
[]
[]
[]
[]
[]
[]
[]
[]
[]
[]
[]
[]
[]
[]
[]
[]
[]
[]
[]
[]
[]
[]
[]
[]
[]
[]
[]
[]
[]
[]
[]
[]
[]
[]
[]
[]
[]
[]
[]
[]
[]
[]
[]
[]
[]
[]
[]
[]
[]
[]
[]
[]
[]
[]
[]
[]
[]
[]
[]
[]
[]
[]
[]
[]
[]
[]
[]
[]
[]
[]
[]
[]
[]
[]
[]
[]
[]
[]
[]
[]
[]
[]
[]
[]
[]
[]
[]
[]
[]
[]
[]
[]
[]
[]
[]
[]
[]
[]
[]
[]
[]
[]
[]
[]
[]
[]
[]
[]
[]
[]
[]
[]
[]
[]
[]
[]
[]
[]
[]
[]
[]
[]
[]
[]
[]
[]
[]
[]
[]
[]
[]
[]
[]
[]
[]
[]
[]
[]
[]
[]
[]
[]
[]
[]
[]
[]
[]
[]
[]
[]
[]
[]
[]
[]
[]
[]
[]
[]
[]
[]
[]
[]
[]
[]
[]
[]
[]
[]
[]
[]
[]
[]
[]
[]
[]
[]
[]
[]
[]
[]
[]
[]
[]
[]
[]
[]
[]
[]
[]
[]
[]
[]
[]
[]
[]
[]
[]
[]
[]
[]
[]
[]
[]
[]
[]
[]
[]
[]
[]
[]
[]
[]
[]
[]
[]
[]
[]
[]
[]
[]
[]
[]
[]
[]
[]
[]
[]
[]
[]
[]
[]
[]
[]
[]
[]
[]
[]
[]
[]
[]
[]
[]
[]
[]
[]
[]
[]
[]
[]
[]
[]
[]
[]
[]
[]
[]
[]
[]
[]
[]
[]
[]
[]
[]
[]
[]
[]
[]
[]
[]
[]
[]
[]
[]
[]
[]
[]
[]
[]
[]
[]
[]
[]
[]
[]
[]
[]
[]
[]
[]
[]
[]
[]
[]
[]
[]
[]
[]
[]
[]
[]
[]
[]
[]
[]
[]
[]
[]
[]
[]
[]
[]
[]
[]
[]
[]
[]
[]
[]
[]
[]
[]
[]
[]
[]
[]
[]
[]
[]
[]
[]
[]
[]
[]
[]
[]
[]
[]
[]
[]
[]
[]
[]
[]
[]
[]
[]
[]
[]
[]
[]
[]
[]
[]
[]
[]
[]
[]
[]
[]
[]
[]
[]
[]
[]
[]
[]
[]
[]
[]
[]
[]
[]
[]
[]
[]
[]
[]
[]
[]
[]
[]
[]
[]
[]
[]
[]
[]
[]
[]
[]
[]
[]
[]
[]
[]
[]
[]
[]
[]
[]
[]
[]
[]
[]
[]
[]
[]
[]
[]
[]
[]
[]
[]
[]
[]
[]
[]
[]
[]
[]
[]
[]
[]
[]
[]
[]
[]
[]
[]
[]
[]
[]
[]
[]
[]
[]
[]
[]
[]
[]
[]
[]
[]
[]
[]
[]
[]
[]
[]
[]
[]
[]
[]
[]
[]
[]
[]
[]
[]
[]
[]
[]
[]
[]
[]
[]
[]
[]
[]
[]
[]
[]
[]
[]
[]
[]
[]
[]
[]
[]
[]
[]
[]
[]
[]
[]
[]
[]
[]
[]
[]
[]
[]
[]
[]
[]
[]
[]
[]
[]
[]
[]
[]
[]
[]
[]
[]
[]
[]
[]
[]
[]
[]
[]
[]
[]
[]
[]
[]
[]
[]
[]
[]
[]
[]
[]
[]
[]
[]
[]
[]
[]
[]
[]
[]
[]
[]
[]
[]
[]
[]
[]
[]
[]
[]
[]
[]
[]
[]
[]
[]
[]
[]
[]
[]
[]
[]
[]
[]
[]
[]
[]
[]
[]
[]
[]
[]
[]
[]
[]
[]
[]
[]
[]
[]
[]
[]
[]
[]
[]
[]
[]
[]
[]
[]
[]
[]
[]
[]
[]
[]
[]
[]
[]
[]
[]
[]
[]
[]
[]
[]
[]
[]
[]
[]
[]
[]
[]
[]
[]
[]
[]
[]
[]
[]
[]
[]
[]
[]
[]
[]
[]
[]
[]
[]
[]
[]
[]
[]
[]
[]
[]
[]
[]
[]
[]
[]
[]
[]
[]
[]
[]
[]
[]
[]
[]
[]
[]
[]
[]
[]
[]
[]
[]
[]
[]
[]
[]
[]
[]
[]
[]
[]
[]
[]
[]
[]
[]
[]
[]
[]
[]
[]
[]
[]
[]
[]
[]
[]
[]
[]
[]
[]
[]
[]
[]
[]
[]
[]
[]
[]
[]
[]
[]
[]
[]
[]
[]
[]
[]
[]
[]
[]
[]
[]
[]
[]
[]
[]
[]
[]
[]
[]
[]
[]
[]
[]
[]
[]
[]
[]
[]
[]
[]
[]
[]
[]
[]
[]
[]
[]
[]
[]
[]
[]
[]
[]
[]
[]
[]
[]
[]
[]
[]
[]
[]
[]
[]
[]
[]
[]
[]
[]
[]
[]
[]
[]
[]
[]
[]
[]
[]
[]
[]
[]
[]
[]
[]
[]
[]
[]
[]
[]
[]
[]
[]
[]
[]
[]
[]
[]
[]
[]
[]
[]
[]
[]
[]
[]
[]
[]
[]
[]
[]
[]
[]
[]
[]
[]
[]
[]
[]
[]
[]
[]
[]
[]
[]
[]
[]
[]
[]
[]
[]
[]
[]
[]
[]
[]
[]
[]
[]
[]
[]
[]
[]
[]
[]
[]
[]
[]
[]
[]
[]
[]
[]
[]
[]
[]
[]
[]
[]
[]
[]
[]
[]
[]
[]
[]
[]
[]
[]
[]
[]
[]
[]
[]
[]
[]
[]
[]
[]
[]
[]
[]
[]
[]
[]
[]
[]
[]
[]
[]
[]
[]
[]
[]
[]
[]
[]
[]
[]
[]
[]
[]
[]
[]
[]
[]
[]
[]
[]
[]
[]
[]
[]
[]
[]
[]
[]
[]
[]
[]
[]
[]
[]
[]
[]
[]
[]
[]
[]
[]
[]
[]
[]
[]
[]
[]
[]
[]
[]
[]
[]
[]
[]
[]
[]
[]
[]
[]
[]
[]
[]
[]
[]
[]
[]
[]
[]
[]
[]
[]
[]
[]
[]
[]
[]
[]
[]
[]
[]
[]
[]
[]
[]
[]
[]
[]
[]
[]
[]
[]
[]
[]
[]
[]
[]
[]
[]
[]
[]
[]
[]
[]
[]
[]
[]
[]
[]
[]
[]
[]
[]
[]
[]
[]
[]
[]
[]
[]
[]
[]
[]
[]
[]
[]
[]
[]
[]
[]
[]
[]
[]
[]
[]
[]
[]
[]
[]
[]
[]
[]
[]
[]
[]
[]
[]
[]
[]
[]
[]
[]
[]
[]
[]
[]
[]
[]
[]
[]
[]
[]
[]
[]
[]
[]
[]
[]
[]
[]
[]
[]
[]
[]
[]
[]
[]
[]
[]
[]
[]
[]
[]
[]
[]
[]
[]
[]
[]
[]
[]
[]
[]
[]
[]
[]
[]
[]
[]
[]
[]
[]
[]
[]
[]
[]
[]
[]
[]
[]
[]
[]
[]
[]
[]
[]
[]
[]
[]
[]
[]
[]
[]
[]
[]
[]
[]
[]
[]
[]
[]
[]
[]
[]
[]
[]
[]
[]
[]
[]
[]
[]
[]
[]
[]
[]
[]
[]
[]
[]
[]
[]
[]
[]
[]
[]
[]
[]
[]
[]
[]
[]
[]
[]
[]
[]
[]
[]
[]
[]
[]
[]
[]
[]
[]
[]
[]
[]
[]
[]
[]
[]
[]
[]
[]
[]
[]
[]
[]
[]
[]
[]
[]
[]
[]
[]
[]
[]
[]
[]
[]
[]
[]
[]
[]
[]
[]
[]
[]
[]
[]
[]
[]
[]
[]
[]
[]
[]
[]
[]
[]
[]
[]
[]
[]
[]
[]
[]
[]
[]
[]
[]
[]
[]
[]
[]
[]
[]
[]
[]
[]
[]
[]
[]
[]
[]
[]
[]
[]
[]
[]
[]
[]
[]
[]
[]
[]
[]
[]
[]
[]
[]
[]
[]
[]
[]
[]
[]
[]
[]
[]
[]
[]
[]
[]
[]
[]
[]
[]
[]
[]
[]
[]
[]
[]
[]
[]
[]
[]
[]
[]
[]
[]
[]
[]
[]
[]
[]
[]
[]
[]
[]
[]
[]
[]
[]
[]
[]
[]
[]
[]
[]
[]
[]
[]
[]
[]
[]
[]
[]
[]
[]
[]
[]
[]
[]
[]
[]
[]
[]
[]
[]
[]
[]
[]
[]
[]
[]
[]
[]
[]
[]
[]
[]
[]
[]
[]
[]
[]
[]
[]
[]
[]
[]
[]
[]
[]
[]
[]
[]
[]
[]
[]
[]
[]
[]
[]
[]
[]
[]
[]
[]
[]
[]
[]
[]
[]
[]
[]
[]
[]
[]
[]
[]
[]
[]
[]
[]
[]
[]
[]
[]
[]
[]
[]
[]
[]
[]
[]
[]
[]
[]
[]
[]
[]
[]
[]
[]
[]
[]
[]
[]
[]
[]
[]
[]
[]
[]
[]
[]
[]
[]
[]
[]
[]
[]
[]
[]
[]
[]
[]
[]
[]
[]
[]
[]
[]
[]
[]
[]
[]
[]
[]
[]
[]
[]
[]
[]
[]
[]
[]
[]
[]
[]
[]
[]
[]
[]
[]
[]
[]
[]
[]
[]
[]
[]
[]
[]
[]
[]
[]
[]
[]
[]
[]
[]
[]
[]
[]
[]
[]
[]
[]
[]
[]
[]
[]
[]
[]
[]
[]
[]
[]
[]
[]
[]
[]
[]
[]
[]
[]
[]
[]
[]
[]
[]
[]
[]
[]
[]
[]
[]
[]
[]
[]
[]
[]
[]
[]
[]
[]
[]
[]
[]
[]
[]
[]
[]
[]
[]
[]
[]
[]
[]
[]
[]
[]
[]
[]
[]
[]
[]
[]
[]
[]
[]
[]
[]
[]
[]
[]
[]
[]
[]
[]
[]
[]
[]
[]
[]
[]
[]
[]
[]
[]
[]
[]
[]
[]
[]
[]
[]
[]
[]
[]
[]
[]
[]
[]
[]
[]
[]
[]
[]
[]
[]
[]
[]
[]
[]
[]
[]
[]
[]
[]
[]
[]
[]
[]
[]
[]
[]
[]
[]
[]
[]
[]
[]
[]
[]
[]
[]
[]
[]
[]
[]
[]
[]
[]
[]
[]
[]
[]
[]
[]
[]
[]
[]
[]
[]
[]
[]
[]
[]
[]
[]
[]
[]
[]
[]
[]
[]
[]
[]
[]
[]
[]
[]
[]
[]
[]
[]
[]
[]
[]
[]
[]
[]
[]
[]
[]
[]
[]
[]
[]
[]
[]
[]
[]
[]
[]
[]
[]
[]
[]
[]
[]
[]
[]
[]
[]
[]
[]
[]
[]
[]
[]
[]
[]
[]
[]
[]
[]
[]
[]
[]
[]
[]
[]
[]
[]
[]
[]
[]
[]
[]
[]
[]
[]
[]
[]
[]
[]
[]
[]
[]
[]
[]
[]
[]
[]
[]
[]
[]
[]
[]
[]
[]
[]
[]
[]
[]
[]
[]
[]
[]
[]
[]
[]
[]
[]
[]
[]
[]
[]
[]
[]
[]
[]
[]
[]
[]
[]
[]
[]
[]
[]
[]
[]
[]
[]
[]
[]
[]
[]
[]
[]
[]
[]
[]
[]
[]
[]
[]
[]
[]
[]
[]
[]
[]
[]
[]
[]
[]
[]
[]
[]
[]
[]
[]
[]
[]
[]
[]
[]
[]
[]
[]
[]
[]
[]
[]
[]
[]
[]
[]
[]
[]
[]
[]
[]
[]
[]
[]
[]
[]
[]
[]
[]
[]
[]
[]
[]
[]
[]
[]
[]
[]
[]
[]
[]
[]
[]
[]
[]
[]
[]
[]
[]
[]
[]
[]
[]
[]
[]
[]
[]
[]
[]
[]
[]
[]
[]
[]
[]
[]
[]
[]
[]
[]
[]
[]
[]
[]
[]
[]
[]
[]
[]
[]
[]
[]
[]
[]
[]
[]
[]
[]
[]
[]
[]
[]
[]
[]
[]
[]
[]
[]
[]
[]
[]
[]
[]
[]
[]
[]
[]
[]
[]
[]
[]
[]
[]
[]
[]
[]
[]
[]
[]
[]
[]
[]
[]
[]
[]
[]
[]
[]
[]
[]
[]
[]
[]
[]
[]
[]
[]
[]
[]
[]
[]
[]
[]
[]
[]
[]
[]
[]
[]
[]
[]
[]
[]
[]
[]
[]
[]
[]
[]
[]
[]
[]
[]
[]
[]
[]
[]
[]
[]
[]
[]
[]
[]
[]
[]
[]
[]
[]
[]
[]
[]
[]
[]
[]
[]
[]
[]
[]
[]
[]
[]
[]
[]
[]
[]
[]
[]
[]
[]
[]
[]
[]
[]
[]
[]
[]
[]
[]
[]
[]
[]
[]
[]
[]
[]
[]
[]
[]
[]
[]
[]
[]
[]
[]
[]
[]
[]
[]
[]
[]
[]
[]
[]
[]
[]
[]
[]
[]
[]
[]
[]
[]
[]
[]
[]
[]
[]
[]
[]
[]
[]
[]
[]
[]
[]
[]
[]
[]
[]
[]
[]
[]
[]
[]
[]
[]
[]
[]
[]
[]
[]
[]
[]
[]
[]
[]
[]
[]
[]
[]
[]
[]
[]
[]
[]
[]
[]
[]
[]
[]
[]
[]
[]
[]
[]
[]
[]
[]
[]
[]
[]
[]
[]
[]
[]
[]
[]
[]
[]
[]
[]
[]
[]
[]
[]
[]
[]
[]
[]
[]
[]
[]
[]
[]
[]
[]
[]
[]
[]
[]
[]
[]
[]
[]
[]
[]
[]
[]
[]
[]
[]
[]
[]
[]
[]
[]
[]
[]
[]
[]
[]
[]
[]
[]
[]
[]
[]
[]
[]
[]
[]
[]
[]
[]
[]
[]
[]
[]
[]
[]
[]
[]
[]
[]
[]
[]
[]
[]
[]
[]
[]
[]
[]
[]
[]
[]
[]
[]
[]
[]
[]
[]
[]
[]
[]
[]
[]
[]
[]
[]
[]
[]
[]
[]
[]
[]
[]
[]
[]
[]
[]
[]
[]
[]
[]
[]
[]
[]
[]
[]
[]
[]
[]
[]
[]
[]
[]
[]
[]
[]
[]
[]
[]
[]
[]
[]
[]
[]
[]
[]
[]
[]
[]
[]
[]
[]
[]
[]
[]
[]
[]
[]
[]
[]
[]
[]
[]
[]
[]
[]
[]
[]
[]
[]
[]
[]
[]
[]
[]
[]
[]
[]
[]
[]
[]
[]
[]
[]
[]
[]
[]
[]
[]
[]
[]
[]
[]
[]
[]
[]
[]
[]
[]
[]
[]
[]
[]
[]
[]
[]
[]
[]
[]
[]
[]
[]
[]
[]
[]
[]
[]
[]
[]
[]
[]
[]
[]
[]
[]
[]
[]
[]
[]
[]
[]
[]
[]
[]
[]
[]
[]
[]
[]
[]
[]
[]
[]
[]
[]
[]
[]
[]
[]
[]
[]
[]
[]
[]
[]
[]
[]
[]
[]
[]
[]
[]
[]
[]
[]
[]
[]
[]
[]
[]
[]
[]
[]
[]
[]
[]
[]
[]
[]
[]
[]
[]
[]
[]
[]
[]
[]
[]
[]
[]
[]
[]
[]
[]
[]
[]
[]
[]
[]
[]
[]
[]
[]
[]
[]
[]
[]
[]
[]
[]
[]
[]
[]
[]
[]
[]
[]
[]
[]
[]
[]
[]
[]
[]
[]
[]
[]
[]
[]
[]
[]
[]
[]
[]
[]
[]
[]
[]
[]
[]
[]
[]
[]
[]
[]
[]
[]
[]
[]
[]
[]
[]
[]
[]
[]
[]
[]
[]
[]
[]
[]
[]
[]
[]
[]
[]
[]
[]
[]
[]
[]
[]
[]
[]
[]
[]
[]
[]
[]
[]
[]
[]
[]
[]
[]
[]
[]
[]
[]
[]
[]
[]
[]
[]
[]
[]
[]
[]
[]
[]
[]
[]
[]
[]
[]
[]
[]
[]
[]
[]
[]
[]
[]
[]
[]
[]
[]
[]
[]
[]
[]
[]
[]
[]
[]
[]
[]
[]
[]
[]
[]
[]
[]
[]
[]
[]
[]
[]
[]
[]
[]
[]
[]
[]
[]
[]
[]
[]
[]
[]
[]
[]
[]
[]
[]
[]
[]
[]
[]
[]
[]
[]
[]
[]
[]
[]
[]
[]
[]
[]
[]
[]
[]
[]
[]
[]
[]
[]
[]
[]
[]
[]
[]
[]
[]
[]
[]
[]
[]
[]
[]
[]
[]
[]
[]
[]
[]
[]
[]
[]
[]
[]
[]
[]
[]
[]
[]
[]
[]
[]
[]
[]
[]
[]
[]
[]
[]
[]
[]
[]
[]
[]
[]
[]
[]
[]
[]
[]
[]
[]
[]
[]
[]
[]
[]
[]
[]
[]
[]
[]
[]
[]
[]
[]
[]
[]
[]
[]
[]
[]
[]
[]
[]
[]
[]
[]
[]
[]
[]
[]
[]
[]
[]
[]
[]
[]
[]
[]
[]
[]
[]
[]
[]
[]
[]
[]
[]
[]
[]
[]
[]
[]
[]
[]
[]
[]
[]
[]
[]
[]
[]
[]
[]
[]
[]
[]
[]
[]
[]
[]
[]
[]
[]
[]
[]
[]
[]
[]
[]
[]
[]
[]
[]
[]
[]
[]
[]
[]
[]
[]
[]
[]
[]
[]
[]
[]
[]
[]
[]
[]
[]
[]
[]
[]
[]
[]
[]
[]
[]
[]
[]
[]
[]
[]
[]
[]
[]
[]
[]
[]
[]
[]
[]
[]
[]
[]
[]
[]
[]
[]
[]
[]
[]
[]
[]
[]
[]
[]
[]
[]
[]
[]
[]
[]
[]
[]
[]
[]
[]
[]
[]
[]
[]
[]
[]
[]
[]
[]
[]
[]
[]
[]
[]
[]
[]
[]
[]
[]
[]
[]
[]
[]
[]
[]
[]
[]
[]
[]
[]
[]
[]
[]
[]
[]
[]
[]
[]
[]
[]
[]
[]
[]
[]
[]
[]
[]
[]
[]
[]
[]
[]
[]
[]
[]
[]
[]
[]
[]
[]
[]
[]
[]
[]
[]
[]
[]
[]
[]
[]
[]
[]
[]
[]
[]
[]
[]
[]
[]
[]
[]
[]
[]
[]
[]
[]
[]
[]
[]
[]
[]
[]
[]
[]
[]
[]
[]
[]
[]
[]
[]
[]
[]
[]
[]
[]
[]
[]
[]
[]
[]
[]
[]
[]
[]
[]
[]
[]
[]
[]
[]
[]
[]
[]
[]
[]
[]
[]
[]
[]
[]
[]
[]
[]
[]
[]
[]
[]
[]
[]
[]
[]
[]
[]
[]
[]
[]
[]
[]
[]
[]
[]
[]
[]
[]
[]
[]
[]
[]
[]
[]
[]
[]
[]
[]
[]
[]
[]
[]
[]
[]
[]
[]
[]
[]
[]
[]
[]
[]
[]
[]
[]
[]
[]
[]
[]
[]
[]
[]
[]
[]
[]
[]
[]
[]
[]
[]
[]
[]
[]
[]
[]
[]
[]
[]
[]
[]
[]
[]
[]
[]
[]
[]
[]
[]
[]
[]
[]
[]
[]
[]
[]
[]
[]
[]
[]
[]
[]
[]
[]
[]
[]
[]
[]
[]
[]
[]
[]
[]
[]
[]
[]
[]
[]
[]
[]
[]
[]
[]
[]
[]
[]
[]
[]
[]
[]
[]
[]
[]
[]
[]
[]
[]
[]
[]
[]
[]
[]
[]
[]
[]
[]
[]
[]
[]
[]
[]
[]
[]
[]
[]
[]
[]
[]
[]
[]
[]
[]
[]
[]
[]
[]
[]
[]
[]
[]
[]
[]
[]
[]
[]
[]
[]
[]
[]
[]
[]
[]
[]
[]
[]
[]
[]
[]
[]
[]
[]
[]
[]
[]
[]
[]
[]
[]
[]
[]
[]
[]
[]
[]
[]
[]
[]
[]
[]
[]
[]
[]
[]
[]
[]
[]
[]
[]
[]
[]
[]
[]
[]
[]
[]
[]
[]
[]
[]
[]
[]
[]
[]
[]
[]
[]
[]
[]
[]
[]
[]
[]
[]
[]
[]
[]
[]
[]
[]
[]
[]
[]
[]
[]
[]
[]
[]
[]
[]
[]
[]
[]
[]
[]
[]
[]
[]
[]
[]
[]
[]
[]
[]
[]
[]
[]
[]
[]
[]
[]
[]
[]
[]
[]
[]
[]
[]
[]
[]
[]
[]
[]
[]
[]
[]
[]
[]
[]
[]
[]
[]
[]
[]
[]
[]
[]
[]
[]
[]
[]
[]
[]
[]
[]
[]
[]
[]
[]
[]
[]
[]
[]
[]
[]
[]
[]
[]
[]
[]
[]
[]
[]
[]
[]
[]
[]
[]
[]
[]
[]
[]
[]
[]
[]
[]
[]
[]
[]
[]
[]
[]
[]
[]
[]
[]
[]
[]
[]
[]
[]
[]
[]
[]
[]
[]
[]
[]
[]
[]
[]
[]
[]
[]
[]
[]
[]
[]
[]
[]
[]
[]
[]
[]
[]
[]
[]
[]
[]
[]
[]
[]
[]
[]
[]
[]
[]
[]
[]
[]
[]
[]
[]
[]
[]
[]
[]
[]
[]
[]
[]
[]
[]
[]
[]
[]
[]
[]
[]
[]
[]
[]
[]
[]
[]
[]
[]
[]
[]
[]
[]
[]
[]
[]
[]
[]
[]
[]
[]
[]
[]
[]
[]
[]
[]
[]
[]
[]
[]
[]
[]
[]
[]
[]
[]
[]
[]
[]
[]
[]
[]
[]
[]
[]
[]
[]
[]
[]
[]
[]
[]
[]
[]
[]
[]
[]
[]
[]
[]
[]
[]
[]
[]
[]
[]
[]
[]
[]
[]
[]
[]
[]
[]
[]
[]
[]
[]
[]
[]
[]
[]
[]
[]
[]
[]
[]
[]
[]
[]
[]
[]
[]
[]
[]
[]
[]
[]
[]
[]
[]
[]
[]
[]
[]
[]
[]
[]
[]
[]
[]
[]
[]
[]
[]
[]
[]
[]
[]
[]
[]
[]
[]
[]
[]
[]
[]
[]
[]
[]
[]
[]
[]
[]
[]
[]
[]
[]
[]
[]
[]
[]
[]
[]
[]
[]
[]
[]
[]
[]
[]
[]
[]
[]
[]
[]
[]
[]
[]
[]
[]
[]
[]
[]
[]
[]
[]
[]
[]
[]
[]
[]
[]
[]
[]
[]
[]
[]
[]
[]
[]
[]
[]
[]
[]
[]
[]
[]
[]
[]
[]
[]
[]
[]
[]
[]
[]
[]
[]
[]
[]
[]
[]
[]
[]
[]
[]
[]
[]
[]
[]
[]
[]
[]
[]
[]
[]
[]
[]
[]
[]
[]
[]
[]
[]
[]
[]
[]
[]
[]
[]
[]
[]
[]
[]
[]
[]
[]
[]
[]
[]
[]
[]
[]
[]
[]
[]
[]
[]
[]
[]
[]
[]
[]
[]
[]
[]
[]
[]
[]
[]
[]
[]
[]
[]
[]
[]
[]
[]
[]
[]
[]
[]
[]
[]
[]
[]
[]
[]
[]
[]
[]
[]
[]
[]
[]
[]
[]
[]
[]
[]
[]
[]
[]
[]
[]
[]
[]
[]
[]
[]
[]
[]
[]
[]
[]
[]
[]
[]
[]
[]
[]
[]
[]
[]
[]
[]
[]
[]
[]
[]
[]
[]
[]
[]
[]
[]
[]
[]
[]
[]
[]
[]
[]
[]
[]
[]
[]
[]
[]
[]
[]
[]
[]
[]
[]
[]
[]
[]
[]
[]
[]
[]
[]
[]
[]
[]
[]
[]
[]
[]
[]
[]
[]
[]
[]
[]
[]
[]
[]
[]
[]
[]
[]
[]
[]
[]
[]
[]
[]
[]
[]
[]
[]
[]
[]
[]
[]
[]
[]
[]
[]
[]
[]
[]
[]
[]
[]
[]
[]
[]
[]
[]
[]
[]
[]
[]
[]
[]
[]
[]
[]
[]
[]
[]
[]
[]
[]
[]
[]
[]
[]
[]
[]
[]
[]
[]
[]
[]
[]
[]
[]
[]
[]
[]
[]
[]
[]
[]
[]
[]
[]
[]
[]
[]
[]
[]
[]
[]
[]
[]
[]
[]
[]
[]
[]
[]
[]
[]
[]
[]
[]
[]
[]
[]
[]
[]
[]
[]
[]
[]
[]
[]
[]
[]
[]
[]
[]
[]
[]
[]
[]
[]
[]
[]
[]
[]
[]
[]
[]
[]
[]
[]
[]
[]
[]
[]
[]
[]
[]
[]
[]
[]
[]
[]
[]
[]
[]
[]
[]
[]
[]
[]
[]
[]
[]
[]
[]
[]
[]
[]
[]
[]
[]
[]
[]
[]
[]
[]
[]
[]
[]
[]
[]
[]
[]
[]
[]
[]
[]
[]
[]
[]
[]
[]
[]
[]
[]
[]
[]
[]
[]
[]
[]
[]
[]
[]
[]
[]
[]
[]
[]
[]
[]
[]
[]
[]
[]
[]
[]
[]
[]
[]
[]
[]
[]
[]
[]
[]
[]
[]
[]
[]
[]
[]
[]
[]
[]
[]
[]
[]
[]
[]
[]
[]
[]
[]
[]
[]
[]
[]
[]
[]
[]
[]
[]
[]
[]
[]
[]
[]
[]
[]
[]
[]
[]
[]
[]
[]
[]
[]
[]
[]
[]
[]
[]
[]
[]
[]
[]
[]
[]
[]
[]
[]
[]
[]
[]
[]
[]
[]
[]
[]
[]
[]
[]
[]
[]
[]
[]
[]
[]
[]
[]
[]
[]
[]
[]
[]
[]
[]
[]
[]
[]
[]
[]
[]
[]
[]
[]
[]
[]
[]
[]
[]
[]
[]
[]
[]
[]
[]
[]
[]
[]
[]
[]
[]
[]
[]
[]
[]
[]
[]
[]
[]
[]
[]
[]
[]
[]
[]
[]
[]
[]
[]
[]
[]
[]
[]
[]
[]
[]
[]
[]
[]
[]
[]
[]
[]
[]
[]
[]
[]
[]
[]
[]
[]
[]
[]
[]
[]
[]
[]
[]
[]
[]
[]
[]
[]
[]
[]
[]
[]
[]
[]
[]
[]
[]
[]
[]
[]
[]
[]
[]
[]
[]
[]
[]
[]
[]
[]
[]
[]
[]
[]
[]
[]
[]
[]
[]
[]
[]
[]
[]
[]
[]
[]
[]
[]
[]
[]
[]
[]
[]
[]
[]
[]
[]
[]
[]
[]
[]
[]
[]
[]
[]
[]
[]
[]
[]
[]
[]
[]
[]
[]
[]
[]
[]
[]
[]
[]
[]
[]
[]
[]
[]
[]
[]
[]
[]
[]
[]
[]
[]
[]
[]
[]
[]
[]
[]
[]
[]
[]
[]
[]
[]
[]
[]
[]
[]
[]
[]
[]
[]
[]
[]
[]
[]
[]
[]
[]
[]
[]
[]
[]
[]
[]
[]
[]
[]
[]
[]
[]
[]
[]
[]
[]
[]
[]
[]
[]
[]
[]
[]
[]
[]
[]
[]
[]
[]
[]
[]
[]
[]
[]
[]
[]
[]
[]
[]
[]
[]
[]
[]
[]
[]
[]
[]
[]
[]
[]
[]
[]
[]
[]
[]
[]
[]
[]
[]
[]
[]
[]
[]
[]
[]
[]
[]
[]
[]
[]
[]
[]
[]
[]
[]
[]
[]
[]
[]
[]
[]
[]
[]
[]
[]
[]
[]
[]
[]
[]
[]
[]
[]
[]
[]
[]
[]
[]
[]
[]
[]
[]
[]
[]
[]
[]
[]
[]
[]
[]
[]
[]
[]
[]
[]
[]
[]
[]
[]
[]
[]
[]
[]
[]
[]
[]
[]
[]
[]
[]
[]
[]
[]
[]
[]
[]
[]
[]
[]
[]
[]
[]
[]
[]
[]
[]
[]
[]
[]
[]
[]
[]
[]
[]
[]
[]
[]
[]
[]
[]
[]
[]
[]
[]
[]
[]
[]
[]
[]
[]
[]
[]
[]
[]
[]
[]
[]
[]
[]
[]
[]
[]
[]
[]
[]
[]
[]
[]
[]
[]
[]
[]
[]
[]
[]
[]
[]
[]
[]
[]
[]
[]
[]
[]
[]
[]
[]
[]
[]
[]
[]
[]
[]
[]
[]
[]
[]
[]
[]
[]
[]
[]
[]
[]
[]
[]
[]
[]
[]
[]
[]
[]
[]
[]
[]
[]
[]
[]
[]
[]
[]
[]
[]
[]
[]
[]
[]
[]
[]
[]
[]
[]
[]
[]
[]
[]
[]
[]
[]
[]
[]
[]
[]
[]
[]
[]
[]
[]
[]
[]
[]
[]
[]
[]
[]
[]
[]
[]
[]
[]
[]
[]
[]
[]
[]
[]
[]
[]
[]
[]
[]
[]
[]
[]
[]
[]
[]
[]
[]
[]
[]
[]
[]
[]
[]
[]
[]
[]
[]
[]
[]
[]
[]
[]
[]
[]
[]
[]
[]
[]
[]
[]
[]
[]
[]
[]
[]
[]
[]
[]
[]
[]
[]
[]
[]
[]
[]
[]
[]
[]
[]
[]
[]
[]
[]
[]
[]
[]
[]
[]
[]
[]
[]
[]
[]
[]
[]
[]
[]
[]
[]
[]
[]
[]
[]
[]
[]
[]
[]
[]
[]
[]
[]
[]
[]
[]
[]
[]
[]
[]
[]
[]
[]
[]
[]
[]
[]
[]
[]
[]
[]
[]
[]
[]
[]
[]
[]
[]
[]
[]
[]
[]
[]
[]
[]
[]
[]
[]
[]
[]
[]
[]
[]
[]
[]
[]
[]
[]
[]
[]
[]
[]
[]
[]
[]
[]
[]
[]
[]
[]
[]
[]
[]
[]
[]
[]
[]
[]
[]
[]
[]
[]
[]
[]
[]
[]
[]
[]
[]
[]
[]
[]
[]
[]
[]
[]
[]
[]
[]
[]
[]
[]
[]
[]
[]
[]
[]
[]
[]
[]
[]
[]
[]
[]
[]
[]
[]
[]
[]
[]
[]
[]
[]
[]
[]
[]
[]
[]
[]
[]
[]
[]
[]
[]
[]
[]
[]
[]
[]
[]
[]
[]
[]
[]
[]
[]
[]
[]
[]
[]
[]
[]
[]
[]
[]
[]
[]
[]
[]
[]
[]
[]
[]
[]
[]
[]
[]
[]
[]
[]
[]
[]
[]
[]
[]
[]
[]
[]
[]
[]
[]
[]
[]
[]
[]
[]
[]
[]
[]
[]
[]
[]
[]
[]
[]
[]
[]
[]
[]
[]
[]
[]
[]
[]
[]
[]
[]
[]
[]
[]
[]
[]
[]
[]
[]
[]
[]
[]
[]
[]
[]
[]
[]
[]
[]
[]
[]
[]
[]
[]
[]
[]
[]
[]
[]
[]
[]
[]
[]
[]
[]
[]
[]
[]
[]
[]
[]
[]
[]
[]
[]
[]
[]
[]
[]
[]
[]
[]
[]
[]
[]
[]
[]
[]
[]
[]
[]
[]
[]
[]
[]
[]
[]
[]
[]
[]
[]
[]
[]
[]
[]
[]
[]
[]
[]
[]
[]
[]
[]
[]
[]
[]
[]
[]
[]
[]
[]
[]
[]
[]
[]
[]
[]
[]
[]
[]
[]
[]
[]
[]
[]
[]
[]
[]
[]
[]
[]
[]
[]
[]
[]
[]
[]
[]
[]
[]
[]
[]
[]
[]
[]
[]
[]
[]
[]
[]
[]
[]
[]
[]
[]
[]
[]
[]
[]
[]
[]
[]
[]
[]
[]
[]
[]
[]
[]
[]
[]
[]
[]
[]
[]
[]
[]
[]
[]
[]
[]
[]
[]
[]
[]
[]
[]
[]
[]
[]
[]
[]
[]
[]
[]
[]
[]
[]
[]
[]
[]
[]
[]
[]
[]
[]
[]
[]
[]
[]
[]
[]
[]
[]
[]
[]
[]
[]
[]
[]
[]
[]
[]
[]
[]
[]
[]
[]
[]
[]
[]
[]
[]
[]
[]
[]
[]
[]
[]
[]
[]
[]
[]
[]
[]
[]
[]
[]
[]
[]
[]
[]
[]
[]
[]
[]
[]
[]
[]
[]
[]
[]
[]
[]
[]
[]
[]
[]
[]
[]
[]
[]
[]
[]
[]
[]
[]
[]
[]
[]
[]
[]
[]
[]
[]
[]
[]
[]
[]
[]
[]
[]
[]
[]
[]
[]
[]
[]
[]
[]
[]
[]
[]
[]
[]
[]
[]
[]
[]
[]
[]
[]
[]
[]
[]
[]
[]
[]
[]
[]
[]
[]
[]
[]
[]
[]
[]
[]
[]
[]
[]
[]
[]
[]
[]
[]
[]
[]
[]
[]
[]
[]
[]
[]
[]
[]
[]
[]
[]
[]
[]
[]
[]
[]
[]
[]
[]
[]
[]
[]
[]
[]
[]
[]
[]
[]
[]
[]
[]
[]
[]
[]
[]
[]
[]
[]
[]
[]
[]
[]
[]
[]
[]
[]
[]
[]
[]
[]
[]
[]
[]
[]
[]
[]
[]
[]
[]
[]
[]
[]
[]
[]
[]
[]
[]
[]
[]
[]
[]
[]
[]
[]
[]
[]
[]
[]
[]
[]
[]
[]
[]
[]
[]
[]
[]
[]
[]
[]
[]
[]
[]
[]
[]
[]
[]
[]
[]
[]
[]
[]
[]
[]
[]
[]
[]
[]
[]
[]
[]
[]
[]
[]
[]
[]
[]
[]
[]
[]
[]
[]
[]
[]
[]
[]
[]
[]
[]
[]
[]
[]
[]
[]
[]
[]
[]
[]
[]
[]
[]
[]
[]
[]
[]
[]
[]
[]
[]
[]
[]
[]
[]
[]
[]
[]
[]
[]
[]
[]
[]
[]
[]
[]
[]
[]
[]
[]
[]
[]
[]
[]
[]
[]
[]
[]
[]
[]
[]
[]
[]
[]
[]
[]
[]
[]
[]
[]
[]
[]
[]
[]
[]
[]
[]
[]
[]
[]
[]
[]
[]
[]
[]
[]
[]
[]
[]
[]
[]
[]
[]
[]
[]
[]
[]
[]
[]
[]
[]
[]
[]
[]
[]
[]
[]
[]
[]
[]
[]
[]
[]
[]
[]
[]
[]
[]
[]
[]
[]
[]
[]
[]
[]
[]
[]
[]
[]
[]
[]
[]
[]
[]
[]
[]
[]
[]
[]
[]
[]
[]
[]
[]
[]
[]
[]
[]
[]
[]
[]
[]
[]
[]
[]
[]
[]
[]
[]
[]
[]
[]
[]
[]
[]
[]
[]
[]
[]
[]
[]
[]
[]
[]
[]
[]
[]
[]
[]
[]
[]
[]
[]
[]
[]
[]
[]
[]
[]
[]
[]
[]
[]
[]
[]
[]
[]
[]
[]
[]
[]
[]
[]
[]
[]
[]
[]
[]
[]
[]
[]
[]
[]
[]
[]
[]
[]
[]
[]
[]
[]
[]
[]
[]
[]
[]
[]
[]
[]
[]
[]
[]
[]
[]
[]
[]
[]
[]
[]
[]
[]
[]
[]
[]
[]
[]
[]
[]
[]
[]
[]
[]
[]
[]
[]
[]
[]
[]
[]
[]
[]
[]
[]
[]
[]
[]
[]
[]
[]
[]
[]
[]
[]
[]
[]
[]
[]
[]
[]
[]
[]
[]
[]
[]
[]
[]
[]
[]
[]
[]
[]
[]
[]
[]
[]
[]
[]
[]
[]
[]
[]
[]
[]
[]
[]
[]
[]
[]
[]
[]
[]
[]
[]
[]
[]
[]
[]
[]
[]
[]
[]
[]
[]
[]
[]
[]
[]
[]
[]
[]
[]
[]
[]
[]
[]
[]
[]
[]
[]
[]
[]
[]
[]
[]
[]
[]
[]
[]
[]
[]
[]
[]
[]
[]
[]
[]
[]
[]
[]
[]
[]
[]
[]
[]
[]
[]
[]
[]
[]
[]
[]
[]
[]
[]
[]
[]
[]
[]
[]
[]
[]
[]
[]
[]
[]
[]
[]
[]
[]
[]
[]
[]
[]
[]
[]
[]
[]
[]
[]
[]
[]
[]
[]
[]
[]
[]
[]
[]
[]
[]
[]
[]
[]
[]
[]
[]
[]
[]
[]
[]
[]
[]
[]
[]
[]
[]
[]
[]
[]
[]
[]
[]
[]
[]
[]
[]
[]
[]
[]
[]
[]
[]
[]
[]
[]
[]
[]
[]
[]
[]
[]
[]
[]
[]
[]
[]
[]
[]
[]
[]
[]
[]
[]
[]
[]
[]
[]
[]
[]
[]
[]
[]
[]
[]
[]
[]
[]
[]
[]
[]
[]
[]
[]
[]
[]
[]
[]
[]
[]
[]
[]
[]
[]
[]
[]
[]
[]
[]
[]
[]
[]
[]
[]
[]
[]
[]
[]
[]
[]
[]
[]
[]
[]
[]
[]
[]
[]
[]
[]
[]
[]
[]
[]
[]
[]
[]
[]
[]
[]
[]
[]
[]
[]
[]
[]
[]
[]
[]
[]
[]
[]
[]
[]
[]
[]
[]
[]
[]
[]
[]
[]
[]
[]
[]
[]
[]
[]
[]
[]
[]
[]
[]
[]
[]
[]
[]
[]
[]
[]
[]
[]
[]
[]
[]
[]
[]
[]
[]
[]
[]
[]
[]
[]
[]
[]
[]
[]
[]
[]
[]
[]
[]
[]
[]
[]
[]
[]
[]
[]
[]
[]
[]
[]
[]
[]
[]
[]
[]
[]
[]
[]
[]
[]
[]
[]
[]
[]
[]
[]
[]
[]
[]
[]
[]
[]
[]
[]
[]
[]
[]
[]
[]
[]
[]
[]
[]
[]
[]
[]
[]
[]
[]
[]
[]
[]
[]
[]
[]
[]
[]
[]
[]
[]
[]
[]
[]
[]
[]
[]
[]
[]
[]
[]
[]
[]
[]
[]
[]
[]
[]
[]
[]
[]
[]
[]
[]
[]
[]
[]
[]
[]
[]
[]
[]
[]
[]
[]
[]
[]
[]
[]
[]
[]
[]
[]
[]
[]
[]
[]
[]
[]
[]
[]
[]
[]
[]
[]
[]
[]
[]
[]
[]
[]
[]
[]
[]
[]
[]
[]
[]
[]
[]
[]
[]
[]
[]
[]
[]
[]
[]
[]
[]
[]
[]
[]
[]
[]
[]
[]
[]
[]
[]
[]
[]
[]
[]
[]
[]
[]
[]
[]
[]
[]
[]
[]
[]
[]
[]
[]
[]
[]
[]
[]
[]
[]
[]
[]
[]
[]
[]
[]
[]
[]
[]
[]
[]
[]
[]
[]
[]
[]
[]
[]
[]
[]
[]
[]
[]
[]
[]
[]
[]
[]
[]
[]
[]
[]
[]
[]
[]
[]
[]
[]
[]
[]
[]
[]
[]
[]
[]
[]
[]
[]
[]
[]
[]
[]
[]
[]
[]
[]
[]
[]
[]
[]
[]
[]
[]
[]
[]
[]
[]
[]
[]
[]
[]
[]
[]
[]
[]
[]
[]
[]
[]
[]
[]
[]
[]
[]
[]
[]
[]
[]
[]
[]
[]
[]
[]
[]
[]
[]
[]
[]
[]
[]
[]
[]
[]
[]
[]
[]
[]
[]
[]
[]
[]
[]
[]
[]
[]
[]
[]
[]
[]
[]
[]
[]
[]
[]
[]
[]
[]
[]
[]
[]
[]
[]
[]
[]
[]
[]
[]
[]
[]
[]
[]
[]
[]
[]
[]
[]
[]
[]
[]
[]
[]
[]
[]
[]
[]
[]
[]
[]
[]
[]
[]
[]
[]
[]
[]
[]
[]
[]
[]
[]
[]
[]
[]
[]
[]
[]
[]
[]
[]
[]
[]
[]
[]
[]
[]
[]
[]
[]
[]
[]
[]
[]
[]
[]
[]
[]
[]
[]
[]
[]
[]
[]
[]
[]
[]
[]
[]
[]
[]
[]
[]
[]
[]
[]
[]
[]
[]
[]
[]
[]
[]
[]
[]
[]
[]
[]
[]
[]
[]
[]
[]
[]
[]
[]
[]
[]
[]
[]
[]
[]
[]
[]
[]
[]
[]
[]
[]
[]
[]
[]
[]
[]
[]
[]
[]
[]
[]
[]
[]
[]
[]
[]
[]
[]
[]
[]
[]
[]
[]
[]
[]
[]
[]
[]
[]
[]
[]
[]
[]
[]
[]
[]
[]
[]
[]
[]
[]
[]
[]
[]
[]
[]
[]
[]
[]
[]
[]
[]
[]
[]
[]
[]
[]
[]
[]
[]
[]
[]
[]
[]
[]
[]
[]
[]
[]
[]
[]
[]
[]
[]
[]
[]
[]
[]
[]
[]
[]
[]
[]
[]
[]
[]
[]
[]
[]
[]
[]
[]
[]
[]
[]
[]
[]
[]
[]
[]
[]
[]
[]
[]
[]
[]
[]
[]
[]
[]
[]
[]
[]
[]
[]
[]
[]
[]
[]
[]
[]
[]
[]
[]
[]
[]
[]
[]
[]
[]
[]
[]
[]
[]
[]
[]
[]
[]
[]
[]
[]
[]
[]
[]
[]
[]
[]
[]
[]
[]
[]
[]
[]
[]
[]
[]
[]
[]
[]
[]
[]
[]
[]
[]
[]
[]
[]
[]
[]
[]
[]
[]
[]
[]
[]
[]
[]
[]
[]
[]
[]
[]
[]
[]
[]
[]
[]
[]
[]
[]
[]
[]
[]
[]
[]
[]
[]
[]
[]
[]
[]
[]
[]
[]
[]
[]
[]
[]
[]
[]
[]
[]
[]
[]
[]
[]
[]
[]
[]
[]
[]
[]
[]
[]
[]
[]
[]
[]
[]
[]
[]
[]
[]
[]
[]
[]
[]
[]
[]
[]
[]
[]
[]
[]
[]
[]
[]
[]
[]
[]
[]
[]
[]
[]
[]
[]
[]
[]
[]
[]
[]
[]
[]
[]
[]
[]
[]
[]
[]
[]
[]
[]
[]
[]
[]
[]
[]
[]
[]
[]
[]
[]
[]
[]
[]
[]
[]
[]
[]
[]
[]
[]
[]
[]
[]
[]
[]
[]
[]
[]
[]
[]
[]
[]
[]
[]
[]
[]
[]
[]
[]
[]
[]
[]
[]
[]
[]
[]
[]
[]
[]
[]
[]
[]
[]
[]
[]
[]
[]
[]
[]
[]
[]
[]
[]
[]
[]
[]
[]
[]
[]
[]
[]
[]
[]
[]
[]
[]
[]
[]
[]
[]
[]
[]
[]
[]
[]
[]
[]
[]
[]
[]
[]
[]
[]
[]
[]
[]
[]
[]
[]
[]
[]
[]
[]
[]
[]
[]
[]
[]
[]
[]
[]
[]
[]
[]
[]
[]
[]
[]
[]
[]
[]
[]
[]
[]
[]
[]
[]
[]
[]
[]
[]
[]
[]
[]
[]
[]
[]
[]
[]
[]
[]
[]
[]
[]
[]
[]
[]
[]
[]
[]
[]
[]
[]
[]
[]
[]
[]
[]
[]
[]
[]
[]
[]
[]
[]
[]
[]
[]
[]
[]
[]
[]
[]
[]
[]
[]
[]
[]
[]
[]
[]
[]
[]
[]
[]
[]
[]
[]
[]
[]
[]
[]
[]
[]
[]
[]
[]
[]
[]
[]
[]
[]
[]
[]
[]
[]
[]
[]
[]
[]
[]
[]
[]
[]
[]
[]
[]
[]
[]
[]
[]
[]
[]
[]
[]
[]
[]
[]
[]
[]
[]
[]
[]
[]
[]
[]
[]
[]
[]
[]
[]
[]
[]
[]
[]
[]
[]
[]
[]
[]
[]
[]
[]
[]
[]
[]
[]
[]
[]
[]
[]
[]
[]
[]
[]
[]
[]
[]
[]
[]
[]
[]
[]
[]
[]
[]
[]
[]
[]
[]
[]
[]
[]
[]
[]
[]
[]
[]
[]
[]
[]
[]
[]
[]
[]
[]
[]
[]
[]
[]
[]
[]
[]
[]
[]
[]
[]
[]
[]
[]
[]
[]
[]
[]
[]
[]
[]
[]
[]
[]
[]
[]
[]
[]
[]
[]
[]
[]
[]
[]
[]
[]
[]
[]
[]
[]
[]
[]
[]
[]
[]
[]
[]
[]
[]
[]
[]
[]
[]
[]
[]
[]
[]
[]
[]
[]
[]
[]
[]
[]
[]
[]
[]
[]
[]
[]
[]
[]
[]
[]
[]
[]
[]
[]
[]
[]
[]
[]
[]
[]
[]
[]
[]
[]
[]
[]
[]
[]
[]
[]
[]
[]
[]
[]
[]
[]
[]
[]
[]
[]
[]
[]
[]
[]
[]
[]
[]
[]
[]
[]
[]
[]
[]
[]
[]
[]
[]
[]
[]
[]
[]
[]
[]
[]
[]
[]
[]
[]
[]
[]
[]
[]
[]
[]
[]
[]
[]
[]
[]
[]
[]
[]
[]
[]
[]
[]
[]
[]
[]
[]
[]
[]
[]
[]
[]
[]
[]
[]
[]
[]
[]
[]
[]
[]
[]
[]
[]
[]
[]
[]
[]
[]
[]
[]
[]
[]
[]
[]
[]
[]
[]
[]
[]
[]
[]
[]
[]
[]
[]
[]
[]
[]
[]
[]
[]
[]
[]
[]
[]
[]
[]
[]
[]
[]
[]
[]
[]
[]
[]
[]
[]
[]
[]
[]
[]
[]
[]
[]
[]
[]
[]
[]
[]
[]
[]
[]
[]
[]
[]
[]
[]
[]
[]
[]
[]
[]
[]
[]
[]
[]
[]
[]
[]
[]
[]
[]
[]
[]
[]
[]
[]
[]
[]
[]
[]
[]
[]
[]
[]
[]
[]
[]
[]
[]
[]
[]
[]
[]
[]
[]
[]
[]
[]
[]
[]
[]
[]
[]
[]
[]
[]
[]
[]
[]
[]
[]
[]
[]
[]
[]
[]
[]
[]
[]
[]
[]
[]
[]
[]
[]
[]
[]
[]
[]
[]
[]
[]
[]
[]
[]
[]
[]
[]
[]
[]
[]
[]
[]
[]
[]
[]
[]
[]
[]
[]
[]
[]
[]
[]
[]
[]
[]
[]
[]
[]
[]
[]
[]
[]
[]
[]
[]
[]
[]
[]
[]
[]
[]
[]
[]
[]
[]
[]
[]
[]
[]
[]
[]
[]
[]
[]
[]
[]
[]
[]
[]
[]
[]
[]
[]
[]
[]
[]
[]
[]
[]
[]
[]
[]
[]
[]
[]
[]
[]
[]
[]
[]
[]
[]
[]
[]
[]
[]
[]
[]
[]
[]
[]
[]
[]
[]
[]
[]
[]
[]
[]
[]
[]
[]
[]
[]
[]
[]
[]
[]
[]
[]
[]
[]
[]
[]
[]
[]
[]
[]
[]
[]
[]
[]
[]
[]
[]
[]
[]
[]
[]
[]
[]
[]
[]
[]
[]
[]
[]
[]
[]
[]
[]
[]
[]
[]
[]
[]
[]
[]
[]
[]
[]
[]
[]
[]
[]
[]
[]
[]
[]
[]
[]
[]
[]
[]
[]
[]
[]
[]
[]
[]
[]
[]
[]
[]
[]
[]
[]
[]
[]
[]
[]
[]
[]
[]
[]
[]
[]
[]
[]
[]
[]
[]
[]
[]
[]
[]
[]
[]
[]
[]
[]
[]
[]
[]
[]
[]
[]
[]
[]
[]
[]
[]
[]
[]
[]
[]
[]
[]
[]
[]
[]
[]
[]
[]
[]
[]
[]
[]
[]
[]
[]
[]
[]
[]
[]
[]
[]
[]
[]
[]
[]
[]
[]
[]
[]
[]
[]
[]
[]
[]
[]
[]
[]
[]
[]
[]
[]
[]
[]
[]
[]
[]
[]
[]
[]
[]
[]
[]
[]
[]
[]
[]
[]
[]
[]
[]
[]
[]
[]
[]
[]
[]
[]
[]
[]
[]
[]
[]
[]
[]
[]
[]
[]
[]
[]
[]
[]
[]
[]
[]
[]
[]
[]
[]
[]
[]
[]
[]
[]
[]
[]
[]
[]
[]
[]
[]
[]
[]
[]
[]
[]
[]
[]
[]
[]
[]
[]
[]
[]
[]
[]
[]
[]
[]
[]
[]
[]
[]
[]
[]
[]
[]
[]
[]
[]
[]
[]
[]
[]
[]
[]
[]
[]
[]
[]
[]
[]
[]
[]
[]
[]
[]
[]
[]
[]
[]
[]
[]
[]
[]
[]
[]
[]
[]
[]
[]
[]
[]
[]
[]
[]
[]
[]
[]
[]
[]
[]
[]
[]
[]
[]
[]
[]
[]
[]
[]
[]
[]
[]
[]
[]
[]
[]
[]
[]
[]
[]
[]
[]
[]
[]
[]
[]
[]
[]
[]
[]
[]
[]
[]
[]
[]
[]
[]
[]
[]
[]
[]
[]
[]
[]
[]
[]
[]
[]
[]
[]
[]
[]
[]
[]
[]
[]
[]
[]
[]
[]
[]
[]
[]
[]
[]
[]
[]
[]
[]
[]
[]
[]
[]
[]
[]
[]
[]
[]
[]
[]
[]
[]
[]
[]
[]
[]
[]
[]
[]
[]
[]
[]
[]
[]
[]
[]
[]
[]
[]
[]
[]
[]
[]
[]
[]
[]
[]
[]
[]
[]
[]
[]
[]
[]
[]
[]
[]
[]
[]
[]
[]
[]
[]
[]
[]
[]
[]
[]
[]
[]
[]
[]
[]
[]
[]
[]
[]
[]
[]
[]
[]
[]
[]
[]
[]
[]
[]
[]
[]
[]
[]
[]
[]
[]
[]
[]
[]
[]
[]
[]
[]
[]
[]
[]
[]
[]
[]
[]
[]
[]
[]
[]
[]
[]
[]
[]
[]
[]
[]
[]
[]
[]
[]
[]
[]
[]
[]
[]
[]
[]
[]
[]
[]
[]
[]
[]
[]
[]
[]
[]
[]
[]
[]
[]
[]
[]
[]
[]
[]
[]
[]
[]
[]
[]
[]
[]
[]
[]
[]
[]
[]
[]
[]
[]
[]
[]
[]
[]
[]
[]
[]
[]
[]
[]
[]
[]
[]
[]
[]
[]
[]
[]
[]
[]
[]
[]
[]
[]
[]
[]
[]
[]
[]
[]
[]
[]
[]
[]
[]
[]
[]
[]
[]
[]
[]
[]
[]
[]
[]
[]
[]
[]
[]
[]
[]
[]
[]
[]
[]
[]
[]
[]
[]
[]
[]
[]
[]
[]
[]
[]
[]
[]
[]
[]
[]
[]
[]
[]
[]
[]
[]
[]
[]
[]
[]
[]
[]
[]
[]
[]
[]
[]
[]
[]
[]
[]
[]
[]
[]
[]
[]
[]
[]
[]
[]
[]
[]
[]
[]
[]
[]
[]
[]
[]
[]
[]
[]
[]
[]
[]
[]
[]
[]
[]
[]
[]
[]
[]
[]
[]
[]
[]
[]
[]
[]
[]
[]
[]
[]
[]
[]
[]
[]
[]
[]
[]
[]
[]
[]
[]
[]
[]
[]
[]
[]
[]
[]
[]
[]
[]
[]
[]
[]
[]
[]
[]
[]
[]
[]
[]
[]
[]
[]
[]
[]
[]
[]
[]
[]
[]
[]
[]
[]
[]
[]
[]
[]
[]
[]
[]
[]
[]
[]
[]
[]
[]
[]
[]
[]
[]
[]
[]
[]
[]
[]
[]
[]
[]
[]
[]
[]
[]
[]
[]
[]
[]
[]
[]
[]
[]
[]
[]
[]
[]
[]
[]
[]
[]
[]
[]
[]
[]
[]
[]
[]
[]
[]
[]
[]
[]
[]
[]
[]
[]
[]
[]
[]
[]
[]
[]
[]
[]
[]
[]
[]
[]
[]
[]
[]
[]
[]
[]
[]
[]
[]
[]
[]
[]
[]
[]
[]
[]
[]
[]
[]
[]
[]
[]
[]
[]
[]
[]
[]
[]
[]
[]
[]
[]
[]
[]
[]
[]
[]
[]
[]
[]
[]
[]
[]
[]
[]
[]
[]
[]
[]
[]
[]
[]
[]
[]
[]
[]
[]
[]
[]
[]
[]
[]
[]
[]
[]
[]
[]
[]
[]
[]
[]
[]
[]
[]
[]
[]
[]
[]
[]
[]
[]
[]
[]
[]
[]
[]
[]
[]
[]
[]
[]
[]
[]
[]
[]
[]
[]
[]
[]
[]
[]
[]
[]
[]
[]
[]
[]
[]
[]
[]
[]
[]
[]
[]
[]
[]
[]
[]
[]
[]
[]
[]
[]
[]
[]
[]
[]
[]
[]
[]
[]
[]
[]
[]
[]
[]
[]
[]
[]
[]
[]
[]
[]
[]
[]
[]
[]
[]
[]
[]
[]
[]
[]
[]
[]
[]
[]
[]
[]
[]
[]
[]
[]
[]
[]
[]
[]
[]
[]
[]
[]
[]
[]
[]
[]
[]
[]
[]
[]
[]
[]
[]
[]
[]
[]
[]
[]
[]
[]
[]
[]
[]
[]
[]
[]
[]
[]
[]
[]
[]
[]
[]
[]
[]
[]
[]
[]
[]
[]
[]
[]
[]
[]
[]
[]
[]
[]
[]
[]
[]
[]
[]
[]
[]
[]
[]
[]
[]
[]
[]
[]
[]
[]
[]
[]
[]
[]
[]
[]
[]
[]
[]
[]
[]
[]
[]
[]
[]
[]
[]
[]
[]
[]
[]
[]
[]
[]
[]
[]
[]
[]
[]
[]
[]
[]
[]
[]
[]
[]
[]
[]
[]
[]
[]
[]
[]
[]
[]
[]
[]
[]
[]
[]
[]
[]
[]
[]
[]
[]
[]
[]
[]
[]
[]
[]
[]
[]
[]
[]
[]
[]
[]
[]
[]
[]
[]
[]
[]
[]
[]
[]
[]
[]
[]
[]
[]
[]
[]
[]
[]
[]
[]
[]
[]
[]
[]
[]
[]
[]
[]
[]
[]
[]
[]
[]
[]
[]
[]
[]
[]
[]
[]
[]
[]
[]
[]
[]
[]
[]
[]
[]
[]
[]
[]
[]
[]
[]
[]
[]
[]
[]
[]
[]
[]
[]
[]
[]
[]
[]
[]
[]
[]
[]
[]
[]
[]
[]
[]
[]
[]
[]
[]
[]
[]
[]
[]
[]
[]
[]
[]
[]
[]
[]
[]
[]
[]
[]
[]
[]
[]
[]
[]
[]
[]
[]
[]
[]
[]
[]
[]
[]
[]
[]
[]
[]
[]
[]
[]
[]
[]
[]
[]
[]
[]
[]
[]
[]
[]
[]
[]
[]
[]
[]
[]
[]
[]
[]
[]
[]
[]
[]
[]
[]
[]
[]
[]
[]
[]
[]
[]
[]
[]
[]
[]
[]
[]
[]
[]
[]
[]
[]
[]
[]
[]
[]
[]
[]
[]
[]
[]
[]
[]
[]
[]
[]
[]
[]
[]
[]
[]
[]
[]
[]
[]
[]
[]
[]
[]
[]
[]
[]
[]
[]
[]
[]
[]
[]
[]
[]
[]
[]
[]
[]
[]
[]
[]
[]
[]
[]
[]
[]
[]
[]
[]
[]
[]
[]
[]
[]
[]
[]
[]
[]
[]
[]
[]
[]
[]
[]
[]
[]
[]
[]
[]
[]
[]
[]
[]
[]
[]
[]
[]
[]
[]
[]
[]
[]
[]
[]
[]
[]
[]
[]
[]
[]
[]
[]
[]
[]
[]
[]
[]
[]
[]
[]
[]
[]
[]
[]
[]
[]
[]
[]
[]
[]
[]
[]
[]
[]
[]
[]
[]
[]
[]
[]
[]
[]
[]
[]
[]
[]
[]
[]
[]
[]
[]
[]
[]
[]
[]
[]
[]
[]
[]
[]
[]
[]
[]
[]
[]
[]
[]
[]
[]
[]
[]
[]
[]
[]
[]
[]
[]
[]
[]
[]
[]
[]
[]
[]
[]
[]
[]
[]
[]
[]
[]
[]
[]
[]
[]
[]
[]
[]
[]
[]
[]
[]
[]
[]
[]
[]
[]
[]
[]
[]
[]
[]
[]
[]
[]
[]
[]
[]
[]
[]
[]
[]
[]
[]
[]
[]
[]
[]
[]
[]
[]
[]
[]
[]
[]
[]
[]
[]
[]
[]
[]
[]
[]
[]
[]
[]
[]
[]
[]
[]
[]
[]
[]
[]
[]
[]
[]
[]
[]
[]
[]
[]
[]
[]
[]
[]
[]
[]
[]
[]
[]
[]
[]
[]
[]
[]
[]
[]
[]
[]
[]
[]
[]
[]
[]
[]
[]
[]
[]
[]
[]
[]
[]
[]
[]
[]
[]
[]
[]
[]
[]
[]
[]
[]
[]
[]
[]
[]
[]
[]
[]
[]
[]
[]
[]
[]
[]
[]
[]
[]
[]
[]
[]
[]
[]
[]
[]
[]
[]
[]
[]
[]
[]
[]
[]
[]
[]
[]
[]
[]
[]
[]
[]
[]
[]
[]
[]
[]
[]
[]
[]
[]
[]
[]
[]
[]
[]
[]
[]
[]
[]
[]
[]
[]
[]
[]
[]
[]
[]
[]
[]
[]
[]
[]
[]
[]
[]
[]
[]
[]
[]
[]
[]
[]
[]
[]
[]
[]
[]
[]
[]
[]
[]
[]
[]
[]
[]
[]
[]
[]
[]
[]
[]
[]
[]
[]
[]
[]
[]
[]
[]
[]
[]
[]
[]
[]
[]
[]
[]
[]
[]
[]
[]
[]
[]
[]
[]
[]
[]
[]
[]
[]
[]
[]
[]
[]
[]
[]
[]
[]
[]
[]
[]
[]
[]
[]
[]
[]
[]
[]
[]
[]
[]
[]
[]
[]
[]
[]
[]
[]
[]
[]
[]
[]
[]
[]
[]
[]
[]
[]
[]
[]
[]
[]
[]
[]
[]
[]
[]
[]
[]
[]
[]
[]
[]
[]
[]
[]
[]
[]
[]
[]
[]
[]
[]
[]
[]
[]
[]
[]
[]
[]
[]
[]
[]
[]
[]
[]
[]
[]
[]
[]
[]
[]
[]
[]
[]
[]
[]
[]
[]
[]
[]
[]
[]
[]
[]
[]
[]
[]
[]
[]
[]
[]
[]
[]
[]
[]
[]
[]
[]
[]
[]
[]
[]
[]
[]
[]
[]
[]
[]
[]
[]
[]
[]
[]
[]
[]
[]
[]
[]
[]
[]
[]
[]
[]
[]
[]
[]
[]
[]
[]
[]
[]
[]
[]
[]
[]
[]
[]
[]
[]
[]
[]
[]
[]
[]
[]
[]
[]
[]
[]
[]
[]
[]
[]
[]
[]
[]
[]
[]
[]
[]
[]
[]
[]
[]
[]
[]
[]
[]
[]
[]
[]
[]
[]
[]
[]
[]
[]
[]
[]
[]
[]
[]
[]
[]
[]
[]
[]
[]
[]
[]
[]
[]
[]
[]
[]
[]
[]
[]
[]
[]
[]
[]
[]
[]
[]
[]
[]
[]
[]
[]
[]
[]
[]
[]
[]
[]
[]
[]
[]
[]
[]
[]
[]
[]
[]
[]
[]
[]
[]
[]
[]
[]
[]
[]
[]
[]
[]
[]
[]
[]
[]
[]
[]
[]
[]
[]
[]
[]
[]
[]
[]
[]
[]
[]
[]
[]
[]
[]
[]
[]
[]
[]
[]
[]
[]
[]
[]
[]
[]
[]
[]
[]
[]
[]
[]
[]
[]
[]
[]
[]
[]
[]
[]
[]
[]
[]
[]
[]
[]
[]
[]
[]
[]
[]
[]
[]
[]
[]
[]
[]
[]
[]
[]
[]
[]
[]
[]
[]
[]
[]
[]
[]
[]
[]
[]
[]
[]
[]
[]
[]
[]
[]
[]
[]
[]
[]
[]
[]
[]
[]
[]
[]
[]
[]
[]
[]
[]
[]
[]
[]
[]
[]
[]
[]
[]
[]
[]
[]
[]
[]
[]
[]
[]
[]
[]
[]
[]
[]
[]
[]
[]
[]
[]
[]
[]
[]
[]
[]
[]
[]
[]
[]
[]
[]
[]
[]
[]
[]
[]
[]
[]
[]
[]
[]
[]
[]
[]
[]
[]
[]
[]
[]
[]
[]
[]
[]
[]
[]
[]
[]
[]
[]
[]
[]
[]
[]
[]
[]
[]
[]
[]
[]
[]
[]
[]
[]
[]
[]
[]
[]
[]
[]
[]
[]
[]
[]
[]
[]
[]
[]
[]
[]
[]
[]
[]
[]
[]
[]
[]
[]
[]
[]
[]
[]
[]
[]
[]
[]
[]
[]
[]
[]
[]
[]
[]
[]
[]
[]
[]
[]
[]
[]
[]
[]
[]
[]
[]
[]
[]
[]
[]
[]
[]
[]
[]
[]
[]
[]
[]
[]
[]
[]
[]
[]
[]
[]
[]
[]
[]
[]
[]
[]
[]
[]
[]
[]
[]
[]
[]
[]
[]
[]
[]
[]
[]
[]
[]
[]
[]
[]
[]
[]
[]
[]
[]
[]
[]
[]
[]
[]
[]
[]
[]
[]
[]
[]
[]
[]
[]
[]
[]
[]
[]
[]
[]
[]
[]
[]
[]
[]
[]
[]
[]
[]
[]
[]
[]
[]
[]
[]
[]
[]
[]
[]
[]
[]
[]
[]
[]
[]
[]
[]
[]
[]
[]
[]
[]
[]
[]
[]
[]
[]
[]
[]
[]
[]
[]
[]
[]
[]
[]
[]
[]
[]
[]
[]
[]
[]
[]
[]
[]
[]
[]
[]
[]
[]
[]
[]
[]
[]
[]
[]
[]
[]
[]
[]
[]
[]
[]
[]
[]
[]
[]
[]
[]
[]
[]
[]
[]
[]
[]
[]
[]
[]
[]
[]
[]
[]
[]
[]
[]
[]
[]
[]
[]
[]
[]
[]
[]
[]
[]
[]
[]
[]
[]
[]
[]
[]
[]
[]
[]
[]
[]
[]
[]
[]
[]
[]
[]
[]
[]
[]
[]
[]
[]
[]
[]
[]
[]
[]
[]
[]
[]
[]
[]
[]
[]
[]
[]
[]
[]
[]
[]
[]
[]
[]
[]
[]
[]
[]
[]
[]
[]
[]
[]
[]
[]
[]
[]
[]
[]
[]
[]
[]
[]
[]
[]
[]
[]
[]
[]
[]
[]
[]
[]
[]
[]
[]
[]
[]
[]
[]
[]
[]
[]
[]
[]
[]
[]
[]
[]
[]
[]
[]
[]
[]
[]
[]
[]
[]
[]
[]
[]
[]
[]
[]
[]
[]
[]
[]
[]
[]
[]
[]
[]
[]
[]
[]
[]
[]
[]
[]
[]
[]
[]
[]
[]
[]
[]
[]
[]
[]
[]
[]
[]
[]
[]
[]
[]
[]
[]
[]
[]
[]
[]
[]
[]
[]
[]
[]
[]
[]
[]
[]
[]
[]
[]
[]
[]
[]
[]
[]
[]
[]
[]
[]
[]
[]
[]
[]
[]
[]
[]
[]
[]
[]
[]
[]
[]
[]
[]
[]
[]
[]
[]
[]
[]
[]
[]
[]
[]
[]
[]
[]
[]
[]
[]
[]
[]
[]
[]
[]
[]
[]
[]
[]
[]
[]
[]
[]
[]
[]
[]
[]
[]
[]
[]
[]
[]
[]
[]
[]
[]
[]
[]
[]
[]
[]
[]
[]
[]
[]
[]
[]
[]
[]
[]
[]
[]
[]
[]
[]
[]
[]
[]
[]
[]
[]
[]
[]
[]
[]
[]
[]
[]
[]
[]
[]
[]
[]
[]
[]
[]
[]
[]
[]
[]
[]
[]
[]
[]
[]
[]
[]
[]
[]
[]
[]
[]
[]
[]
[]
[]
[]
[]
[]
[]
[]
[]
[]
[]
[]
[]
[]
[]
[]
[]
[]
[]
[]
[]
[]
[]
[]
[]
[]
[]
[]
[]
[]
[]
[]
[]
[]
[]
[]
[]
[]
[]
[]
[]
[]
[]
[]
[]
[]
[]
[]
[]
[]
[]
[]
[]
[]
[]
[]
[]
[]
[]
[]
[]
[]
[]
[]
[]
[]
[]
[]
[]
[]
[]
[]
[]
[]
[]
[]
[]
[]
[]
[]
[]
[]
[]
[]
[]
[]
[]
[]
[]
[]
[]
[]
[]
[]
[]
[]
[]
[]
[]
[]
[]
[]
[]
[]
[]
[]
[]
[]
[]
[]
[]
[]
[]
[]
[]
[]
[]
[]
[]
[]
[]
[]
[]
[]
[]
[]
[]
[]
[]
[]
[]
[]
[]
[]
[]
[]
[]
[]
[]
[]
[]
[]
[]
[]
[]
[]
[]
[]
[]
[]
[]
[]
[]
[]
[]
[]
[]
[]
[]
[]
[]
[]
[]
[]
[]
[]
[]
[]
[]
[]
[]
[]
[]
[]
[]
[]
[]
[]
[]
[]
[]
[]
[]
[]
[]
[]
[]
[]
[]
[]
[]
[]
[]
[]
[]
[]
[]
[]
[]
[]
[]
[]
[]
[]
[]
[]
[]
[]
[]
[]
[]
[]
[]
[]
[]
[]
[]
[]
[]
[]
[]
[]
[]
[]
[]
[]
[]
[]
[]
[]
[]
[]
[]
[]
[]
[]
[]
[]
[]
[]
[]
[]
[]
[]
[]
[]
[]
[]
[]
[]
[]
[]
[]
[]
[]
[]
[]
[]
[]
[]
[]
[]
[]
[]
[]
[]
[]
[]
[]
[]
[]
[]
[]
[]
[]
[]
[]
[]
[]
[]
[]
[]
[]
[]
[]
[]
[]
[]
[]
[]
[]
[]
[]
[]
[]
[]
[]
[]
[]
[]
[]
[]
[]
[]
[]
[]
[]
[]
[]
[]
[]
[]
[]
[]
[]
[]
[]
[]
[]
[]
[]
[]
[]
[]
[]
[]
[]
[]
[]
[]
[]
[]
[]
[]
[]
[]
[]
[]
[]
[]
[]
[]
[]
[]
[]
[]
[]
[]
[]
[]
[]
[]
[]
[]
[]
[]
[]
[]
[]
[]
[]
[]
[]
[]
[]
[]
[]
[]
[]
[]
[]
[]
[]
[]
[]
[]
[]
[]
[]
[]
[]
[]
[]
[]
[]
[]
[]
[]
[]
[]
[]
[]
[]
[]
[]
[]
[]
[]
[]
[]
[]
[]
[]
[]
[]
[]
[]
[]
[]
[]
[]
[]
[]
[]
[]
[]
[]
[]
[]
[]
[]
[]
[]
[]
[]
[]
[]
[]
[]
[]
[]
[]
[]
[]
[]
[]
[]
[]
[]
[]
[]
[]
[]
[]
[]
[]
[]
[]
[]
[]
[]
[]
[]
[]
[]
[]
[]
[]
[]
[]
[]
[]
[]
[]
[]
[]
[]
[]
[]
[]
[]
[]
[]
[]
[]
[]
[]
[]
[]
[]
[]
[]
[]
[]
[]
[]
[]
[]
[]
[]
[]
[]
[]
[]
[]
[]
[]
[]
[]
[]
[]
[]
[]
[]
[]
[]
[]
[]
[]
[]
[]
[]
[]
[]
[]
[]
[]
[]
[]
[]
[]
[]
[]
[]
[]
[]
[]
[]
[]
[]
[]
[]
[]
[]
[]
[]
[]
[]
[]
[]
[]
[]
[]
[]
[]
[]
[]
[]
[]
[]
[]
[]
[]
[]
[]
[]
[]
[]
[]
[]
[]
[]
[]
[]
[]
[]
[]
[]
[]
[]
[]
[]
[]
[]
[]
[]
[]
[]
[]
[]
[]
[]
[]
[]
[]
[]
[]
[]
[]
[]
[]
[]
[]
[]
[]
[]
[]
[]
[]
[]
[]
[]
[]
[]
[]
[]
[]
[]
[]
[]
[]
[]
[]
[]
[]
[]
[]
[]
[]
[]
[]
[]
[]
[]
[]
[]
[]
[]
[]
[]
[]
[]
[]
[]
[]
[]
[]
[]
[]
[]
[]
[]
[]
[]
[]
[]
[]
[]
[]
[]
[]
[]
[]
[]
[]
[]
[]
[]
[]
[]
[]
[]
[]
[]
[]
[]
[]
[]
[]
[]
[]
[]
[]
[]
[]
[]
[]
[]
[]
[]
[]
[]
[]
[]
[]
[]
[]
[]
[]
[]
[]
[]
[]
[]
[]
[]
[]
[]
[]
[]
[]
[]
[]
[]
[]
[]
[]
[]
[]
[]
[]
[]
[]
[]
[]
[]
[]
[]
[]
[]
[]
[]
[]
[]
[]
[]
[]
[]
[]
[]
[]
[]
[]
[]
[]
[]
[]
[]
[]
[]
[]
[]
[]
[]
[]
[]
[]
[]
[]
[]
[]
[]
[]
[]
[]
[]
[]
[]
[]
[]
[]
[]
[]
[]
[]
[]
[]
[]
[]
[]
[]
[]
[]
[]
[]
[]
[]
[]
[]
[]
[]
[]
[]
[]
[]
[]
[]
[]
[]
[]
[]
[]
[]
[]
[]
[]
[]
[]
[]
[]
[]
[]
[]
[]
[]
[]
[]
[]
[]
[]
[]
[]
[]
[]
[]
[]
[]
[]
[]
[]
[]
[]
[]
[]
[]
[]
[]
[]
[]
[]
[]
[]
[]
[]
[]
[]
[]
[]
[]
[]
[]
[]
[]
[]
[]
[]
[]
[]
[]
[]
[]
[]
[]
[]
[]
[]
[]
[]
[]
[]
[]
[]
[]
[]
[]
[]
[]
[]
[]
[]
[]
[]
[]
[]
[]
[]
[]
[]
[]
[]
[]
[]
[]
[]
[]
[]
[]
[]
[]
[]
[]
[]
[]
[]
[]
[]
[]
[]
[]
[]
[]
[]
[]
[]
[]
[]
[]
[]
[]
[]
[]
[]
[]
[]
[]
[]
[]
[]
[]
[]
[]
[]
[]
[]
[]
[]
[]
[]
[]
[]
[]
[]
[]
[]
[]
[]
[]
[]
[]
[]
[]
[]
[]
[]
[]
[]
[]
[]
[]
[]
[]
[]
[]
[]
[]
[]
[]
[]
[]
[]
[]
[]
[]
[]
[]
[]
[]
[]
[]
[]
[]
[]
[]
[]
[]
[]
[]
[]
[]
[]
[]
[]
[]
[]
[]
[]
[]
[]
[]
[]
[]
[]
[]
[]
[]
[]
[]
[]
[]
[]
[]
[]
[]
[]
[]
[]
[]
[]
[]
[]
[]
[]
[]
[]
[]
[]
[]
[]
[]
[]
[]
[]
[]
[]
[]
[]
[]
[]
[]
[]
[]
[]
[]
[]
[]
[]
[]
[]
[]
[]
[]
[]
[]
[]
[]
[]
[]
[]
[]
[]
[]
[]
[]
[]
[]
[]
[]
[]
[]
[]
[]
[]
[]
[]
[]
[]
[]
[]
[]
[]
[]
[]
[]
[]
[]
[]
[]
[]
[]
[]
[]
[]
[]
[]
[]
[]
[]
[]
[]
[]
[]
[]
[]
[]
[]
[]
[]
[]
[]
[]
[]
[]
[]
[]
[]
[]
[]
[]
[]
[]
[]
[]
[]
[]
[]
[]
[]
[]
[]
[]
[]
[]
[]
[]
[]
[]
[]
[]
[]
[]
[]
[]
[]
[]
[]
[]
[]
[]
[]
[]
[]
[]
[]
[]
[]
[]
[]
[]
[]
[]
[]
[]
[]
[]
[]
[]
[]
[]
[]
[]
[]
[]
[]
[]
[]
[]
[]
[]
[]
[]
[]
[]
[]
[]
[]
[]
[]
[]
[]
[]
[]
[]
[]
[]
[]
[]
[]
[]
[]
[]
[]
[]
[]
[]
[]
[]
[]
[]
[]
[]
[]
[]
[]
[]
[]
[]
[]
[]
[]
[]
[]
[]
[]
[]
[]
[]
[]
[]
[]
[]
[]
[]
[]
[]
[]
[]
[]
[]
[]
[]
[]
[]
[]
[]
[]
[]
[]
[]
[]
[]
[]
[]
[]
[]
[]
[]
[]
[]
[]
[]
[]
[]
[]
[]
[]
[]
[]
[]
[]
[]
[]
[]
[]
[]
[]
[]
[]
[]
[]
[]
[]
[]
[]
[]
[]
[]
[]
[]
[]
[]
[]
[]
[]
[]
[]
[]
[]
[]
[]
[]
[]
[]
[]
[]
[]
[]
[]
[]
[]
[]
[]
[]
[]
[]
[]
[]
[]
[]
[]
[]
[]
[]
[]
[]
[]
[]
[]
[]
[]
[]
[]
[]
[]
[]
[]
[]
[]
[]
[]
[]
[]
[]
[]
[]
[]
[]
[]
[]
[]
[]
[]
[]
[]
[]
[]
[]
[]
[]
[]
[]
[]
[]
[]
[]
[]
[]
[]
[]
[]
[]
[]
[]
[]
[]
[]
[]
[]
[]
[]
[]
[]
[]
[]
[]
[]
[]
[]
[]
[]
[]
[]
[]
[]
[]
[]
[]
[]
[]
[]
[]
[]
[]
[]
[]
[]
[]
[]
[]
[]
[]
[]
[]
[]
[]
[]
[]
[]
[]
[]
[]
[]
[]
[]
[]
[]
[]
[]
[]
[]
[]
[]
[]
[]
[]
[]
[]
[]
[]
[]
[]
[]
[]
[]
[]
[]
[]
[]
[]
[]
[]
[]
[]
[]
[]
[]
[]
[]
[]
[]
[]
[]
[]
[]
[]
[]
[]
[]
[]
[]
[]
[]
[]
[]
[]
[]
[]
[]
[]
[]
[]
[]
[]
[]
[]
[]
[]
[]
[]
[]
[]
[]
[]
[]
[]
[]
[]
[]
[]
[]
[]
[]
[]
[]
[]
[]
[]
[]
[]
[]
[]
[]
[]
[]
[]
[]
[]
[]
[]
[]
[]
[]
[]
[]
[]
[]
[]
[]
[]
[]
[]
[]
[]
[]
[]
[]
[]
[]
[]
[]
[]
[]
[]
[]
[]
[]
[]
[]
[]
[]
[]
[]
[]
[]
[]
[]
[]
[]
[]
[]
[]
[]
[]
[]
[]
[]
[]
[]
[]
[]
[]
[]
[]
[]
[]
[]
[]
[]
[]
[]
[]
[]
[]
[]
[]
[]
[]
[]
[]
[]
[]
[]
[]
[]
[]
[]
[]
[]
[]
[]
[]
[]
[]
[]
[]
[]
[]
[]
[]
[]
[]
[]
[]
[]
[]
[]
[]
[]
[]
[]
[]
[]
[]
[]
[]
[]
[]
[]
[]
[]
[]
[]
[]
[]
[]
[]
[]
[]
[]
[]
[]
[]
[]
[]
[]
[]
[]
[]
[]
[]
[]
[]
[]
[]
[]
[]
[]
[]
[]
[]
[]
[]
[]
[]
[]
[]
[]
[]
[]
[]
[]
[]
[]
[]
[]
[]
[]
[]
[]
[]
[]
[]
[]
[]
[]
[]
[]
[]
[]
[]
[]
[]
[]
[]
[]
[]
[]
[]
[]
[]
[]
[]
[]
[]
[]
[]
[]
[]
[]
[]
[]
[]
[]
[]
[]
[]
[]
[]
[]
[]
[]
[]
[]
[]
[]
[]
[]
[]
[]
[]
[]
[]
[]
[]
[]
[]
[]
[]
[]
[]
[]
[]
[]
[]
[]
[]
[]
[]
[]
[]
[]
[]
[]
[]
[]
[]
[]
[]
[]
[]
[]
[]
[]
[]
[]
[]
[]
[]
[]
[]
[]
[]
[]
[]
[]
[]
[]
[]
[]
[]
[]
[]
[]
[]
[]
[]
[]
[]
[]
[]
[]
[]
[]
[]
[]
[]
[]
[]
[]
[]
[]
[]
[]
[]
[]
[]
[]
[]
[]
[]
[]
[]
[]
[]
[]
[]
[]
[]
[]
[]
[]
[]
[]
[]
[]
[]
[]
[]
[]
[]
[]
[]
[]
[]
[]
[]
[]
[]
[]
[]
[]
[]
[]
[]
[]
[]
[]
[]
[]
[]
[]
[]
[]
[]
[]
[]
[]
[]
[]
[]
[]
[]
[]
[]
[]
[]
[]
[]
[]
[]
[]
[]
[]
[]
[]
[]
[]
[]
[]
[]
[]
[]
[]
[]
[]
[]
[]
[]
[]
[]
[]
[]
[]
[]
[]
[]
[]
[]
[]
[]
[]
[]
[]
[]
[]
[]
[]
[]
[]
[]
[]
[]
[]
[]
[]
[]
[]
[]
[]
[]
[]
[]
[]
[]
[]
[]
[]
[]
[]
[]
[]
[]
[]
[]
[]
[]
[]
[]
[]
[]
[]
[]
[]
[]
[]
[]
[]
[]
[]
[]
[]
[]
[]
[]
[]
[]
[]
[]
[]
[]
[]
[]
[]
[]
[]
[]
[]
[]
[]
[]
[]
[]
[]
[]
[]
[]
[]
[]
[]
[]
[]
[]
[]
[]
[]
[]
[]
[]
[]
[]
[]
[]
[]
[]
[]
[]
[]
[]
[]
[]
[]
[]
[]
[]
[]
[]
[]
[]
[]
[]
[]
[]
[]
[]
[]
[]
[]
[]
[]
[]
[]
[]
[]
[]
[]
[]
[]
[]
[]
[]
[]
[]
[]
[]
[]
[]
[]
[]
[]
[]
[]
[]
[]
[]
[]
[]
[]
[]
[]
[]
[]
[]
[]
[]
[]
[]
[]
[]
[]
[]
[]
[]
[]
[]
[]
[]
[]
[]
[]
[]
[]
[]
[]
[]
[]
[]
[]
[]
[]
[]
[]
[]
[]
[]
[]
[]
[]
[]
[]
[]
[]
[]
[]
[]
[]
[]
[]
[]
[]
[]
[]
[]
[]
[]
[]
[]
[]
[]
[]
[]
[]
[]
[]
[]
[]
[]
[]
[]
[]
[]
[]
[]
[]
[]
[]
[]
[]
[]
[]
[]
[]
[]
[]
[]
[]
[]
[]
[]
[]
[]
[]
[]
[]
[]
[]
[]
[]
[]
[]
[]
[]
[]
[]
[]
[]
[]
[]
[]
[]
[]
[]
[]
[]
[]
[]
[]
[]
[]
[]
[]
[]
[]
[]
[]
[]
[]
[]
[]
[]
[]
[]
[]
[]
[]
[]
[]
[]
[]
[]
[]
[]
[]
[]
[]
[]
[]
[]
[]
[]
[]
[]
[]
[]
[]
[]
[]
[]
[]
[]
[]
[]
[]
[]
[]
[]
[]
[]
[]
[]
[]
[]
[]
[]
[]
[]
[]
[]
[]
[]
[]
[]
[]
[]
[]
[]
[]
[]
[]
[]
[]
[]
[]
[]
[]
[]
[]
[]
[]
[]
[]
[]
[]
[]
[]
[]
[]
[]
[]
[]
[]
[]
[]
[]
[]
[]
[]
[]
[]
[]
[]
[]
[]
[]
[]
[]
[]
[]
[]
[]
[]
[]
[]
[]
[]
[]
[]
[]
[]
[]
[]
[]
[]
[]
[]
[]
[]
[]
[]
[]
[]
[]
[]
[]
[]
[]
[]
[]
[]
[]
[]
[]
[]
[]
[]
[]
[]
[]
[]
[]
[]
[]
[]
[]
[]
[]
[]
[]
[]
[]
[]
[]
[]
[]
[]
[]
[]
[]
[]
[]
[]
[]
[]
[]
[]
[]
[]
[]
[]
[]
[]
[]
[]
[]
[]
[]
[]
[]
[]
[]
[]
[]
[]
[]
[]
[]
[]
[]
[]
[]
[]
[]
[]
[]
[]
[]
[]
[]
[]
[]
[]
[]
[]
[]
[]
[]
[]
[]
[]
[]
[]
[]
[]
[]
[]
[]
[]
[]
[]
[]
[]
[]
[]
[]
[]
[]
[]
[]
[]
[]
[]
[]
[]
[]
[]
[]
[]
[]
[]
[]
[]
[]
[]
[]
[]
[]
[]
[]
[]
[]
[]
[]
[]
[]
[]
[]
[]
[]
[]
[]
[]
[]
[]
[]
[]
[]
[]
[]
[]
[]
[]
[]
[]
[]
[]
[]
[]
[]
[]
[]
[]
[]
[]
[]
[]
[]
[]
[]
[]
[]
[]
[]
[]
[]
[]
[]
[]
[]
[]
[]
[]
[]
[]
[]
[]
[]
[]
[]
[]
[]
[]
[]
[]
[]
[]
[]
[]
[]
[]
[]
[]
[]
[]
[]
[]
[]
[]
[]
[]
[]
[]
[]
[]
[]
[]
[]
[]
[]
[]
[]
[]
[]
[]
[]
[]
[]
[]
[]
[]
[]
[]
[]
[]
[]
[]
[]
[]
[]
[]
[]
[]
[]
[]
[]
[]
[]
[]
[]
[]
[]
[]
[]
[]
[]
[]
[]
[]
[]
[]
[]
[]
[]
[]
[]
[]
[]
[]
[]
[]
[]
[]
[]
[]
[]
[]
[]
[]
[]
[]
[]
[]
[]
[]
[]
[]
[]
[]
[]
[]
[]
[]
[]
[]
[]
[]
[]
[]
[]
[]
[]
[]
[]
[]
[]
[]
[]
[]
[]
[]
[]
[]
[]
[]
[]
[]
[]
[]
[]
[]
[]
[]
[]
[]
[]
[]
[]
[]
[]
[]
[]
[]
[]
[]
[]
[]
[]
[]
[]
[]
[]
[]
[]
[]
[]
[]
[]
[]
[]
[]
[]
[]
[]
[]
[]
[]
[]
[]
[]
[]
[]
[]
[]
[]
[]
[]
[]
[]
[]
[]
[]
[]
[]
[]
[]
[]
[]
[]
[]
[]
[]
[]
[]
[]
[]
[]
[]
[]
[]
[]
[]
[]
[]
[]
[]
[]
[]
[]
[]
[]
[]
[]
[]
[]
[]
[]
[]
[]
[]
[]
[]
[]
[]
[]
[]
[]
[]
[]
[]
[]
[]
[]
[]
[]
[]
[]
[]
[]
[]
[]
[]
[]
[]
[]
[]
[]
[]
[]
[]
[]
[]
[]
[]
[]
[]
[]
[]
[]
[]
[]
[]
[]
[]
[]
[]
[]
[]
[]
[]
[]
[]
[]
[]
[]
[]
[]
[]
[]
[]
[]
[]
[]
[]
[]
[]
[]
[]
[]
[]
[]
[]
[]
[]
[]
[]
[]
[]
[]
[]
[]
[]
[]
[]
[]
[]
[]
[]
[]
[]
[]
[]
[]
[]
[]
[]
[]
[]
[]
[]
[]
[]
[]
[]
[]
[]
[]
[]
[]
[]
[]
[]
[]
[]
[]
[]
[]
[]
[]
[]
[]
[]
[]
[]
[]
[]
[]
[]
[]
[]
[]
[]
[]
[]
[]
[]
[]
[]
[]
[]
[]
[]
[]
[]
[]
[]
[]
[]
[]
[]
[]
[]
[]
[]
[]
[]
[]
[]
[]
[]
[]
[]
[]
[]
[]
[]
[]
[]
[]
[]
[]
[]
[]
[]
[]
[]
[]
[]
[]
[]
[]
[]
[]
[]
[]
[]
[]
[]
[]
[]
[]
[]
[]
[]
[]
[]
[]
[]
[]
[]
[]
[]
[]
[]
[]
[]
[]
[]
[]
[]
[]
[]
[]
[]
[]
[]
[]
[]
[]
[]
[]
[]
[]
[]
[]
[]
[]
[]
[]
[]
[]
[]
[]
[]
[]
[]
[]
[]
[]
[]
[]
[]
[]
[]
[]
[]
[]
[]
[]
[]
[]
[]
[]
[]
[]
[]
[]
[]
[]
[]
[]
[]
[]
[]
[]
[]
[]
[]
[]
[]
[]
[]
[]
[]
[]
[]
[]
[]
[]
[]
[]
[]
[]
[]
[]
[]
[]
[]
[]
[]
[]
[]
[]
[]
[]
[]
[]
[]
[]
[]
[]
[]
[]
[]
[]
[]
[]
[]
[]
[]
[]
[]
[]
[]
[]
[]
[]
[]
[]
[]
[]
[]
[]
[]
[]
[]
[]
[]
[]
[]
[]
[]
[]
[]
[]
[]
[]
[]
[]
[]
[]
[]
[]
[]
[]
[]
[]
[]
[]
[]
[]
[]
[]
[]
[]
[]
[]
[]
[]
[]
[]
[]
[]
[]
[]
[]
[]
[]
[]
[]
[]
[]
[]
[]
[]
[]
[]
[]
[]
[]
[]
[]
[]
[]
[]
[]
[]
[]
[]
[]
[]
[]
[]
[]
[]
[]
[]
[]
[]
[]
[]
[]
[]
[]
[]
[]
[]
[]
[]
[]
[]
[]
[]
[]
[]
[]
[]
[]
[]
[]
[]
[]
[]
[]
[]
[]
[]
[]
[]
[]
[]
[]
[]
[]
[]
[]
[]
[]
[]
[]
[]
[]
[]
[]
[]
[]
[]
[]
[]
[]
[]
[]
[]
[]
[]
[]
[]
[]
[]
[]
[]
[]
[]
[]
[]
[]
[]
[]
[]
[]
[]
[]
[]
[]
[]
[]
[]
[]
[]
[]
[]
[]
[]
[]
[]
[]
[]
[]
[]
[]
[]
[]
[]
[]
[]
[]
[]
[]
[]
[]
[]
[]
[]
[]
[]
[]
[]
[]
[]
[]
[]
[]
[]
[]
[]
[]
[]
[]
[]
[]
[]
[]
[]
[]
[]
[]
[]
[]
[]
[]
[]
[]
[]
[]
[]
[]
[]
[]
[]
[]
[]
[]
[]
[]
[]
[]
[]
[]
[]
[]
[]
[]
[]
[]
[]
[]
[]
[]
[]
[]
[]
[]
[]
[]
[]
[]
[]
[]
[]
[]
[]
[]
[]
[]
[]
[]
[]
[]
[]
[]
[]
[]
[]
[]
[]
[]
[]
[]
[]
[]
[]
[]
[]
[]
[]
[]
[]
[]
[]
[]
[]
[]
[]
[]
[]
[]
[]
[]
[]
[]
[]
[]
[]
[]
[]
[]
[]
[]
[]
[]
[]
[]
[]
[]
[]
[]
[]
[]
[]
[]
[]
[]
[]
[]
[]
[]
[]
[]
[]
[]
[]
[]
[]
[]
[]
[]
[]
[]
[]
[]
[]
[]
[]
[]
[]
[]
[]
[]
[]
[]
[]
[]
[]
[]
[]
[]
[]
[]
[]
[]
[]
[]
[]
[]
[]
[]
[]
[]
[]
[]
[]
[]
[]
[]
[]
[]
[]
[]
[]
[]
[]
[]
[]
[]
[]
[]
[]
[]
[]
[]
[]
[]
[]
[]
[]
[]
[]
[]
[]
[]
[]
[]
[]
[]
[]
[]
[]
[]
[]
[]
[]
[]
[]
[]
[]
[]
[]
[]
[]
[]
[]
[]
[]
[]
[]
[]
[]
[]
[]
[]
[]
[]
[]
[]
[]
[]
[]
[]
[]
[]
[]
[]
[]
[]
[]
[]
[]
[]
[]
[]
[]
[]
[]
[]
[]
[]
[]
[]
[]
[]
[]
[]
[]
[]
[]
[]
[]
[]
[]
[]
[]
[]
[]
[]
[]
[]
[]
[]
[]
[]
[]
[]
[]
[]
[]
[]
[]
[]
[]
[]
[]
[]
[]
[]
[]
[]
[]
[]
[]
[]
[]
[]
[]
[]
[]
[]
[]
[]
[]
[]
[]
[]
[]
[]
[]
[]
[]
[]
[]
[]
[]
[]
[]
[]
[]
[]
[]
[]
[]
[]
[]
[]
[]
[]
[]
[]
[]
[]
[]
[]
[]
[]
[]
[]
[]
[]
[]
[]
[]
[]
[]
[]
[]
[]
[]
[]
[]
[]
[]
[]
[]
[]
[]
[]
[]
[]
[]
[]
[]
[]
[]
[]
[]
[]
[]
[]
[]
[]
[]
[]
[]
[]
[]
[]
[]
[]
[]
[]
[]
[]
[]
[]
[]
[]
[]
[]
[]
[]
[]
[]
[]
[]
[]
[]
[]
[]
[]
[]
[]
[]
[]
[]
[]
[]
[]
[]
[]
[]
[]
[]
[]
[]
[]
[]
[]
[]
[]
[]
[]
[]
[]
[]
[]
[]
[]
[]
[]
[]
[]
[]
[]
[]
[]
[]
[]
[]
[]
[]
[]
[]
[]
[]
[]
[]
[]
[]
[]
[]
[]
[]
[]
[]
[]
[]
[]
[]
[]
[]
[]
[]
[]
[]
[]
[]
[]
[]
[]
[]
[]
[]
[]
[]
[]
[]
[]
[]
[]
[]
[]
[]
[]
[]
[]
[]
[]
[]
[]
[]
[]
[]
[]
[]
[]
[]
[]
[]
[]
[]
[]
[]
[]
[]
[]
[]
[]
[]
[]
[]
[]
[]
[]
[]
[]
[]
[]
[]
[]
[]
[]
[]
[]
[]
[]
[]
[]
[]
[]
[]
[]
[]
[]
[]
[]
[]
[]
[]
[]
[]
[]
[]
[]
[]
[]
[]
[]
[]
[]
[]
[]
[]
[]
[]
[]
[]
[]
[]
[]
[]
[]
[]
[]
[]
[]
[]
[]
[]
[]
[]
[]
[]
[]
[]
[]
[]
[]
[]
[]
[]
[]
[]
[]
[]
[]
[]
[]
[]
[]
[]
[]
[]
[]
[]
[]
[]
[]
[]
[]
[]
[]
[]
[]
[]
[]
[]
[]
[]
[]
[]
[]
[]
[]
[]
[]
[]
[]
[]
[]
[]
[]
[]
[]
[]
[]
[]
[]
[]
[]
[]
[]
[]
[]
[]
[]
[]
[]
[]
[]
[]
[]
[]
[]
[]
[]
[]
[]
[]
[]
[]
[]
[]
[]
[]
[]
[]
[]
[]
[]
[]
[]
[]
[]
[]
[]
[]
[]
[]
[]
[]
[]
[]
[]
[]
[]
[]
[]
[]
[]
[]
[]
[]
[]
[]
[]
[]
[]
[]
[]
[]
[]
[]
[]
[]
[]
[]
[]
[]
[]
[]
[]
[]
[]
[]
[]
[]
[]
[]
[]
[]
[]
[]
[]
[]
[]
[]
[]
[]
[]
[]
[]
[]
[]
[]
[]
[]
[]
[]
[]
[]
[]
[]
[]
[]
[]
[]
[]
[]
[]
[]
[]
[]
[]
[]
[]
[]
[]
[]
[]
[]
[]
[]
[]
[]
[]
[]
[]
[]
[]
[]
[]
[]
[]
[]
[]
[]
[]
[]
[]
[]
[]
[]
[]
[]
[]
[]
[]
[]
[]
[]
[]
[]
[]
[]
[]
[]
[]
[]
[]
[]
[]
[]
[]
[]
[]
[]
[]
[]
[]
[]
[]
[]
[]
[]
[]
[]
[]
[]
[]
[]
[]
[]
[]
[]
[]
[]
[]
[]
[]
[]
[]
[]
[]
[]
[]
[]
[]
[]
[]
[]
[]
[]
[]
[]
[]
[]
[]
[]
[]
[]
[]
[]
[]
[]
[]
[]
[]
[]
[]
[]
[]
[]
[]
[]
[]
[]
[]
[]
[]
[]
[]
[]
[]
[]
[]
[]
[]
[]
[]
[]
[]
[]
[]
[]
[]
[]
[]
[]
[]
[]
[]
[]
[]
[]
[]
[]
[]
[]
[]
[]
[]
[]
[]
[]
[]
[]
[]
[]
[]
[]
[]
[]
[]
[]
[]
[]
[]
[]
[]
[]
[]
[]
[]
[]
[]
[]
[]
[]
[]
[]
[]
[]
[]
[]
[]
[]
[]
[]
[]
[]
[]
[]
[]
[]
[]
[]
[]
[]
[]
[]
[]
[]
[]
[]
[]
[]
[]
[]
[]
[]
[]
[]
[]
[]
[]
[]
[]
[]
[]
[]
[]
[]
[]
[]
[]
[]
[]
[]
[]
[]
[]
[]
[]
[]
[]
[]
[]
[]
[]
[]
[]
[]
[]
[]
[]
[]
[]
[]
[]
[]
[]
[]
[]
[]
[]
[]
[]
[]
[]
[]
[]
[]
[]
[]
[]
[]
[]
[]
[]
[]
[]
[]
[]
[]
[]
[]
[]
[]
[]
[]
[]
[]
[]
[]
[]
[]
[]
[]
[]
[]
[]
[]
[]
[]
[]
[]
[]
[]
[]
[]
[]
[]
[]
[]
[]
[]
[]
[]
[]
[]
[]
[]
[]
[]
[]
[]
[]
[]
[]
[]
[]
[]
[]
[]
[]
[]
[]
[]
[]
[]
[]
[]
[]
[]
[]
[]
[]
[]
[]
[]
[]
[]
[]
[]
[]
[]
[]
[]
[]
[]
[]
[]
[]
[]
[]
[]
[]
[]
[]
[]
[]
[]
[]
[]
[]
[]
[]
[]
[]
[]
[]
[]
[]
[]
[]
[]
[]
[]
[]
[]
[]
[]
[]
[]
[]
[]
[]
[]
[]
[]
[]
[]
[]
[]
[]
[]
[]
[]
[]
[]
[]
[]
[]
[]
[]
[]
[]
[]
[]
[]
[]
[]
[]
[]
[]
[]
[]
[]
[]
[]
[]
[]
[]
[]
[]
[]
[]
[]
[]
[]
[]
[]
[]
[]
[]
[]
[]
[]
[]
[]
[]
[]
[]
[]
[]
[]
[]
[]
[]
[]
[]
[]
[]
[]
[]
[]
[]
[]
[]
[]
[]
[]
[]
[]
[]
[]
[]
[]
[]
[]
[]
[]
[]
[]
[]
[]
[]
[]
[]
[]
[]
[]
[]
[]
[]
[]
[]
[]
[]
[]
[]
[]
[]
[]
[]
[]
[]
[]
[]
[]
[]
[]
[]
[]
[]
[]
[]
[]
[]
[]
[]
[]
[]
[]
[]
[]
[]
[]
[]
[]
[]
[]
[]
[]
[]
[]
[]
[]
[]
[]
[]
[]
[]
[]
[]
[]
[]
[]
[]
[]
[]
[]
[]
[]
[]
[]
[]
[]
[]
[]
[]
[]
[]
[]
[]
[]
[]
[]
[]
[]
[]
[]
[]
[]
[]
[]
[]
[]
[]
[]
[]
[]
[]
[]
[]
[]
[]
[]
[]
[]
[]
[]
[]
[]
[]
[]
[]
[]
[]
[]
[]
[]
[]
[]
[]
[]
[]
[]
[]
[]
[]
[]
[]
[]
[]
[]
[]
[]
[]
[]
[]
[]
[]
[]
[]
[]
[]
[]
[]
[]
[]
[]
[]
[]
[]
[]
[]
[]
[]
[]
[]
[]
[]
[]
[]
[]
[]
[]
[]
[]
[]
[]
[]
[]
[]
[]
[]
[]
[]
[]
[]
[]
[]
[]
[]
[]
[]
[]
[]
[]
[]
[]
[]
[]
[]
[]
[]
[]
[]
[]
[]
[]
[]
[]
[]
[]
[]
[]
[]
[]
[]
[]
[]
[]
[]
[]
[]
[]
[]
[]
[]
[]
[]
[]
[]
[]
[]
[]
[]
[]
[]
[]
[]
[]
[]
[]
[]
[]
[]
[]
[]
[]
[]
[]
[]
[]
[]
[]
[]
[]
[]
[]
[]
[]
[]
[]
[]
[]
[]
[]
[]
[]
[]
[]
[]
[]
[]
[]
[]
[]
[]
[]
[]
[]
[]
[]
[]
[]
[]
[]
[]
[]
[]
[]
[]
[]
[]
[]
[]
[]
[]
[]
[]
[]
[]
[]
[]
[]
[]
[]
[]
[]
[]
[]
[]
[]
[]
[]
[]
[]
[]
[]
[]
[]
[]
[]
[]
[]
[]
[]
[]
[]
[]
[]
[]
[]
[]
[]
[]
[]
[]
[]
[]
[]
[]
[]
[]
[]
[]
[]
[]
[]
[]
[]
[]
[]
[]
[]
[]
[]
[]
[]
[]
[]
[]
[]
[]
[]
[]
[]
[]
[]
[]
[]
[]
[]
[]
[]
[]
[]
[]
[]
[]
[]
[]
[]
[]
[]
[]
[]
[]
[]
[]
[]
[]
[]
[]
[]
[]
[]
[]
[]
[]
[]
[]
[]
[]
[]
[]
[]
[]
[]
[]
[]
[]
[]
[]
[]
[]
[]
[]
[]
[]
[]
[]
[]
[]
[]
[]
[]
[]
[]
[]
[]
[]
[]
[]
[]
[]
[]
[]
[]
[]
[]
[]
[]
[]
[]
[]
[]
[]
[]
[]
[]
[]
[]
[]
[]
[]
[]
[]
[]
[]
[]
[]
[]
[]
[]
[]
[]
[]
[]
[]
[]
[]
[]
[]
[]
[]
[]
[]
[]
[]
[]
[]
[]
[]
[]
[]
[]
[]
[]
[]
[]
[]
[]
[]
[]
[]
[]
[]
[]
[]
[]
[]
[]
[]
[]
[]
[]
[]
[]
[]
[]
[]
[]
[]
[]
[]
[]
[]
[]
[]
[]
[]
[]
[]
[]
[]
[]
[]
[]
[]
[]
[]
[]
[]
[]
[]
[]
[]
[]
[]
[]
[]
[]
[]
[]
[]
[]
[]
[]
[]
[]
[]
[]
[]
[]
[]
[]
[]
[]
[]
[]
[]
[]
[]
[]
[]
[]
[]
[]
[]
[]
[]
[]
[]
[]
[]
[]
[]
[]
[]
[]
[]
[]
[]
[]
[]
[]
[]
[]
[]
[]
[]
[]
[]
[]
[]
[]
[]
[]
[]
[]
[]
[]
[]
[]
[]
[]
[]
[]
[]
[]
[]
[]
[]
[]
[]
[]
[]
[]
[]
[]
[]
[]
[]
[]
[]
[]
[]
[]
[]
[]
[]
[]
[]
[]
[]
[]
[]
[]
[]
[]
[]
[]
[]
[]
[]
[]
[]
[]
[]
[]
[]
[]
[]
[]
[]
[]
[]
[]
[]
[]
[]
[]
[]
[]
[]
[]
[]
[]
[]
[]
[]
[]
[]
[]
[]
[]
[]
[]
[]
[]
[]
[]
[]
[]
[]
[]
[]
[]
[]
[]
[]
[]
[]
[]
[]
[]
[]
[]
[]
[]
[]
[]
[]
[]
[]
[]
[]
[]
[]
[]
[]
[]
[]
[]
[]
[]
[]
[]
[]
[]
[]
[]
[]
[]
[]
[]
[]
[]
[]
[]
[]
[]
[]
[]
[]
[]
[]
[]
[]
[]
[]
[]
[]
[]
[]
[]
[]
[]
[]
[]
[]
[]
[]
[]
[]
[]
[]
[]
[]
[]
[]
[]
[]
[]
[]
[]
[]
[]
[]
[]
[]
[]
[]
[]
[]
[]
[]
[]
[]
[]
[]
[]
[]
[]
[]
[]
[]
[]
[]
[]
[]
[]
[]
[]
[]
[]
[]
[]
[]
[]
[]
[]
[]
[]
[]
[]
[]
[]
[]
[]
[]
[]
[]
[]
[]
[]
[]
[]
[]
[]
[]
[]
[]
[]
[]
[]
[]
[]
[]
[]
[]
[]
[]
[]
[]
[]
[]
[]
[]
[]
[]
[]
[]
[]
[]
[]
[]
[]
[]
[]
[]
[]
[]
[]
[]
[]
[]
[]
[]
[]
[]
[]
[]
[]
[]
[]
[]
[]
[]
[]
[]
[]
[]
[]
[]
[]
[]
[]
[]
[]
[]
[]
[]
[]
[]
[]
[]
[]
[]
[]
[]
[]
[]
[]
[]
[]
[]
[]
[]
[]
[]
[]
[]
[]
[]
[]
[]
[]
[]
[]
[]
[]
[]
[]
[]
[]
[]
[]
[]
[]
[]
[]
[]
[]
[]
[]
[]
[]
[]
[]
[]
[]
[]
[]
[]
[]
[]
[]
[]
[]
[]
[]
[]
[]
[]
[]
[]
[]
[]
[]
[]
[]
[]
[]
[]
[]
[]
[]
[]
[]
[]
[]
[]
[]
[]
[]
[]
[]
[]
[]
[]
[]
[]
[]
[]
[]
[]
[]
[]
[]
[]
[]
[]
[]
[]
[]
[]
[]
[]
[]
[]
[]
[]
[]
[]
[]
[]
[]
[]
[]
[]
[]
[]
[]
[]
[]
[]
[]
[]
[]
[]
[]
[]
[]
[]
[]
[]
[]
[]
[]
[]
[]
[]
[]
[]
[]
[]
[]
[]
[]
[]
[]
[]
[]
[]
[]
[]
[]
[]
[]
[]
[]
[]
[]
[]
[]
[]
[]
[]
[]
[]
[]
[]
[]
[]
[]
[]
[]
[]
[]
[]
[]
[]
[]
[]
[]
[]
[]
[]
[]
[]
[]
[]
[]
[]
[]
[]
[]
[]
[]
[]
[]
[]
[]
[]
[]
[]
[]
[]
[]
[]
[]
[]
[]
[]
[]
[]
[]
[]
[]
[]
[]
[]
[]
[]
[]
[]
[]
[]
[]
[]
[]
[]
[]
[]
[]
[]
[]
[]
[]
[]
[]
[]
[]
[]
[]
[]
[]
[]
[]
[]
[]
[]
[]
[]
[]
[]
[]
[]
[]
[]
[]
[]
[]
[]
[]
[]
[]
[]
[]
[]
[]
[]
[]
[]
[]
[]
[]
[]
[]
[]
[]
[]
[]
[]
[]
[]
[]
[]
[]
[]
[]
[]
[]
[]
[]
[]
[]
[]
[]
[]
[]
[]
[]
[]
[]
[]
[]
[]
[]
[]
[]
[]
[]
[]
[]
[]
[]
[]
[]
[]
[]
[]
[]
[]
[]
[]
[]
[]
[]
[]
[]
[]
[]
[]
[]
[]
[]
[]
[]
[]
[]
[]
[]
[]
[]
[]
[]
[]
[]
[]
[]
[]
[]
[]
[]
[]
[]
[]
[]
[]
[]
[]
[]
[]
[]
[]
[]
[]
[]
[]
[]
[]
[]
[]
[]
[]
[]
[]
[]
[]
[]
[]
[]
[]
[]
[]
[]
[]
[]
[]
[]
[]
[]
[]
[]
[]
[]
[]
[]
[]
[]
[]
[]
[]
[]
[]
[]
[]
[]
[]
[]
[]
[]
[]
[]
[]
[]
[]
[]
[]
[]
[]
[]
[]
[]
[]
[]
[]
[]
[]
[]
[]
[]
[]
[]
[]
[]
[]
[]
[]
[]
[]
[]
[]
[]
[]
[]
[]
[]
[]
[]
[]
[]
[]
[]
[]
[]
[]
[]
[]
[]
[]
[]
[]
[]
[]
[]
[]
[]
[]
[]
[]
[]
[]
[]
[]
[]
[]
[]
[]
[]
[]
[]
[]
[]
[]
[]
[]
[]
[]
[]
[]
[]
[]
[]
[]
[]
[]
[]
[]
[]
[]
[]
[]
[]
[]
[]
[]
[]
[]
[]
[]
[]
[]
[]
[]
[]
[]
[]
[]
[]
[]
[]
[]
[]
[]
[]
[]
[]
[]
[]
[]
[]
[]
[]
[]
[]
[]
[]
[]
[]
[]
[]
[]
[]
[]
[]
[]
[]
[]
[]
[]
[]
[]
[]
[]
[]
[]
[]
[]
[]
[]
[]
[]
[]
[]
[]
[]
[]
[]
[]
[]
[]
[]
[]
[]
[]
[]
[]
[]
[]
[]
[]
[]
[]
[]
[]
[]
[]
[]
[]
[]
[]
[]
[]
[]
[]
[]
[]
[]
[]
[]
[]
[]
[]
[]
[]
[]
[]
[]
[]
[]
[]
[]
[]
[]
[]
[]
[]
[]
[]
[]
[]
[]
[]
[]
[]
[]
[]
[]
[]
[]
[]
[]
[]
[]
[]
[]
[]
[]
[]
[]
[]
[]
[]
[]
[]
[]
[]
[]
[]
[]
[]
[]
[]
[]
[]
[]
[]
[]
[]
[]
[]
[]
[]
[]
[]
[]
[]
[]
[]
[]
[]
[]
[]
[]
[]
[]
[]
[]
[]
[]
[]
[]
[]
[]
[]
[]
[]
[]
[]
[]
[]
[]
[]
[]
[]
[]
[]
[]
[]
[]
[]
[]
[]
[]
[]
[]
[]
[]
[]
[]
[]
[]
[]
[]
[]
[]
[]
[]
[]
[]
[]
[]
[]
[]
[]
[]
[]
[]
[]
[]
[]
[]
[]
[]
[]
[]
[]
[]
[]
[]
[]
[]
[]
[]
[]
[]
[]
[]
[]
[]
[]
[]
[]
[]
[]
[]
[]
[]
[]
[]
[]
[]
[]
[]
[]
[]
[]
[]
[]
[]
[]
[]
[]
[]
[]
[]
[]
[]
[]
[]
[]
[]
[]
[]
[]
[]
[]
[]
[]
[]
[]
[]
[]
[]
[]
[]
[]
[]
[]
[]
[]
[]
[]
[]
[]
[]
[]
[]
[]
[]
[]
[]
[]
[]
[]
[]
[]
[]
[]
[]
[]
[]
[]
[]
[]
[]
[]
[]
[]
[]
[]
[]
[]
[]
[]
[]
[]
[]
[]
[]
[]
[]
[]
[]
[]
[]
[]
[]
[]
[]
[]
[]
[]
[]
[]
[]
[]
[]
[]
[]
[]
[]
[]
[]
[]
[]
[]
[]
[]
[]
[]
[]
[]
[]
[]
[]
[]
[]
[]
[]
[]
[]
[]
[]
[]
[]
[]
[]
[]
[]
[]
[]
[]
[]
[]
[]
[]
[]
[]
[]
[]
[]
[]
[]
[]
[]
[]
[]
[]
[]
[]
[]
[]
[]
[]
[]
[]
[]
[]
[]
[]
[]
[]
[]
[]
[]
[]
[]
[]
[]
[]
[]
[]
[]
[]
[]
[]
[]
[]
[]
[]
[]
[]
[]
[]
[]
[]
[]
[]
[]
[]
[]
[]
[]
[]
[]
[]
[]
[]
[]
[]
[]
[]
[]
[]
[]
[]
[]
[]
[]
[]
[]
[]
[]
[]
[]
[]
[]
[]
[]
[]
[]
[]
[]
[]
[]
[]
[]
[]
[]
[]
[]
[]
[]
[]
[]
[]
[]
[]
[]
[]
[]
[]
[]
[]
[]
[]
[]
[]
[]
[]
[]
[]
[]
[]
[]
[]
[]
[]
[]
[]
[]
[]
[]
[]
[]
[]
[]
[]
[]
[]
[]
[]
[]
[]
[]
[]
[]
[]
[]
[]
[]
[]
[]
[]
[]
[]
[]
[]
[]
[]
[]
[]
[]
[]
[]
[]
[]
[]
[]
[]
[]
[]
[]
[]
[]
[]
[]
[]
[]
[]
[]
[]
[]
[]
[]
[]
[]
[]
[]
[]
[]
[]
[]
[]
[]
[]
[]
[]
[]
[]
[]
[]
[]
[]
[]
[]
[]
[]
[]
[]
[]
[]
[]
[]
[]
[]
[]
[]
[]
[]
[]
[]
[]
[]
[]
[]
[]
[]
[]
[]
[]
[]
[]
[]
[]
[]
[]
[]
[]
[]
[]
[]
[]
[]
[]
[]
[]
[]
[]
[]
[]
[]
[]
[]
[]
[]
[]
[]
[]
[]
[]
[]
[]
[]
[]
[]
[]
[]
[]
[]
[]
[]
[]
[]
[]
[]
[]
[]
[]
[]
[]
[]
[]
[]
[]
[]
[]
[]
[]
[]
[]
[]
[]
[]
[]
[]
[]
[]
[]
[]
[]
[]
[]
[]
[]
[]
[]
[]
[]
[]
[]
[]
[]
[]
[]
[]
[]
[]
[]
[]
[]
[]
[]
[]
[]
[]
[]
[]
[]
[]
[]
[]
[]
[]
[]
[]
[]
[]
[]
[]
[]
[]
[]
[]
[]
[]
[]
[]
[]
[]
[]
[]
[]
[]
[]
[]
[]
[]
[]
[]
[]
[]
[]
[]
[]
[]
[]
[]
[]
[]
[]
[]
[]
[]
[]
[]
[]
[]
[]
[]
[]
[]
[]
[]
[]
[]
[]
[]
[]
[]
[]
[]
[]
[]
[]
[]
[]
[]
[]
[]
[]
[]
[]
[]
[]
[]
[]
[]
[]
[]
[]
[]
[]
[]
[]
[]
[]
[]
[]
[]
[]
[]
[]
[]
[]
[]
[]
[]
[]
[]
[]
[]
[]
[]
[]
[]
[]
[]
[]
[]
[]
[]
[]
[]
[]
[]
[]
[]
[]
[]
[]
[]
[]
[]
[]
[]
[]
[]
[]
[]
[]
[]
[]
[]
[]
[]
[]
[]
[]
[]
[]
[]
[]
[]
[]
[]
[]
[]
[]
[]
[]
[]
[]
[]
[]
[]
[]
[]
[]
[]
[]
[]
[]
[]
[]
[]
[]
[]
[]
[]
[]
[]
[]
[]
[]
[]
[]
[]
[]
[]
[]
[]
[]
[]
[]
[]
[]
[]
[]
[]
[]
[]
[]
[]
[]
[]
[]
[]
[]
[]
[]
[]
[]
[]
[]
[]
[]
[]
[]
[]
[]
[]
[]
[]
[]
[]
[]
[]
[]
[]
[]
[]
[]
[]
[]
[]
[]
[]
[]
[]
[]
[]
[]
[]
[]
[]
[]
[]
[]
[]
[]
[]
[]
[]
[]
[]
[]
[]
[]
[]
[]
[]
[]
[]
[]
[]
[]
[]
[]
[]
[]
[]
[]
[]
[]
[]
[]
[]
[]
[]
[]
[]
[]
[]
[]
[]
[]
[]
[]
[]
[]
[]
[]
[]
[]
[]
[]
[]
[]
[]
[]
[]
[]
[]
[]
[]
[]
[]
[]
[]
[]
[]
[]
[]
[]
[]
[]
[]
[]
[]
[]
[]
[]
[]
[]
[]
[]
[]
[]
[]
[]
[]
[]
[]
[]
[]
[]
[]
[]
[]
[]
[]
[]
[]
[]
[]
[]
[]
[]
[]
[]
[]
[]
[]
[]
[]
[]
[]
[]
[]
[]
[]
[]
[]
[]
[]
[]
[]
[]
[]
[]
[]
[]
[]
[]
[]
[]
[]
[]
[]
[]
[]
[]
[]
[]
[]
[]
[]
[]
[]
[]
[]
[]
[]
[]
[]
[]
[]
[]
[]
[]
[]
[]
[]
[]
[]
[]
[]
[]
[]
[]
[]
[]
[]
[]
[]
[]
[]
[]
[]
[]
[]
[]
[]
[]
[]
[]
[]
[]
[]
[]
[]
[]
[]
[]
[]
[]
[]
[]
[]
[]
[]
[]
[]
[]
[]
[]
[]
[]
[]
[]
[]
[]
[]
[]
[]
[]
[]
[]
[]
[]
[]
[]
[]
[]
[]
[]
[]
[]
[]
[]
[]
[]
[]
[]
[]
[]
[]
[]
[]
[]
[]
[]
[]
[]
[]
[]
[]
[]
[]
[]
[]
[]
[]
[]
[]
[]
[]
[]
[]
[]
[]
[]
[]
[]
[]
[]
[]
[]
[]
[]
[]
[]
[]
[]
[]
[]
[]
[]
[]
[]
[]
[]
[]
[]
[]
[]
[]
[]
[]
[]
[]
[]
[]
[]
[]
[]
[]
[]
[]
[]
[]
[]
[]
[]
[]
[]
[]
[]
[]
[]
[]
[]
[]
[]
[]
[]
[]
[]
[]
[]
[]
[]
[]
[]
[]
[]
[]
[]
[]
[]
[]
[]
[]
[]
[]
[]
[]
[]
[]
[]
[]
[]
[]
[]
[]
[]
[]
[]
[]
[]
[]
[]
[]
[]
[]
[]
[]
[]
[]
[]
[]
[]
[]
[]
[]
[]
[]
[]
[]
[]
[]
[]
[]
[]
[]
[]
[]
[]
[]
[]
[]
[]
[]
[]
[]
[]
[]
[]
[]
[]
[]
[]
[]
[]
[]
[]
[]
[]
[]
[]
[]
[]
[]
[]
[]
[]
[]
[]
[]
[]
[]
[]
[]
[]
[]
[]
[]
[]
[]
[]
[]
[]
[]
[]
[]
[]
[]
[]
[]
[]
[]
[]
[]
[]
[]
[]
[]
[]
[]
[]
[]
[]
[]
[]
[]
[]
[]
[]
[]
[]
[]
[]
[]
[]
[]
[]
[]
[]
[]
[]
[]
[]
[]
[]
[]
[]
[]
[]
[]
[]
[]
[]
[]
[]
[]
[]
[]
[]
[]
[]
[]
[]
[]
[]
[]
[]
[]
[]
[]
[]
[]
[]
[]
[]
[]
[]
[]
[]
[]
[]
[]
[]
[]
[]
[]
[]
[]
[]
[]
[]
[]
[]
[]
[]
[]
[]
[]
[]
[]
[]
[]
[]
[]
[]
[]
[]
[]
[]
[]
[]
[]
[]
[]
[]
[]
[]
[]
[]
[]
[]
[]
[]
[]
[]
[]
[]
[]
[]
[]
[]
[]
[]
[]
[]
[]
[]
[]
[]
[]
[]
[]
[]
[]
[]
[]
[]
[]
[]
[]
[]
[]
[]
[]
[]
[]
[]
[]
[]
[]
[]
[]
[]
[]
[]
[]
[]
[]
[]
[]
[]
[]
[]
[]
[]
[]
[]
[]
[]
[]
[]
[]
[]
[]
[]
[]
[]
[]
[]
[]
[]
[]
[]
[]
[]
[]
[]
[]
[]
[]
[]
[]
[]
[]
[]
[]
[]
[]
[]
[]
[]
[]
[]
[]
[]
[]
[]
[]
[]
[]
[]
[]
[]
[]
[]
[]
[]
[]
[]
[]
[]
[]
[]
[]
[]
[]
[]
[]
[]
[]
[]
[]
[]
[]
[]
[]
[]
[]
[]
[]
[]
[]
[]
[]
[]
[]
[]
[]
[]
[]
[]
[]
[]
[]
[]
[]
[]
[]
[]
[]
[]
[]
[]
[]
[]
[]
[]
[]
[]
[]
[]
[]
[]
[]
[]
[]
[]
[]
[]
[]
[]
[]
[]
[]
[]
[]
[]
[]
[]
[]
[]
[]
[]
[]
[]
[]
[]
[]
[]
[]
[]
[]
[]
[]
[]
[]
[]
[]
[]
[]
[]
[]
[]
[]
[]
[]
[]
[]
[]
[]
[]
[]
[]
[]
[]
[]
[]
[]
[]
[]
[]
[]
[]
[]
[]
[]
[]
[]
[]
[]
[]
[]
[]
[]
[]
[]
[]
[]
[]
[]
[]
[]
[]
[]
[]
[]
[]
[]
[]
[]
[]
[]
[]
[]
[]
[]
[]
[]
[]
[]
[]
[]
[]
[]
[]
[]
[]
[]
[]
[]
[]
[]
[]
[]
[]
[]
[]
[]
[]
[]
[]
[]
[]
[]
[]
[]
[]
[]
[]
[]
[]
[]
[]
[]
[]
[]
[]
[]
[]
[]
[]
[]
[]
[]
[]
[]
[]
[]
[]
[]
[]
[]
[]
[]
[]
[]
[]
[]
[]
[]
[]
[]
[]
[]
[]
[]
[]
[]
[]
[]
[]
[]
[]
[]
[]
[]
[]
[]
[]
[]
[]
[]
[]
[]
[]
[]
[]
[]
[]
[]
[]
[]
[]
[]
[]
[]
[]
[]
[]
[]
[]
[]
[]
[]
[]
[]
[]
[]
[]
[]
[]
[]
[]
[]
[]
[]
[]
[]
[]
[]
[]
[]
[]
[]
[]
[]
[]
[]
[]
[]
[]
[]
[]
[]
[]
[]
[]
[]
[]
[]
[]
[]
[]
[]
[]
[]
[]
[]
[]
[]
[]
[]
[]
[]
[]
[]
[]
[]
[]
[]
[]
[]
[]
[]
[]
[]
[]
[]
[]
[]
[]
[]
[]
[]
[]
[]
[]
[]
[]
[]
[]
[]
[]
[]
[]
[]
[]
[]
[]
[]
[]
[]
[]
[]
[]
[]
[]
[]
[]
[]
[]
[]
[]
[]
[]
[]
[]
[]
[]
[]
[]
[]
[]
[]
[]
[]
[]
[]
[]
[]
[]
[]
[]
[]
[]
[]
[]
[]
[]
[]
[]
[]
[]
[]
[]
[]
[]
[]
[]
[]
[]
[]
[]
[]
[]
[]
[]
[]
[]
[]
[]
[]
[]
[]
[]
[]
[]
[]
[]
[]
[]
[]
[]
[]
[]
[]
[]
[]
[]
[]
[]
[]
[]
[]
[]
[]
[]
[]
[]
[]
[]
[]
[]
[]
[]
[]
[]
[]
[]
[]
[]
[]
[]
[]
[]
[]
[]
[]
[]
[]
[]
[]
[]
[]
[]
[]
[]
[]
[]
[]
[]
[]
[]
[]
[]
[]
[]
[]
[]
[]
[]
[]
[]
[]
[]
[]
[]
[]
[]
[]
[]
[]
[]
[]
[]
[]
[]
[]
[]
[]
[]
[]
[]
[]
[]
[]
[]
[]
[]
[]
[]
[]
[]
[]
[]
[]
[]
[]
[]
[]
[]
[]
[]
[]
[]
[]
[]
[]
[]
[]
[]
[]
[]
[]
[]
[]
[]
[]
[]
[]
[]
[]
[]
[]
[]
[]
[]
[]
[]
[]
[]
[]
[]
[]
[]
[]
[]
[]
[]
[]
[]
[]
[]
[]
[]
[]
[]
[]
[]
[]
[]
[]
[]
[]
[]
[]
[]
[]
[]
[]
[]
[]
[]
[]
[]
[]
[]
[]
[]
[]
[]
[]
[]
[]
[]
[]
[]
[]
[]
[]
[]
[]
[]
[]
[]
[]
[]
[]
[]
[]
[]
[]
[]
[]
[]
[]
[]
[]
[]
[]
[]
[]
[]
[]
[]
[]
[]
[]
[]
[]
[]
[]
[]
[]
[]
[]
[]
[]
[]
[]
[]
[]
[]
[]
[]
[]
[]
[]
[]
[]
[]
[]
[]
[]
[]
[]
[]
[]
[]
[]
[]
[]
[]
[]
[]
[]
[]
[]
[]
[]
[]
[]
[]
[]
[]
[]
[]
[]
[]
[]
[]
[]
[]
[]
[]
[]
[]
[]
[]
[]
[]
[]
[]
[]
[]
[]
[]
[]
[]
[]
[]
[]
[]
[]
[]
[]
[]
[]
[]
[]
[]
[]
[]
[]
[]
[]
[]
[]
[]
[]
[]
[]
[]
[]
[]
[]
[]
[]
[]
[]
[]
[]
[]
[]
[]
[]
[]
[]
[]
[]
[]
[]
[]
[]
[]
[]
[]
[]
[]
[]
[]
[]
[]
[]
[]
[]
[]
[]
[]
[]
[]
[]
[]
[]
[]
[]
[]
[]
[]
[]
[]
[]
[]
[]
[]
[]
[]
[]
[]
[]
[]
[]
[]
[]
[]
[]
[]
[]
[]
[]
[]
[]
[]
[]
[]
[]
[]
[]
[]
[]
[]
[]
[]
[]
[]
[]
[]
[]
[]
[]
[]
[]
[]
[]
[]
[]
[]
[]
[]
[]
[]
[]
[]
[]
[]
[]
[]
[]
[]
[]
[]
[]
[]
[]
[]
[]
[]
[]
[]
[]
[]
[]
[]
[]
[]
[]
[]
[]
[]
[]
[]
[]
[]
[]
[]
[]
[]
[]
[]
[]
[]
[]
[]
[]
[]
[]
[]
[]
[]
[]
[]
[]
[]
[]
[]
[]
[]
[]
[]
[]
[]
[]
[]
[]
[]
[]
[]
[]
[]
[]
[]
[]
[]
[]
[]
[]
[]
[]
[]
[]
[]
[]
[]
[]
[]
[]
[]
[]
[]
[]
[]
[]
[]
[]
[]
[]
[]
[]
[]
[]
[]
[]
[]
[]
[]
[]
[]
[]
[]
[]
[]
[]
[]
[]
[]
[]
[]
[]
[]
[]
[]
[]
[]
[]
[]
[]
[]
[]
[]
[]
[]
[]
[]
[]
[]
[]
[]
[]
[]
[]
[]
[]
[]
[]
[]
[]
[]
[]
[]
[]
[]
[]
[]
[]
[]
[]
[]
[]
[]
[]
[]
[]
[]
[]
[]
[]
[]
[]
[]
[]
[]
[]
[]
[]
[]
[]
[]
[]
[]
[]
[]
[]
[]
[]
[]
[]
[]
[]
[]
[]
[]
[]
[]
[]
[]
[]
[]
[]
[]
[]
[]
[]
[]
[]
[]
[]
[]
[]
[]
[]
[]
[]
[]
[]
[]
[]
[]
[]
[]
[]
[]
[]
[]
[]
[]
[]
[]
[]
[]
[]
[]
[]
[]
[]
[]
[]
[]
[]
[]
[]
[]
[]
[]
[]
[]
[]
[]
[]
[]
[]
[]
[]
[]
[]
[]
[]
[]
[]
[]
[]
[]
[]
[]
[]
[]
[]
[]
[]
[]
[]
[]
[]
[]
[]
[]
[]
[]
[]
[]
[]
[]
[]
[]
[]
[]
[]
[]
[]
[]
[]
[]
[]
[]
[]
[]
[]
[]
[]
[]
[]
[]
[]
[]
[]
[]
[]
[]
[]
[]
[]
[]
[]
[]
[]
[]
[]
[]
[]
[]
[]
[]
[]
[]
[]
[]
[]
[]
[]
[]
[]
[]
[]
[]
[]
[]
[]
[]
[]
[]
[]
[]
[]
[]
[]
[]
[]
[]
[]
[]
[]
[]
[]
[]
[]
[]
[]
[]
[]
[]
[]
[]
[]
[]
[]
[]
[]
[]
[]
[]
[]
[]
[]
[]
[]
[]
[]
[]
[]
[]
[]
[]
[]
[]
[]
[]
[]
[]
[]
[]
[]
[]
[]
[]
[]
[]
[]
[]
[]
[]
[]
[]
[]
[]
[]
[]
[]
[]
[]
[]
[]
[]
[]
[]
[]
[]
[]
[]
[]
[]
[]
[]
[]
[]
[]
[]
[]
[]
[]
[]
[]
[]
[]
[]
[]
[]
[]
[]
[]
[]
[]
[]
[]
[]
[]
[]
[]
[]
[]
[]
[]
[]
[]
[]
[]
[]
[]
[]
[]
[]
[]
[]
[]
[]
[]
[]
[]
[]
[]
[]
[]
[]
[]
[]
[]
[]
[]
[]
[]
[]
[]
[]
[]
[]
[]
[]
[]
[]
[]
[]
[]
[]
[]
[]
[]
[]
[]
[]
[]
[]
[]
[]
[]
[]
[]
[]
[]
[]
[]
[]
[]
[]
[]
[]
[]
[]
[]
[]
[]
[]
[]
[]
[]
[]
[]
[]
[]
[]
[]
[]
[]
[]
[]
[]
[]
[]
[]
[]
[]
[]
[]
[]
[]
[]
[]
[]
[]
[]
[]
[]
[]
[]
[]
[]
[]
[]
[]
[]
[]
[]
[]
[]
[]
[]
[]
[]
[]
[]
[]
[]
[]
[]
[]
[]
[]
[]
[]
[]
[]
[]
[]
[]
[]
[]
[]
[]
[]
[]
[]
[]
[]
[]
[]
[]
[]
[]
[]
[]
[]
[]
[]
[]
[]
[]
[]
[]
[]
[]
[]
[]
[]
[]
[]
[]
[]
[]
[]
[]
[]
[]
[]
[]
[]
[]
[]
[]
[]
[]
[]
[]
[]
[]
[]
[]
[]
[]
[]
[]
[]
[]
[]
[]
[]
[]
[]
[]
[]
[]
[]
[]
[]
[]
[]
[]
[]
[]
[]
[]
[]
[]
[]
[]
[]
[]
[]
[]
[]
[]
[]
[]
[]
[]
[]
[]
[]
[]
[]
[]
[]
[]
[]
[]
[]
[]
[]
[]
[]
[]
[]
[]
[]
[]
[]
[]
[]
[]
[]
[]
[]
[]
[]
[]
[]
[]
[]
[]
[]
[]
[]
[]
[]
[]
[]
[]
[]
[]
[]
[]
[]
[]
[]
[]
[]
[]
[]
[]
[]
[]
[]
[]
[]
[]
[]
[]
[]
[]
[]
[]
[]
[]
[]
[]
[]
[]
[]
[]
[]
[]
[]
[]
[]
[]
[]
[]
[]
[]
[]
[]
[]
[]
[]
[]
[]
[]
[]
[]
[]
[]
[]
[]
[]
[]
[]
[]
[]
[]
[]
[]
[]
[]
[]
[]
[]
[]
[]
[]
[]
[]
[]
[]
[]
[]
[]
[]
[]
[]
[]
[]
[]
[]
[]
[]
[]
[]
[]
[]
[]
[]
[]
[]
[]
[]
[]
[]
[]
[]
[]
[]
[]
[]
[]
[]
[]
[]
[]
[]
[]
[]
[]
[]
[]
[]
[]
[]
[]
[]
[]
[]
[]
[]
[]
[]
[]
[]
[]
[]
[]
[]
[]
[]
[]
[]
[]
[]
[]
[]
[]
[]
[]
[]
[]
[]
[]
[]
[]
[]
[]
[]
[]
[]
[]
[]
[]
[]
[]
[]
[]
[]
[]
[]
[]
[]
[]
[]
[]
[]
[]
[]
[]
[]
[]
[]
[]
[]
[]
[]
[]
[]
[]
[]
[]
[]
[]
[]
[]
[]
[]
[]
[]
[]
[]
[]
[]
[]
[]
[]
[]
[]
[]
[]
[]
[]
[]
[]
[]
[]
[]
[]
[]
[]
[]
[]
[]
[]
[]
[]
[]
[]
[]
[]
[]
[]
[]
[]
[]
[]
[]
[]
[]
[]
[]
[]
[]
[]
[]
[]
[]
[]
[]
[]
[]
[]
[]
[]
[]
[]
[]
[]
[]
[]
[]
[]
[]
[]
[]
[]
[]
[]
[]
[]
[]
[]
[]
[]
[]
[]
[]
[]
[]
[]
[]
[]
[]
[]
[]
[]
[]
[]
[]
[]
[]
[]
[]
[]
[]
[]
[]
[]
[]
[]
[]
[]
[]
[]
[]
[]
[]
[]
[]
[]
[]
[]
[]
[]
[]
[]
[]
[]
[]
[]
[]
[]
[]
[]
[]
[]
[]
[]
[]
[]
[]
[]
[]
[]
[]
[]
[]
[]
[]
[]
[]
[]
[]
[]
[]
[]
[]
[]
[]
[]
[]
[]
[]
[]
[]
[]
[]
[]
[]
[]
[]
[]
[]
[]
[]
[]
[]
[]
[]
[]
[]
[]
[]
[]
[]
[]
[]
[]
[]
[]
[]
[]
[]
[]
[]
[]
[]
[]
[]
[]
[]
[]
[]
[]
[]
[]
[]
[]
[]
[]
[]
[]
[]
[]
[]
[]
[]
[]
[]
[]
[]
[]
[]
[]
[]
[]
[]
[]
[]
[]
[]
[]
[]
[]
[]
[]
[]
[]
[]
[]
[]
[]
[]
[]
[]
[]
[]
[]
[]
[]
[]
[]
[]
[]
[]
[]
[]
[]
[]
[]
[]
[]
[]
[]
[]
[]
[]
[]
[]
[]
[]
[]
[]
[]
[]
[]
[]
[]
[]
[]
[]
[]
[]
[]
[]
[]
[]
[]
[]
[]
[]
[]
[]
[]
[]
[]
[]
[]
[]
[]
[]
[]
[]
[]
[]
[]
[]
[]
[]
[]
[]
[]
[]
[]
[]
[]
[]
[]
[]
[]
[]
[]
[]
[]
[]
[]
[]
[]
[]
[]
[]
[]
[]
[]
[]
[]
[]
[]
[]
[]
[]
[]
[]
[]
[]
[]
[]
[]
[]
[]
[]
[]
[]
[]
[]
[]
[]
[]
[]
[]
[]
[]
[]
[]
[]
[]
[]
[]
[]
[]
[]
[]
[]
[]
[]
[]
[]
[]
[]
[]
[]
[]
[]
[]
[]
[]
[]
[]
[]
[]
[]
[]
[]
[]
[]
[]
[]
[]
[]
[]
[]
[]
[]
[]
[]
[]
[]
[]
[]
[]
[]
[]
[]
[]
[]
[]
[]
[]
[]
[]
[]
[]
[]
[]
[]
[]
[]
[]
[]
[]
[]
[]
[]
[]
[]
[]
[]
[]
[]
[]
[]
[]
[]
[]
[]
[]
[]
[]
[]
[]
[]
[]
[]
[]
[]
[]
[]
[]
[]
[]
[]
[]
[]
[]
[]
[]
[]
[]
[]
[]
[]
[]
[]
[]
[]
[]
[]
[]
[]
[]
[]
[]
[]
[]
[]
[]
[]
[]
[]
[]
[]
[]
[]
[]
[]
[]
[]
[]
[]
[]
[]
[]
[]
[]
[]
[]
[]
[]
[]
[]
[]
[]
[]
[]
[]
[]
[]
[]
[]
[]
[]
[]
[]
[]
[]
[]
[]
[]
[]
[]
[]
[]
[]
[]
[]
[]
[]
[]
[]
[]
[]
[]
[]
[]
[]
[]
[]
[]
[]
[]
[]
[]
[]
[]
[]
[]
[]
[]
[]
[]
[]
[]
[]
[]
[]
[]
[]
[]
[]
[]
[]
[]
[]
[]
[]
[]
[]
[]
[]
[]
[]
[]
[]
[]
[]
[]
[]
[]
[]
[]
[]
[]
[]
[]
[]
[]
[]
[]
[]
[]
[]
[]
[]
[]
[]
[]
[]
[]
[]
[]
[]
[]
[]
[]
[]
[]
[]
[]
[]
[]
[]
[]
[]
[]
[]
[]
[]
[]
[]
[]
[]
[]
[]
[]
[]
[]
[]
[]
[]
[]
[]
[]
[]
[]
[]
[]
[]
[]
[]
[]
[]
[]
[]
[]
[]
[]
[]
[]
[]
[]
[]
[]
[]
[]
[]
[]
[]
[]
[]
[]
[]
[]
[]
[]
[]
[]
[]
[]
[]
[]
[]
[]
[]
[]
[]
[]
[]
[]
[]
[]
[]
[]
[]
[]
[]
[]
[]
[]
[]
[]
[]
[]
[]
[]
[]
[]
[]
[]
[]
[]
[]
[]
[]
[]
[]
[]
[]
[]
[]
[]
[]
[]
[]
[]
[]
[]
[]
[]
[]
[]
[]
[]
[]
[]
[]
[]
[]
[]
[]
[]
[]
[]
[]
[]
[]
[]
[]
[]
[]
[]
[]
[]
[]
[]
[]
[]
[]
[]
[]
[]
[]
[]
[]
[]
[]
[]
[]
[]
[]
[]
[]
[]
[]
[]
[]
[]
[]
[]
[]
[]
[]
[]
[]
[]
[]
[]
[]
[]
[]
[]
[]
[]
[]
[]
[]
[]
[]
[]
[]
[]
[]
[]
[]
[]
[]
[]
[]
[]
[]
[]
[]
[]
[]
[]
[]
[]
[]
[]
[]
[]
[]
[]
[]
[]
[]
[]
[]
[]
[]
[]
[]
[]
[]
[]
[]
[]
[]
[]
[]
[]
[]
[]
[]
[]
[]
[]
[]
[]
[]
[]
[]
[]
[]
[]
[]
[]
[]
[]
[]
[]
[]
[]
[]
[]
[]
[]
[]
[]
[]
[]
[]
[]
[]
[]
[]
[]
[]
[]
[]
[]
[]
[]
[]
[]
[]
[]
[]
[]
[]
[]
[]
[]
[]
[]
[]
[]
[]
[]
[]
[]
[]
[]
[]
[]
[]
[]
[]
[]
[]
[]
[]
[]
[]
[]
[]
[]
[]
[]
[]
[]
[]
[]
[]
[]
[]
[]
[]
[]
[]
[]
[]
[]
[]
[]
[]
[]
[]
[]
[]
[]
[]
[]
[]
[]
[]
[]
[]
[]
[]
[]
[]
[]
[]
[]
[]
[]
[]
[]
[]
[]
[]
[]
[]
[]
[]
[]
[]
[]
[]
[]
[]
[]
[]
[]
[]
[]
[]
[]
[]
[]
[]
[]
[]
[]
[]
[]
[]
[]
[]
[]
[]
[]
[]
[]
[]
[]
[]
[]
[]
[]
[]
[]
[]
[]
[]
[]
[]
[]
[]
[]
[]
[]
[]
[]
[]
[]
[]
[]
[]
[]
[]
[]
[]
[]
[]
[]
[]
[]
[]
[]
[]
[]
[]
[]
[]
[]
[]
[]
[]
[]
[]
[]
[]
[]
[]
[]
[]
[]
[]
[]
[]
[]
[]
[]
[]
[]
[]
[]
[]
[]
[]
[]
[]
[]
[]
[]
[]
[]
[]
[]
[]
[]
[]
[]
[]
[]
[]
[]
[]
[]
[]
[]
[]
[]
[]
[]
[]
[]
[]
[]
[]
[]
[]
[]
[]
[]
[]
[]
[]
[]
[]
[]
[]
[]
[]
[]
[]
[]
[]
[]
[]
[]
[]
[]
[]
[]
[]
[]
[]
[]
[]
[]
[]
[]
[]
[]
[]
[]
[]
[]
[]
[]
[]
[]
[]
[]
[]
[]
[]
[]
[]
[]
[]
[]
[]
[]
[]
[]
[]
[]
[]
[]
[]
[]
[]
[]
[]
[]
[]
[]
[]
[]
[]
[]
[]
[]
[]
[]
[]
[]
[]
[]
[]
[]
[]
[]
[]
[]
[]
[]
[]
[]
[]
[]
[]
[]
[]
[]
[]
[]
[]
[]
[]
[]
[]
[]
[]
[]
[]
[]
[]
[]
[]
[]
[]
[]
[]
[]
[]
[]
[]
[]
[]
[]
[]
[]
[]
[]
[]
[]
[]
[]
[]
[]
[]
[]
[]
[]
[]
[]
[]
[]
[]
[]
[]
[]
[]
[]
[]
[]
[]
[]
[]
[]
[]
[]
[]
[]
[]
[]
[]
[]
[]
[]
[]
[]
[]
[]
[]
[]
[]
[]
[]
[]
[]
[]
[]
[]
[]
[]
[]
[]
[]
[]
[]
[]
[]
[]
[]
[]
[]
[]
[]
[]
[]
[]
[]
[]
[]
[]
[]
[]
[]
[]
[]
[]
[]
[]
[]
[]
[]
[]
[]
[]
[]
[]
[]
[]
[]
[]
[]
[]
[]
[]
[]
[]
[]
[]
[]
[]
[]
[]
[]
[]
[]
[]
[]
[]
[]
[]
[]
[]
[]
[]
[]
[]
[]
[]
[]
[]
[]
[]
[]
[]
[]
[]
[]
[]
[]
[]
[]
[]
[]
[]
[]
[]
[]
[]
[]
[]
[]
[]
[]
[]
[]
[]
[]
[]
[]
[]
[]
[]
[]
[]
[]
[]
[]
[]
[]
[]
[]
[]
[]
[]
[]
[]
[]
[]
[]
[]
[]
[]
[]
[]
[]
[]
[]
[]
[]
[]
[]
[]
[]
[]
[]
[]
[]
[]
[]
[]
[]
[]
[]
[]
[]
[]
[]
[]
[]
[]
[]
[]
[]
[]
[]
[]
[]
[]
[]
[]
[]
[]
[]
[]
[]
[]
[]
[]
[]
[]
[]
[]
[]
[]
[]
[]
[]
[]
[]
[]
[]
[]
[]
[]
[]
[]
[]
[]
[]
[]
[]
[]
[]
[]
[]
[]
[]
[]
[]
[]
[]
[]
[]
[]
[]
[]
[]
[]
[]
[]
[]
[]
[]
[]
[]
[]
[]
[]
[]
[]
[]
[]
[]
[]
[]
[]
[]
[]
[]
[]
[]
[]
[]
[]
[]
[]
[]
[]
[]
[]
[]
[]
[]
[]
[]
[]
[]
[]
[]
[]
[]
[]
[]
[]
[]
[]
[]
[]
[]
[]
[]
[]
[]
[]
[]
[]
[]
[]
[]
[]
[]
[]
[]
[]
[]
[]
[]
[]
[]
[]
[]
[]
[]
[]
[]
[]
[]
[]
[]
[]
[]
[]
[]
[]
[]
[]
[]
[]
[]
[]
[]
[]
[]
[]
[]
[]
[]
[]
[]
[]
[]
[]
[]
[]
[]
[]
[]
[]
[]
[]
[]
[]
[]
[]
[]
[]
[]
[]
[]
[]
[]
[]
[]
[]
[]
[]
[]
[]
[]
[]
[]
[]
[]
[]
[]
[]
[]
[]
[]
[]
[]
[]
[]
[]
[]
[]
[]
[]
[]
[]
[]
[]
[]
[]
[]
[]
[]
[]
[]
[]
[]
[]
[]
[]
[]
[]
[]
[]
[]
[]
[]
[]
[]
[]
[]
[]
[]
[]
[]
[]
[]
[]
[]
[]
[]
[]
[]
[]
[]
[]
[]
[]
[]
[]
[]
[]
[]
[]
[]
[]
[]
[]
[]
[]
[]
[]
[]
[]
[]
[]
[]
[]
[]
[]
[]
[]
[]
[]
[]
[]
[]
[]
[]
[]
[]
[]
[]
[]
[]
[]
[]
[]
[]
[]
[]
[]
[]
[]
[]
[]
[]
[]
[]
[]
[]
[]
[]
[]
[]
[]
[]
[]
[]
[]
[]
[]
[]
[]
[]
[]
[]
[]
[]
[]
[]
[]
[]
[]
[]
[]
[]
[]
[]
[]
[]
[]
[]
[]
[]
[]
[]
[]
[]
[]
[]
[]
[]
[]
[]
[]
[]
[]
[]
[]
[]
[]
[]
[]
[]
[]
[]
[]
[]
[]
[]
[]
[]
[]
[]
[]
[]
[]
[]
[]
[]
[]
[]
[]
[]
[]
[]
[]
[]
[]
[]
[]
[]
[]
[]
[]
[]
[]
[]
[]
[]
[]
[]
[]
[]
[]
[]
[]
[]
[]
[]
[]
[]
[]
[]
[]
[]
[]
[]
[]
[]
[]
[]
[]
[]
[]
[]
[]
[]
[]
[]
[]
[]
[]
[]
[]
[]
[]
[]
[]
[]
[]
[]
[]
[]
[]
[]
[]
[]
[]
[]
[]
[]
[]
[]
[]
[]
[]
[]
[]
[]
[]
[]
[]
[]
[]
[]
[]
[]
[]
[]
[]
[]
[]
[]
[]
[]
[]
[]
[]
[]
[]
[]
[]
[]
[]
[]
[]
[]
[]
[]
[]
[]
[]
[]
[]
[]
[]
[]
[]
[]
[]
[]
[]
[]
[]
[]
[]
[]
[]
[]
[]
[]
[]
[]
[]
[]
[]
[]
[]
[]
[]
[]
[]
[]
[]
[]
[]
[]
[]
[]
[]
[]
[]
[]
[]
[]
[]
[]
[]
[]
[]
[]
[]
[]
[]
[]
[]
[]
[]
[]
[]
[]
[]
[]
[]
[]
[]
[]
[]
[]
[]
[]
[]
[]
[]
[]
[]
[]
[]
[]
[]
[]
[]
[]
[]
[]
[]
[]
[]
[]
[]
[]
[]
[]
[]
[]
[]
[]
[]
[]
[]
[]
[]
[]
[]
[]
[]
[]
[]
[]
[]
[]
[]
[]
[]
[]
[]
[]
[]
[]
[]
[]
[]
[]
[]
[]
[]
[]
[]
[]
[]
[]
[]
[]
[]
[]
[]
[]
[]
[]
[]
[]
[]
[]
[]
[]
[]
[]
[]
[]
[]
[]
[]
[]
[]
[]
[]
[]
[]
[]
[]
[]
[]
[]
[]
[]
[]
[]
[]
[]
[]
[]
[]
[]
[]
[]
[]
[]
[]
[]
[]
[]
[]
[]
[]
[]
[]
[]
[]
[]
[]
[]
[]
[]
[]
[]
[]
[]
[]
[]
[]
[]
[]
[]
[]
[]
[]
[]
[]
[]
[]
[]
[]
[]
[]
[]
[]
[]
[]
[]
[]
[]
[]
[]
[]
[]
[]
[]
[]
[]
[]
[]
[]
[]
[]
[]
[]
[]
[]
[]
[]
[]
[]
[]
[]
[]
[]
[]
[]
[]
[]
[]
[]
[]
[]
[]
[]
[]
[]
[]
[]
[]
[]
[]
[]
[]
[]
[]
[]
[]
[]
[]
[]
[]
[]
[]
[]
[]
[]
[]
[]
[]
[]
[]
[]
[]
[]
[]
[]
[]
[]
[]
[]
[]
[]
[]
[]
[]
[]
[]
[]
[]
[]
[]
[]
[]
[]
[]
[]
[]
[]
[]
[]
[]
[]
[]
[]
[]
[]
[]
[]
[]
[]
[]
[]
[]
[]
[]
[]
[]
[]
[]
[]
[]
[]
[]
[]
[]
[]
[]
[]
[]
[]
[]
[]
[]
[]
[]
[]
[]
[]
[]
[]
[]
[]
[]
[]
[]
[]
[]
[]
[]
[]
[]
[]
[]
[]
[]
[]
[]
[]
[]
[]
[]
[]
[]
[]
[]
[]
[]
[]
[]
[]
[]
[]
[]
[]
[]
[]
[]
[]
[]
[]
[]
[]
[]
[]
[]
[]
[]
[]
[]
[]
[]
[]
[]
[]
[]
[]
[]
[]
[]
[]
[]
[]
[]
[]
[]
[]
[]
[]
[]
[]
[]
[]
[]
[]
[]
[]
[]
[]
[]
[]
[]
[]
[]
[]
[]
[]
[]
[]
[]
[]
[]
[]
[]
[]
[]
[]
[]
[]
[]
[]
[]
[]
[]
[]
[]
[]
[]
[]
[]
[]
[]
[]
[]
[]
[]
[]
[]
[]
[]
[]
[]
[]
[]
[]
[]
[]
[]
[]
[]
[]
[]
[]
[]
[]
[]
[]
[]
[]
[]
[]
[]
[]
[]
[]
[]
[]
[]
[]
[]
[]
[]
[]
[]
[]
[]
[]
[]
[]
[]
[]
[]
[]
[]
[]
[]
[]
[]
[]
[]
[]
[]
[]
[]
[]
[]
[]
[]
[]
[]
[]
[]
[]
[]
[]
[]
[]
[]
[]
[]
[]
[]
[]
[]
[]
[]
[]
[]
[]
[]
[]
[]
[]
[]
[]
[]
[]
[]
[]
[]
[]
[]
[]
[]
[]
[]
[]
[]
[]
[]
[]
[]
[]
[]
[]
[]
[]
[]
[]
[]
[]
[]
[]
[]
[]
[]
[]
[]
[]
[]
[]
[]
[]
[]
[]
[]
[]
[]
[]
[]
[]
[]
[]
[]
[]
[]
[]
[]
[]
[]
[]
[]
[]
[]
[]
[]
[]
[]
[]
[]
[]
[]
[]
[]
[]
[]
[]
[]
[]
[]
[]
[]
[]
[]
[]
[]
[]
[]
[]
[]
[]
[]
[]
[]
[]
[]
[]
[]
[]
[]
[]
[]
[]
[]
[]
[]
[]
[]
[]
[]
[]
[]
[]
[]
[]
[]
[]
[]
[]
[]
[]
[]
[]
[]
[]
[]
[]
[]
[]
[]
[]
[]
[]
[]
[]
[]
[]
[]
[]
[]
[]
[]
[]
[]
[]
[]
[]
[]
[]
[]
[]
[]
[]
[]
[]
[]
[]
[]
[]
[]
[]
[]
[]
[]
[]
[]
[]
[]
[]
[]
[]
[]
[]
[]
[]
[]
[]
[]
[]
[]
[]
[]
[]
[]
[]
[]
[]
[]
[]
[]
[]
[]
[]
[]
[]
[]
[]
[]
[]
[]
[]
[]
[]
[]
[]
[]
[]
[]
[]
[]
[]
[]
[]
[]
[]
[]
[]
[]
[]
[]
[]
[]
[]
[]
[]
[]
[]
[]
[]
[]
[]
[]
[]
[]
[]
[]
[]
[]
[]
[]
[]
[]
[]
[]
[]
[]
[]
[]
[]
[]
[]
[]
[]
[]
[]
[]
[]
[]
[]
[]
[]
[]
[]
[]
[]
[]
[]
[]
[]
[]
[]
[]
[]
[]
[]
[]
[]
[]
[]
[]
[]
[]
[]
[]
[]
[]
[]
[]
[]
[]
[]
[]
[]
[]
[]
[]
[]
[]
[]
[]
[]
[]
[]
[]
[]
[]
[]
[]
[]
[]
[]
[]
[]
[]
[]
[]
[]
[]
[]
[]
[]
[]
[]
[]
[]
[]
[]
[]
[]
[]
[]
[]
[]
[]
[]
[]
[]
[]
[]
[]
[]
[]
[]
[]
[]
[]
[]
[]
[]
[]
[]
[]
[]
[]
[]
[]
[]
[]
[]
[]
[]
[]
[]
[]
[]
[]
[]
[]
[]
[]
[]
[]
[]
[]
[]
[]
[]
[]
[]
[]
[]
[]
[]
[]
[]
[]
[]
[]
[]
[]
[]
[]
[]
[]
[]
[]
[]
[]
[]
[]
[]
[]
[]
[]
[]
[]
[]
[]
[]
[]
[]
[]
[]
[]
[]
[]
[]
[]
[]
[]
[]
[]
[]
[]
[]
[]
[]
[]
[]
[]
[]
[]
[]
[]
[]
[]
[]
[]
[]
[]
[]
[]
[]
[]
[]
[]
[]
[]
[]
[]
[]
[]
[]
[]
[]
[]
[]
[]
[]
[]
[]
[]
[]
[]
[]
[]
[]
[]
[]
[]
[]
[]
[]
[]
[]
[]
[]
[]
[]
[]
[]
[]
[]
[]
[]
[]
[]
[]
[]
[]
[]
[]
[]
[]
[]
[]
[]
[]
[]
[]
[]
[]
[]
[]
[]
[]
[]
[]
[]
[]
[]
[]
[]
[]
[]
[]
[]
[]
[]
[]
[]
[]
[]
[]
[]
[]
[]
[]
[]
[]
[]
[]
[]
[]
[]
[]
[]
[]
[]
[]
[]
[]
[]
[]
[]
[]
[]
[]
[]
[]
[]
[]
[]
[]
[]
[]
[]
[]
[]
[]
[]
[]
[]
[]
[]
[]
[]
[]
[]
[]
[]
[]
[]
[]
[]
[]
[]
[]
[]
[]
[]
[]
[]
[]
[]
[]
[]
[]
[]
[]
[]
[]
[]
[]
[]
[]
[]
[]
[]
[]
[]
[]
[]
[]
[]
[]
[]
[]
[]
[]
[]
[]
[]
[]
[]
[]
[]
[]
[]
[]
[]
[]
[]
[]
[]
[]
[]
[]
[]
[]
[]
[]
[]
[]
[]
[]
[]
[]
[]
[]
[]
[]
[]
[]
[]
[]
[]
[]
[]
[]
[]
[]
[]
[]
[]
[]
[]
[]
[]
[]
[]
[]
[]
[]
[]
[]
[]
[]
[]
[]
[]
[]
[]
[]
[]
[]
[]
[]
[]
[]
[]
[]
[]
[]
[]
[]
[]
[]
[]
[]
[]
[]
[]
[]
[]
[]
[]
[]
[]
[]
[]
[]
[]
[]
[]
[]
[]
[]
[]
[]
[]
[]
[]
[]
[]
[]
[]
[]
[]
[]
[]
[]
[]
[]
[]
[]
[]
[]
[]
[]
[]
[]
[]
[]
[]
[]
[]
[]
[]
[]
[]
[]
[]
[]
[]
[]
[]
[]
[]
[]
[]
[]
[]
[]
[]
[]
[]
[]
[]
[]
[]
[]
[]
[]
[]
[]
[]
[]
[]
[]
[]
[]
[]
[]
[]
[]
[]
[]
[]
[]
[]
[]
[]
[]
[]
[]
[]
[]
[]
[]
[]
[]
[]
[]
[]
[]
[]
[]
[]
[]
[]
[]
[]
[]
[]
[]
[]
[]
[]
[]
[]
[]
[]
[]
[]
[]
[]
[]
[]
[]
[]
[]
[]
[]
[]
[]
[]
[]
[]
[]
[]
[]
[]
[]
[]
[]
[]
[]
[]
[]
[]
[]
[]
[]
[]
[]
[]
[]
[]
[]
[]
[]
[]
[]
[]
[]
[]
[]
[]
[]
[]
[]
[]
[]
[]
[]
[]
[]
[]
[]
[]
[]
[]
[]
[]
[]
[]
[]
[]
[]
[]
[]
[]
[]
[]
[]
[]
[]
[]
[]
[]
[]
[]
[]
[]
[]
[]
[]
[]
[]
[]
[]
[]
[]
[]
[]
[]
[]
[]
[]
[]
[]
[]
[]
[]
[]
[]
[]
[]
[]
[]
[]
[]
[]
[]
[]
[]
[]
[]
[]
[]
[]
[]
[]
[]
[]
[]
[]
[]
[]
[]
[]
[]
[]
[]
[]
[]
[]
[]
[]
[]
[]
[]
[]
[]
[]
[]
[]
[]
[]
[]
[]
[]
[]
[]
[]
[]
[]
[]
[]
[]
[]
[]
[]
[]
[]
[]
[]
[]
[]
[]
[]
[]
[]
[]
[]
[]
[]
[]
[]
[]
[]
[]
[]
[]
[]
[]
[]
[]
[]
[]
[]
[]
[]
[]
[]
[]
[]
[]
[]
[]
[]
[]
[]
[]
[]
[]
[]
[]
[]
[]
[]
[]
[]
[]
[]
[]
[]
[]
[]
[]
[]
[]
[]
[]
[]
[]
[]
[]
[]
[]
[]
[]
[]
[]
[]
[]
[]
[]
[]
[]
[]
[]
[]
[]
[]
[]
[]
[]
[]
[]
[]
[]
[]
[]
[]
[]
[]
[]
[]
[]
[]
[]
[]
[]
[]
[]
[]
[]
[]
[]
[]
[]
[]
[]
[]
[]
[]
[]
[]
[]
[]
[]
[]
[]
[]
[]
[]
[]
[]
[]
[]
[]
[]
[]
[]
[]
[]
[]
[]
[]
[]
[]
[]
[]
[]
[]
[]
[]
[]
[]
[]
[]
[]
[]
[]
[]
[]
[]
[]
[]
[]
[]
[]
[]
[]
[]
[]
[]
[]
[]
[]
[]
[]
[]
[]
[]
[]
[]
[]
[]
[]
[]
[]
[]
[]
[]
[]
[]
[]
[]
[]
[]
[]
[]
[]
[]
[]
[]
[]
[]
[]
[]
[]
[]
[]
[]
[]
[]
[]
[]
[]
[]
[]
[]
[]
[]
[]
[]
[]
[]
[]
[]
[]
[]
[]
[]
[]
[]
[]
[]
[]
[]
[]
[]
[]
[]
[]
[]
[]
[]
[]
[]
[]
[]
[]
[]
[]
[]
[]
[]
[]
[]
[]
[]
[]
[]
[]
[]
[]
[]
[]
[]
[]
[]
[]
[]
[]
[]
[]
[]
[]
[]
[]
[]
[]
[]
[]
[]
[]
[]
[]
[]
[]
[]
[]
[]
[]
[]
[]
[]
[]
[]
[]
[]
[]
[]
[]
[]
[]
[]
[]
[]
[]
[]
[]
[]
[]
[]
[]
[]
[]
[]
[]
[]
[]
[]
[]
[]
[]
[]
[]
[]
[]
[]
[]
[]
[]
[]
[]
[]
[]
[]
[]
[]
[]
[]
[]
[]
[]
[]
[]
[]
[]
[]
[]
[]
[]
[]
[]
[]
[]
[]
[]
[]
[]
[]
[]
[]
[]
[]
[]
[]
[]
[]
[]
[]
[]
[]
[]
[]
[]
[]
[]
[]
[]
[]
[]
[]
[]
[]
[]
[]
[]
[]
[]
[]
[]
[]
[]
[]
[]
[]
[]
[]
[]
[]
[]
[]
[]
[]
[]
[]
[]
[]
[]
[]
[]
[]
[]
[]
[]
[]
[]
[]
[]
[]
[]
[]
[]
[]
[]
[]
[]
[]
[]
[]
[]
[]
[]
[]
[]
[]
[]
[]
[]
[]
[]
[]
[]
[]
[]
[]
[]
[]
[]
[]
[]
[]
[]
[]
[]
[]
[]
[]
[]
[]
[]
[]
[]
[]
[]
[]
[]
[]
[]
[]
[]
[]
[]
[]
[]
[]
[]
[]
[]
[]
[]
[]
[]
[]
[]
[]
[]
[]
[]
[]
[]
[]
[]
[]
[]
[]
[]
[]
[]
[]
[]
[]
[]
[]
[]
[]
[]
[]
[]
[]
[]
[]
[]
[]
[]
[]
[]
[]
[]
[]
[]
[]
[]
[]
[]
[]
[]
[]
[]
[]
[]
[]
[]
[]
[]
[]
[]
[]
[]
[]
[]
[]
[]
[]
[]
[]
[]
[]
[]
[]
[]
[]
[]
[]
[]
[]
[]
[]
[]
[]
[]
[]
[]
[]
[]
[]
[]
[]
[]
[]
[]
[]
[]
[]
[]
[]
[]
[]
[]
[]
[]
[]
[]
[]
[]
[]
[]
[]
[]
[]
[]
[]
[]
[]
[]
[]
[]
[]
[]
[]
[]
[]
[]
[]
[]
[]
[]
[]
[]
[]
[]
[]
[]
[]
[]
[]
[]
[]
[]
[]
[]
[]
[]
[]
[]
[]
[]
[]
[]
[]
[]
[]
[]
[]
[]
[]
[]
[]
[]
[]
[]
[]
[]
[]
[]
[]
[]
[]
[]
[]
[]
[]
[]
[]
[]
[]
[]
[]
[]
[]
[]
[]
[]
[]
[]
[]
[]
[]
[]
[]
[]
[]
[]
[]
[]
[]
[]
[]
[]
[]
[]
[]
[]
[]
[]
[]
[]
[]
[]
[]
[]
[]
[]
[]
[]
[]
[]
[]
[]
[]
[]
[]
[]
[]
[]
[]
[]
[]
[]
[]
[]
[]
[]
[]
[]
[]
[]
[]
[]
[]
[]
[]
[]
[]
[]
[]
[]
[]
[]
[]
[]
[]
[]
[]
[]
[]
[]
[]
[]
[]
[]
[]
[]
[]
[]
[]
[]
[]
[]
[]
[]
[]
[]
[]
[]
[]
[]
[]
[]
[]
[]
[]
[]
[]
[]
[]
[]
[]
[]
[]
[]
[]
[]
[]
[]
[]
[]
[]
[]
[]
[]
[]
[]
[]
[]
[]
[]
[]
[]
[]
[]
[]
[]
[]
[]
[]
[]
[]
[]
[]
[]
[]
[]
[]
[]
[]
[]
[]
[]
[]
[]
[]
[]
[]
[]
[]
[]
[]
[]
[]
[]
[]
[]
[]
[]
[]
[]
[]
[]
[]
[]
[]
[]
[]
[]
[]
[]
[]
[]
[]
[]
[]
[]
[]
[]
[]
[]
[]
[]
[]
[]
[]
[]
[]
[]
[]
[]
[]
[]
[]
[]
[]
[]
[]
[]
[]
[]
[]
[]
[]
[]
[]
[]
[]
[]
[]
[]
[]
[]
[]
[]
[]
[]
[]
[]
[]
[]
[]
[]
[]
[]
[]
[]
[]
[]
[]
[]
[]
[]
[]
[]
[]
[]
[]
[]
[]
[]
[]
[]
[]
[]
[]
[]
[]
[]
[]
[]
[]
[]
[]
[]
[]
[]
[]
[]
[]
[]
[]
[]
[]
[]
[]
[]
[]
[]
[]
[]
[]
[]
[]
[]
[]
[]
[]
[]
[]
[]
[null,null,null,null,null,null,null,null,null,null,null,null,null,null,null,null,null,null,null,null,null,null,null,null,null,null,null,null,null,null,null,null,null,null,null,null,null,null,null,null,null,null,null,null,null,null,null,null,null,null,null,null,null,null,null,null,null,null,null,null,null,null,null,null,null,null,null,null,null,null,null,null,null,null,null,null,null,null,null,null,null,null,null,null,null,null,null,null,null,null,null,null,null,null,null,null,null,null,null,null,null,null,null,null,null,null,null,null,null,null,null,null,null,null,null,null,null,null,null,null,null,null,null,null,null,null,null,null,null,null,null,null,null,null,null,null,null,null,null,null,null,null,null,null,null,null,null,null,null,null,null,null,null,null,null,null,null,null,null,null,null,null,null,null,null,null,null,null,null,null,null,null,null,null,null,null,null,null,null,null,null,null,null,null,null,null,null,null,null,null,null,null,null,null,null,null,null,null,null,null,null,null,null,null,null,null,null,null,null,null,null,null,null,null,null,null,null,null,null,null,null,null,null,null,null,null,null,null,null,null,null,null,null,null,null,null,null,null,null,null,null,null,null,null,null,null,null,null,null,null,null,null,null,null,null,"QMS"]