{"text_format":"1","workbook":"xlsx","n_sheets":2,"sheets":["Traditional 401k vs Roth","Data"],"not_rendered":{"charts":3,"images":2,"macros":1,"external_links":0,"defined_names":3,"comments":0,"pivot_tables":0},"unopened":[],"bounds":{"document_bytes":16777216,"sheet_cells":100000,"rows_first":2000,"rows_last":500,"rows_between":2000,"halvings":0,"cell_chars":16384,"cell_head_chars":4096},"cells_cut":0,"cells_raw":0,"read":"whole","date_system":"1900"}

{"sheet":"Traditional 401k vs Roth","index":0,"n_rows":183,"n_cols":61,"rows_kept":183,"cut":false,"hidden":false,"merged":[[1,2,3,6],[30,7,30,13],[48,2,48,4],[48,5,48,7],[6,1,9,4],[27,9,27,10],[27,11,27,12],[27,7,27,8]]}
[]
[null,null,"This calculator assumes your only income is from your retirement accounts. Want to include other sources of income? Estimate taxes? Check our Etsy listing."]
[]
[]
[null,"Roth 401k vs Traditional 401k Calculator"]
[null,null,null,null,null,null,null,null,null,null,null,null,null,null,null,null,null,null,null,null,null,null,null,"Traditional 401k Calculation",null,null,null,{"$f":"E17","v":10000},"contribution",null,null,null,null,null,"Roth 401k Calculation (matching net 401k contribution)",null,null,null,{"$f":"E18","v":8800},"contribution",null,null,null,"Roth 401k Calculation (matching 401k contribution with effective tax rate)",null,null,null,null,{"$f":"H19","v":0},"contribution",null,null,null,null,"Roth 401k Calculation (matching gross 401k contribution)",null,null,null,{"$f":"H20","v":10000},"contribution"]
[null,"Instructions: Simply replace the numbers in the green cells below with your own and see which investment account is right for you: a Roth 401k or a Traditional 401k."]
[null,null,null,null,null,null,null,null,null,null,null,null,null,null,null,null,"Inflation Rate",null,null,null,null,null,null,"Age","Beg Balance","Contribution","Withdrawal","Interest Earned","401k Balance","After-tax income","Overages",null,null,"Inflation Rate","Age","Beg Balance","Contribution","Withdrawal","Interest Earned","Same out of pocket Roth Balance","Overages",null,null,"Inflation Rate","Age","Beg Balance","Contribution","Withdrawal","Interest Earned","Ending Balance","Overages",null,null,"Inflation Rate","Age","Beg Balance","Contribution","Withdrawal","Interest Earned","Ending Balance","Overages"]
[null,null,null,null,null,null,null,null,null,null,null,null,null,null,null,null,{"$f":"IF(X9>$E$31,(1+$E$54),1)","v":1},null,null,null,null,null,null,{"$f":"E12","v":35},0,{"$f":"IF(X9>=$E$31,0,$E$17)","v":10000},{"$f":"IF(X9>$E$31,-$E$33,0)","v":0},{"$f":"SUM(Y9:AA9)*$E$22","v":500},{"$f":"IF(SUM(Y9:AB9)<0,0,(SUM(Y9:AB9)))","v":10500},{"$f":"IF(AA9>$E$31,-$E$38,0)","v":0},{"$f":"IF(AB9<0,AB9,0)","v":0},null,null,{"$f":"IF(AI9>$E$31,(1+$E$54),1)","v":1},{"$f":"$E$12","v":35},0,{"$f":"IF(AI9>=$E$31,0,$E$18)","v":8800},{"$f":"IF(AI9>$E$31,-$E$35,0)","v":0},{"$f":"SUM(AJ9:AL9)*$E$22","v":440},{"$f":"IF(SUM(AJ9:AM9)<0,0,(SUM(AJ9:AM9)))","v":9240},{"$f":"IF(AM9<0,AM9,0)","v":0},null,null,{"$f":"IF(AS9>$E$31,(1+$E$54),1)","v":1},{"$f":"$E$12","v":35},{"$f":"$E$19","v":22300},{"$f":"IF(AS9>=$E$31,0,$H$19)","v":0},{"$f":"IF(AS9>$E$31,-$E$33,0)","v":0},{"$f":"SUM(AT9:AV9)*$E$22","v":1115},{"$f":"IF(SUM(AT9:AW9)<0,0,(SUM(AT9:AW9)))","v":23415},{"$f":"IF(AW9<0,AW9,0)","v":0},null,null,{"$f":"IF(BC9>$E$31,(1+$E$54),1)","v":1},{"$f":"$E$12","v":35},0,{"$f":"IF(BC9>=$E$31,0,$H$20)","v":10000},{"$f":"IF(BC9>$E$31,-$E$35,0)","v":0},{"$f":"SUM(BD9:BF9)*$E$22","v":500},{"$f":"IF(SUM(BD9:BG9)<0,0,(SUM(BD9:BG9)))","v":10500},{"$f":"IF(BG9<0,BG9,0)","v":0}]
[null,null,null,null,null,null,null,null,null,null,null,null,null,null,null,null,1,null,null,null,null,null,null,{"$f":"X9+1","v":36},{"$f":"AC9","v":10500},10000,{"$f":"IF(AC9=0,0, IF(AND(X10=$E$31,AC9<$E$33),-AC9,IF(X10=$E$31, -$E$33*Q10,IF(X10<$E$31,0,IF(-AA9*Q10>AC9,-AC9,AA9*Q10)))))","v":0},{"$f":"IF(AC9=0,0,SUM(Y10:AA10)*$E$22)","v":1025},{"$f":"IF(SUM(Y10:AB10)<0,0,(SUM(Y10:AB10)))","v":21525},{"$f":"IF($AC9=0,0,IF(AND(-AA10<$E$33,-AA10<$E$37),AA10,IF(AND(-AA10<$E$33,-AA10>$E$37),AA10*($Q10-$E$40),IF($X10=$E$31,-$E$35*($Q10),IF($X10<$E$31,0,IF(-$AA9*$Q10>$AC9,-$AC9*AD9/AA9,$AD9*$Q10))))))","v":0},{"$f":"IF($AC9=0,0,IF(AND(-AB10<$E$33,-$AA$13<$E$37),AB10,IF($X10=$E$31,-$E$35*($Q10-$E$40),IF($X10<$E$31,0,IF(-$AA9*$Q10>$AC9,-$AC9*AE9/AB9,$AD9*$Q10)))))","v":1025},null,null,1,{"$f":"AI9+1","v":36},{"$f":"AN9","v":9240},8800,{"$f":"IF(AN9=0,0,IF(AND(AI10=$E$31,AN9<$E$35),-AN9,IF(AI10=$E$31,-$E$35*AH10,IF(AI10<$E$31,0,IF(-AL9*AH10>AN9,-AN9,AL9*AH10)))))","v":0},{"$f":"IF(AN9=0,0,SUM(AJ10:AL10)*$E$22)","v":902},{"$f":"IF(SUM(AJ10:AM10)<0,0,(SUM(AJ10:AM10)))","v":18942},{"$f":"IF(AM10<0,AM10,0)","v":0},null,null,1,{"$f":"AS9+1","v":36},{"$f":"AX9","v":23415},0,{"$f":"IF(AX9=0,0,IF(AS10=$E$31,-#REF!*AR10,IF(AS10<$E$31,0,IF(-AV9*AR10>AX9,-AX9,AV9*AR10))))","v":0},{"$f":"IF(AX9=0,0,SUM(AT10:AV10)*$E$22)","v":1170.75},{"$f":"IF(SUM(AT10:AW10)<0,0,(SUM(AT10:AW10)))","v":24585.75},{"$f":"IF(AW10<0,AW10,0)","v":0},null,null,1,{"$f":"BC9+1","v":36},{"$f":"BH9","v":10500},10000,{"$f":"IF(BH9=0,0,IF(BC10=$E$31,-$E$35*BB10,IF(BC10<$E$31,0,IF(-BF9*BB10>BH9,-BH9,BF9*BB10))))","v":0},{"$f":"IF(BH9=0,0,SUM(BD10:BF10)*$E$22)","v":1025},{"$f":"IF(SUM(BD10:BG10)<0,0,(SUM(BD10:BG10)))","v":21525},{"$f":"IF(BG10<0,BG10,0)","v":0}]
[null,null,null,null,null,null,null,null,null,null,null,null,null,null,null,null,1,null,null,null,null,null,null,{"$f":"X10+1","v":37},{"$f":"AC10","v":21525},10000,0,1576.25,33101.25,0,{"$f":"IF(AB11<0,AB11,0)","v":0},null,null,1,{"$f":"AI10+1","v":37},{"$f":"AN10","v":18942},8800,0,1387.1000000000001,{"$f":"IF(SUM(AJ11:AM11)<0,0,(SUM(AJ11:AM11)))","v":29129.1},0,null,null,1,{"$f":"AS10+1","v":37},{"$f":"AX10","v":24585.75},0,{"$f":"IF(AX10=0,0,IF(AS11=$E$31,-#REF!*AR11,IF(AS11<$E$31,0,IF(-AV10*AR11>AX10,-AX10,AV10*AR11))))","v":0},1229.2875000000001,25815.037499999999,0,null,null,1,{"$f":"BC10+1","v":37},{"$f":"BH10","v":21525},10000,0,1576.25,33101.25,0]
[null,"Current age",null,null,35,null,null,null,null,"            Total distributions",null,null,null,null,null,null,1,null,null,null,null,null,null,38,33101.25,10000,0,2155.0625,45256.3125,0,0,null,null,1,{"$f":"AI11+1","v":38},29129.1,8800,0,1896.4549999999999,39825.555,0,null,null,1,{"$f":"AS11+1","v":38},25815.037499999999,0,{"$f":"IF(AX11=0,0,IF(AS12=$E$31,-#REF!*AR12,IF(AS12<$E$31,0,IF(-AV11*AR12>AX11,-AX11,AV11*AR12))))","v":0},1290.7518749999999,27105.789375,0,null,null,1,{"$f":"BC11+1","v":38},33101.25,10000,0,2155.0625,45256.3125,0]
[null,"Filing status",null,null,"Married",{"$f":"E16-E17","v":22300},null,null,null,"             (per the chart)",null,null,null,null,null,null,1,null,null,null,null,null,null,39,45256.3125,10000,0,2762.8156250000002,58019.128125000003,0,0,null,null,1,39,39825.555,8800,0,2431.2777500000002,51056.832750000001,0,null,null,1,39,27105.789375,0,{"$f":"IF(AX12=0,0,IF(AS13=$E$31,-#REF!*AR13,IF(AS13<$E$31,0,IF(-AV12*AR13>AX12,-AX12,AV12*AR13))))","v":0},1355.2894687500002,28461.078843750001,0,null,null,1,39,45256.3125,10000,0,2762.8156250000002,58019.128125000003,0]
[null,"Current annual income",null,null,60000,null,null,null,null,null,null,null,null,null,null,null,1,null,null,null,null,null,null,40,58019.128125000003,10000,{"$f":"IF(AC13=0,0, IF(AND(X14=$E$31,AC13<$E$33),-AC13,IF(X14=$E$31, -$E$33*Q14,IF(X14<$E$31,0,IF(-AA13*Q14>AC13,-AC13,AA13*Q14)))))","v":0},3400.9564062500003,71420.084531250002,0,0,null,null,1,40,51056.832750000001,8800,0,2992.8416375000002,62849.674387500003,0,null,null,1,40,28461.078843750001,0,{"$f":"IF(AX13=0,0,IF(AS14=$E$31,-#REF!*AR14,IF(AS14<$E$31,0,IF(-AV13*AR14>AX13,-AX13,AV13*AR14))))","v":0},1423.0539421875001,29884.132785937501,0,null,null,1,40,58019.128125000003,10000,0,3400.9564062500003,71420.084531250002,0]
[null,"Standard deduction (2023)",null,null,{"$f":"VLOOKUP($E$13,Data!$C$3:$D$6,2,FALSE)","v":27700},null,null,null,null,null,null,null,null,null,null,null,1,null,null,null,null,null,null,41,71420.084531250002,10000,0,4071.0042265625002,85491.088757812497,0,0,null,null,1,41,62849.674387500003,8800,0,3582.4837193750009,75232.158106875009,0,null,null,1,41,29884.132785937501,0,{"$f":"IF(AX14=0,0,IF(AS15=$E$31,-#REF!*AR15,IF(AS15<$E$31,0,IF(-AV14*AR15>AX14,-AX14,AV14*AR15))))","v":0},1494.2066392968752,31378.339425234375,0,null,null,1,41,71420.084531250002,10000,0,4071.0042265625002,85491.088757812497,0]
[null,"Income after standard deduction",null,null,{"$f":"E14-E15","v":32300},null,null,null,null,null,null,null,null,null,null,null,1,null,null,null,null,null,null,42,85491.088757812497,10000,0,4774.5544378906252,100265.64319570312,0,0,null,null,1,42,75232.158106875009,8800,0,4201.6079053437506,88233.766012218766,0,null,null,1,42,31378.339425234375,0,{"$f":"IF(AX15=0,0,IF(AS16=$E$31,-#REF!*AR16,IF(AS16<$E$31,0,IF(-AV15*AR16>AX15,-AX15,AV15*AR16))))","v":0},1568.9169712617188,32947.256396496094,0,null,null,1,42,85491.088757812497,10000,0,4774.5544378906252,100265.64319570312,0]
[null,"Annual contributions (pre tax)",null,null,10000,null,null,null,null,null,null,null,null,null,null,null,1,null,null,null,null,null,null,43,100265.64319570312,10000,0,5513.2821597851562,115778.92535548827,0,0,null,null,1,43,88233.766012218766,8800,0,4851.6883006109383,101885.45431282971,0,null,null,1,43,32947.256396496094,0,{"$f":"IF(AX16=0,0,IF(AS17=$E$31,-#REF!*AR17,IF(AS17<$E$31,0,IF(-AV16*AR17>AX16,-AX16,AV16*AR17))))","v":0},1647.3628198248048,34594.619216320898,0,null,null,1,43,100265.64319570312,10000,0,5513.2821597851562,115778.92535548827,0]
[null,"(Equivalent Roth Contribution)",null,null,{"$f":"E17-E25","v":8800},null,null,null,null,null,null,null,null,null,null,null,1,null,null,null,null,null,null,44,115778.92535548827,10000,0,6288.9462677744141,132067.87162326268,0,0,null,null,1,44,101885.45431282971,8800,0,5534.2727156414858,116219.7270284712,0,null,null,1,44,34594.619216320898,0,{"$f":"IF(AX17=0,0,IF(AS18=$E$31,-#REF!*AR18,IF(AS18<$E$31,0,IF(-AV17*AR18>AX17,-AX17,AV17*AR18))))","v":0},1729.7309608160449,36324.350177136941,0,null,null,1,44,115778.92535548827,10000,0,6288.9462677744141,132067.87162326268,0]
[null,"Income after SD and contribution",null,null,{"$f":"F13","v":22300},null,null,null,null,null,null,null,null,null,null,null,1,null,null,null,null,null,null,45,132067.87162326268,10000,0,7103.3935811631345,149171.26520442581,0,0,null,null,1,45,116219.7270284712,8800,0,6250.9863514235603,131270.71337989476,0,null,null,1,45,36324.350177136941,0,{"$f":"IF(AX18=0,0,IF(AS19=$E$31,-#REF!*AR19,IF(AS19<$E$31,0,IF(-AV18*AR19>AX18,-AX18,AV18*AR19))))","v":0},1816.2175088568472,38140.567685993788,0,null,null,1,45,132067.87162326268,10000,0,7103.3935811631345,149171.26520442581,0]
[null,null,null,null,null,null,"Match 401k gross contribution",{"$f":"E17","v":10000},null,null,null,null,null,null,null,null,1,null,null,null,null,null,null,46,149171.26520442581,10000,0,7958.5632602212909,167129.82846464711,0,0,null,null,1,46,131270.71337989476,8800,0,7003.5356689947384,147074.2490488895,0,null,null,1,46,38140.567685993788,0,{"$f":"IF(AX19=0,0,IF(AS20=$E$31,-#REF!*AR20,IF(AS20<$E$31,0,IF(-AV19*AR20>AX19,-AX19,AV19*AR20))))","v":0},1907.0283842996896,40047.596070293475,0,null,null,1,46,149171.26520442581,10000,0,7958.5632602212909,167129.82846464711,0]
[null,"Annual investment growth",null,null,0.08,null,null,null,null,null,null,null,null,null,null,null,1,null,null,null,null,null,null,47,167129.82846464711,10000,0,8856.4914232323554,185986.31988787948,0,0,null,null,1,47,147074.2490488895,8800,0,7793.7124524444753,163667.96150133398,0,null,null,1,47,40047.596070293475,0,{"$f":"IF(AX20=0,0,IF(AS21=$E$31,-#REF!*AR21,IF(AS21<$E$31,0,IF(-AV20*AR21>AX20,-AX20,AV20*AR21))))","v":0},2002.3798035146738,42049.975873808151,0,null,null,1,47,167129.82846464711,10000,0,8856.4914232323554,185986.31988787948,0]
[null,"Annual growth less inflation",null,null,{"$f":"E21-3%","v":0.05},null,null,null,null,null,null,null,null,null,null,null,1,null,null,null,null,null,null,48,185986.31988787948,10000,0,9799.3159943939736,{"$f":"IF(SUM(Y22:AB22)<0,0,(SUM(Y22:AB22)))","v":205785.63588227346},0,0,null,null,1,48,163667.96150133398,8800,0,8623.3980750666997,181091.35957640069,0,null,null,1,48,42049.975873808151,0,{"$f":"IF(AX21=0,0,IF(AS22=$E$31,-#REF!*AR22,IF(AS22<$E$31,0,IF(-AV21*AR22>AX21,-AX21,AV21*AR22))))","v":0},2102.4987936904076,44152.474667498558,0,null,null,1,48,185986.31988787948,10000,0,9799.3159943939736,205785.63588227346,0]
[null,"Taxes owed with Roth Investment",null,null,{"$f":"F121","v":3465},null,null,null,null,null,null,null,null,null,null,null,1,null,null,null,null,null,null,49,205785.63588227346,10000,0,10789.281794113675,226574.91767638712,0,0,null,null,1,49,181091.35957640069,8800,0,9494.5679788200341,199385.92755522073,0,null,null,1,49,44152.474667498558,0,{"$f":"IF(AX22=0,0,IF(AS23=$E$31,-#REF!*AR23,IF(AS23<$E$31,0,IF(-AV22*AR23>AX22,-AX22,AV22*AR23))))","v":0},2207.6237333749282,46360.098400873489,0,null,null,1,49,205785.63588227346,10000,0,10789.281794113675,226574.91767638712,0]
[null,"Taxes owed post investment",null,null,{"$f":"H121","v":2265},null,null,null,null,null,null,null,null,null,null,null,1,null,null,null,null,null,null,{"$f":"X23+1","v":50},{"$f":"AC23","v":226574.91767638712},10000,0,11828.745883819356,248403.66356020648,0,0,null,null,1,{"$f":"AI23+1","v":50},{"$f":"AN23","v":199385.92755522073},8800,0,10409.296377761037,218595.22393298175,0,null,null,1,{"$f":"AS23+1","v":50},{"$f":"AX23","v":46360.098400873489},0,{"$f":"IF(AX23=0,0,IF(AS24=$E$31,-#REF!*AR24,IF(AS24<$E$31,0,IF(-AV23*AR24>AX23,-AX23,AV23*AR24))))","v":0},2318.0049200436747,48678.103320917166,0,null,null,1,{"$f":"BC23+1","v":50},{"$f":"BH23","v":226574.91767638712},10000,0,11828.745883819356,248403.66356020648,0]
[null,"Annual tax savings with contribution",null,null,{"$f":"E23-E24","v":1200},null,null,null,null,null,null,null,null,null,null,null,1,null,null,null,null,null,null,51,248403.66356020648,10000,0,12920.183178010324,271323.84673821682,0,0,null,null,1,51,218595.22393298175,8800,0,11369.761196649088,238764.98512963083,0,null,null,1,51,48678.103320917166,0,{"$f":"IF(AX24=0,0,IF(AS25=$E$31,-#REF!*AR25,IF(AS25<$E$31,0,IF(-AV24*AR25>AX24,-AX24,AV24*AR25))))","v":0},2433.9051660458586,51112.008486963023,0,null,null,1,51,248403.66356020648,10000,0,12920.183178010324,271323.84673821682,0]
[null,null,null,null,null,null,null,null,null,null,null,null,null,null,null,null,1,null,null,null,null,null,null,52,271323.84673821682,10000,0,14066.192336910841,295390.03907512769,0,0,null,null,1,52,238764.98512963083,8800,0,12378.249256481542,259943.23438611237,0,null,null,1,52,51112.008486963023,0,{"$f":"IF(AX25=0,0,IF(AS26=$E$31,-#REF!*AR26,IF(AS26<$E$31,0,IF(-AV25*AR26>AX25,-AX25,AV25*AR26))))","v":0},2555.6004243481511,53667.608911311174,0,null,null,1,52,271323.84673821682,10000,0,14066.192336910841,295390.03907512769,0]
[null,"Tax rate of the savings",null,null,{"$f":"E25/E17","v":0.12},null,null,null,null,null,null,null,null,null,null,null,1,null,null,null,null,null,null,53,295390.03907512769,10000,0,15269.501953756386,320659.54102888406,0,0,null,null,1,53,259943.23438611237,8800,0,13437.161719305619,282180.39610541798,0,null,null,1,53,53667.608911311174,0,{"$f":"IF(AX26=0,0,IF(AS27=$E$31,-#REF!*AR27,IF(AS27<$E$31,0,IF(-AV26*AR27>AX26,-AX26,AV26*AR27))))","v":0},2683.3804455655591,56350.989356876729,0,null,null,1,53,295390.03907512769,10000,0,15269.501953756386,320659.54102888406,0]
[null,null,null,null,null,null,null,null,null,null,null,null,null,null,null,null,1,null,null,null,null,null,null,54,320659.54102888406,10000,0,16532.977051444203,347192.51808032824,0,0,null,null,1,54,282180.39610541798,8800,0,14549.0198052709,305529.41591068887,0,null,null,1,54,56350.989356876729,0,{"$f":"IF(AX27=0,0,IF(AS28=$E$31,-#REF!*AR28,IF(AS28<$E$31,0,IF(-AV27*AR28>AX27,-AX27,AV27*AR28))))","v":0},2817.5494678438367,59168.538824720563,0,null,null,1,54,320659.54102888406,10000,0,16532.977051444203,347192.51808032824,0]
[null,null,null,null,null,null,null,null,null,null,null,null,null,null,null,null,1,null,null,null,null,null,null,55,347192.51808032824,10000,0,17859.625904016411,375052.14398434467,0,0,null,null,1,55,305529.41591068887,8800,0,15716.470795534444,330045.8867062233,0,null,null,1,55,59168.538824720563,0,{"$f":"IF(AX28=0,0,IF(AS29=$E$31,-#REF!*AR29,IF(AS29<$E$31,0,IF(-AV28*AR29>AX28,-AX28,AV28*AR29))))","v":0},2958.4269412360281,62126.965765956593,0,null,null,1,55,347192.51808032824,10000,0,17859.625904016411,375052.14398434467,0]
[null,null,null,null,null,null,null,null,null,null,null,null,null,null,null,null,1,null,null,null,null,null,null,56,375052.14398434467,10000,0,19252.607199217233,404304.75118356192,0,0,null,null,1,56,330045.8867062233,8800,0,16942.294335311166,355788.18104153447,0,null,null,1,56,62126.965765956593,0,{"$f":"IF(AX29=0,0,IF(AS30=$E$31,-#REF!*AR30,IF(AS30<$E$31,0,IF(-AV29*AR30>AX29,-AX29,AV29*AR30))))","v":0},3106.3482882978296,65233.314054254421,0,null,null,1,56,375052.14398434467,10000,0,19252.607199217233,404304.75118356192,0]
[null,"Retirement age",null,null,70,null,null,"2023 Income Tax Brackets: Taxes Owed with 401k Contribution vs. with Roth Contribution",null,null,null,null,null,null,null,null,1,null,null,null,null,null,null,57,404304.75118356192,10000,0,20715.237559178098,435019.98874274001,0,0,null,null,1,57,355788.18104153447,8800,0,18229.409052076724,382817.59009361122,0,null,null,1,57,65233.314054254421,0,{"$f":"IF(AX30=0,0,IF(AS31=$E$31,-#REF!*AR31,IF(AS31<$E$31,0,IF(-AV30*AR31>AX30,-AX30,AV30*AR31))))","v":0},3261.6657027127212,68494.979756967135,0,null,null,1,57,404304.75118356192,10000,0,20715.237559178098,435019.98874274001,0]
[null,"Filing status",null,null,"Married",null,null,"Tax rate","From","To","Full salary (Roth)","Taxes owed","Salary less contribution (401k)","Taxes owed",null,null,1,null,null,null,null,null,null,58,435019.98874274001,10000,0,22250.999437137001,467270.98817987699,0,0,null,null,1,58,382817.59009361122,8800,0,19580.879504680561,411198.46959829179,0,null,null,1,58,68494.979756967135,0,{"$f":"IF(AX31=0,0,IF(AS32=$E$31,-#REF!*AR32,IF(AS32<$E$31,0,IF(-AV31*AR32>AX31,-AX31,AV31*AR32))))","v":0},3424.748987848357,71919.728744815497,0,null,null,1,58,435019.98874274001,10000,0,22250.999437137001,467270.98817987699,0]
[null,"Yearly withdrawal (today's dollars)",null,null,60000,null,null,{"$f":"IF($E$13=\"Single\",B71,IF($E$13=\"Married\",B84,IF($E$13=\"Married filing separately\",B97,B110)))","v":0.1},0,20550,20550,2055,20550,2055,null,null,1,null,null,null,null,null,null,59,467270.98817987699,10000,0,23863.549408993851,501134.53758887085,0,0,null,null,1,59,411198.46959829179,8800,0,20999.923479914592,440998.3930782064,0,null,null,1,59,71919.728744815497,0,{"$f":"IF(AX32=0,0,IF(AS33=$E$31,-#REF!*AR33,IF(AS33<$E$31,0,IF(-AV32*AR33>AX32,-AX32,AV32*AR33))))","v":0},3595.9864372407751,75515.715182056272,0,null,null,1,59,467270.98817987699,10000,0,23863.549408993851,501134.53758887085,0]
[null,"Taxes owed",null,null,{"$f":"IF(F183<0,0,F183)","v":3465},null,null,0.12,20551,83550,11750,1410,1750,210,null,null,1,null,null,null,null,null,null,60,501134.53758887085,10000,0,25556.726879443544,536691.26446831436,0,0,null,null,1,60,440998.3930782064,8800,0,22489.919653910321,472288.31273211673,0,null,null,1,60,75515.715182056272,0,{"$f":"IF(AX33=0,0,IF(AS34=$E$31,-#REF!*AR34,IF(AS34<$E$31,0,IF(-AV33*AR34>AX33,-AX33,AV33*AR34))))","v":0},3775.7857591028137,79291.500941159087,0,null,null,1,60,501134.53758887085,10000,0,25556.726879443544,536691.26446831436,0]
[null,"Net distributions after taxes",null,null,{"$f":"E33-E34","v":56535},null,null,0.22,83551,178150,0,0,0,0,null,null,1,null,null,null,null,null,null,61,536691.26446831436,10000,0,27334.56322341572,574025.82769173011,0,0,null,null,1,61,472288.31273211673,8800,0,24054.415636605838,505142.72836872254,0,null,null,1,61,79291.500941159087,0,{"$f":"IF(AX34=0,0,IF(AS35=$E$31,-#REF!*AR35,IF(AS35<$E$31,0,IF(-AV34*AR35>AX34,-AX34,AV34*AR35))))","v":0},3964.5750470579546,83256.075988217039,0,null,null,1,61,536691.26446831436,10000,0,27334.56322341572,574025.82769173011,0]
[null,null,null,null,null,null,null,0.24,178151,340100,0,0,0,0,null,null,1,null,null,null,null,null,null,62,574025.82769173011,10000,0,29201.291384586508,613227.11907631659,0,0,null,null,1,62,505142.72836872254,8800,0,25697.13641843613,539639.86478715867,0,null,null,1,62,83256.075988217039,0,{"$f":"IF(AX35=0,0,IF(AS36=$E$31,-#REF!*AR36,IF(AS36<$E$31,0,IF(-AV35*AR36>AX35,-AX35,AV35*AR36))))","v":0},4162.8037994108518,87418.879787627884,0,null,null,1,62,574025.82769173011,10000,0,29201.291384586508,613227.11907631659,0]
[null,"Standard deduction (2023)",null,null,{"$f":"VLOOKUP($E$32,Data!C3:D6,2,FALSE)","v":27700},null,null,0.32,340101,431900,0,0,0,0,null,null,1,null,null,null,null,null,null,63,613227.11907631659,10000,0,31161.35595381583,654388.47503013245,0,0,null,null,1,63,539639.86478715867,8800,0,27421.993239357937,575861.85802651662,0,null,null,1,63,87418.879787627884,0,{"$f":"IF(AX36=0,0,IF(AS37=$E$31,-#REF!*AR37,IF(AS37<$E$31,0,IF(-AV36*AR37>AX36,-AX36,AV36*AR37))))","v":0},4370.9439893813942,91789.823777009282,0,null,null,1,63,613227.11907631659,10000,0,31161.35595381583,654388.47503013245,0]
[null,"Income after standard deduction",null,null,{"$f":"E33-E37","v":32300},null,null,0.35,431901,647850,0,0,0,0,null,null,1,null,null,null,null,null,null,64,654388.47503013245,10000,0,33219.423751506627,697607.89878163906,0,0,null,null,1,64,575861.85802651662,8800,0,29233.092901325832,613894.95092784241,0,null,null,1,64,91789.823777009282,0,{"$f":"IF(AX37=0,0,IF(AS38=$E$31,-#REF!*AR38,IF(AS38<$E$31,0,IF(-AV37*AR38>AX37,-AX37,AV37*AR38))))","v":0},4589.4911888504639,96379.314965859739,0,null,null,1,64,654388.47503013245,10000,0,33219.423751506627,697607.89878163906,0]
[null,null,null,null,null,null,null,0.37,647851,0,0,0,0,0,null,null,1,null,null,null,null,null,null,65,697607.89878163906,10000,0,35380.394939081954,742988.29372072103,0,0,null,null,1,65,613894.95092784241,8800,0,31134.747546392122,653829.69847423455,0,null,null,1,65,96379.314965859739,0,{"$f":"IF(AX38=0,0,IF(AS39=$E$31,-#REF!*AR39,IF(AS39<$E$31,0,IF(-AV38*AR39>AX38,-AX38,AV38*AR39))))","v":0},4818.965748292987,101198.28071415273,0,null,null,1,65,697607.89878163906,10000,0,35380.394939081954,742988.29372072103,0]
[null,"Effective tax rate on the gross",null,null,{"$f":"IF(E34<0,0,E34/E33)","v":5.7750000000000003E-2},null,null,null,null,null,"Roth taxes owed:",{"$f":"SUM(L33:L39)","v":3465},"401k taxes owed:",{"$f":"SUM(N33:N39)","v":2265},null,null,1,null,null,null,null,null,null,66,742988.29372072103,10000,0,37649.414686036056,790637.7084067571,0,0,null,null,1,66,653829.69847423455,8800,0,33131.484923711731,695761.1833979463,0,null,null,1,66,101198.28071415273,0,{"$f":"IF(AX39=0,0,IF(AS40=$E$31,-#REF!*AR40,IF(AS40<$E$31,0,IF(-AV39*AR40>AX39,-AX39,AV39*AR40))))","v":0},5059.9140357076367,106258.19474986037,0,null,null,1,66,742988.29372072103,10000,0,37649.414686036056,790637.7084067571,0]
{"$rows_left_out":144}
{"sheet":"Data","index":1,"n_rows":6,"n_cols":4,"rows_kept":6,"cut":false,"hidden":true,"merged":[]}
[]
[]
[null,null,"Single",13850]
[null,null,"Married",27700]
[null,null,"Married filing separately",13850]
[null,null,"Head of household",20800]