{"text_format":"1","workbook":"xlsx","n_sheets":5,"sheets":["Data","Dashboard","Debt Snowball Calculator","Debt Payoff Chart","Charts"],"not_rendered":{"charts":5,"images":7,"macros":1,"external_links":0,"defined_names":8,"comments":0,"pivot_tables":0},"unopened":[],"bounds":{"document_bytes":16777216,"sheet_cells":100000,"rows_first":2000,"rows_last":500,"rows_between":2000,"halvings":0,"cell_chars":16384,"cell_head_chars":4096},"cells_cut":0,"cells_raw":0,"read":"whole","date_system":"1900"}

{"sheet":"Data","index":0,"n_rows":22,"n_cols":9,"rows_kept":22,"cut":false,"hidden":false,"merged":[[21,3,22,7]]}
[]
[]
[]
[]
[]
[]
[]
[]
[]
[]
[]
[null,null,null,"#","Debt name","Amount","Min Payment","Annual Interest"]
[null,null,null,{"$f":"IF(E13<>\"\", 1, \"\")","v":1},"Debt 1",1500,30,0.17,{"$f":"IF(AND(E13<>\"\", OR(F13=\"\", G13=\"\", H13=\"\")), \"Don't forget to add \"& IF(F13<>\"\",\"\",\"Amount\") & IF(G13<>\"\", \"\", IF(AND(F13=\"\", H13=\"\"), \", \", IF(F13=\"\", \" and \", \"\")) & \"Minimum Payment\") & IF(H13<>\"\", \"\", IF(OR(F13=\"\", G13=\"\"), \" and \", \" \") & \"Annual Interest\"), \"\")","v":""}]
[null,null,null,{"$f":"IFERROR(IF(E13<>\"\", D13+1, \"\"), \"\")","v":2},"Debt 2",2843,75,0.19,{"$f":"IF(AND(E14<>\"\", OR(F14=\"\", G14=\"\", H14=\"\")), \"Don't forget to add \"& IF(F14<>\"\",\"\",\"Amount\") & IF(G14<>\"\", \"\", IF(AND(F14=\"\", H14=\"\"), \", \", IF(F14=\"\", \" and \", \"\")) & \"Minimum Payment\") & IF(H14<>\"\", \"\", IF(OR(F14=\"\", G14=\"\"), \" and \", \" \") & \"Annual Interest\"), \"\")","v":""}]
[null,null,null,{"$f":"IFERROR(IF(E14<>\"\", D14+1, \"\"), \"\")","v":3},"Debt 3",6280,125,0.18,""]
[null,null,null,4,"Debt 4",7214,100,0.06,""]
[null,null,null,5,"Debt 5",8932,120,0.06,""]
[null,null,null,6,"Debt 6",10500,140,0.08,""]
[null,null,null,7,"Debt 7",12068,160,0.09,""]
[null,null,null,8,"Debt 8",13636,180,0.1,""]
{"$rows_left_out":3}
{"sheet":"Dashboard","index":1,"n_rows":4,"n_cols":16,"rows_kept":4,"cut":false,"hidden":false,"merged":[]}
[]
[null,null,null,null,"Extra monthly payments:",0,null,null,null,null,null,null,null,null,null,"LifeandMyFinances.com"]
[]
[null,null,null,null,"One-time immediate pmnt:",0]

{"sheet":"Debt Snowball Calculator","index":2,"n_rows":138,"n_cols":55,"rows_kept":138,"cut":false,"hidden":false,"merged":[]}
[]
[]
[null,null,null,null,null,null,null,null,null,null,null,null,null,null,null,null,null,null,null,null,"Provided by: LifeAndMyFinances.com"]
[]
[null,null,"        (For up to 8 debts)"]
[null,null,null,null,null,null,null,null,"Extra Monthly Payment ",{"$f":"Dashboard!F2","v":0}]
[null,null,"Copyright 2022",null,null,null,null,null,"One-Time Start-up Payment ",{"$f":"Dashboard!F4","v":0}]
[]
[]
[null,null,"Smallest Debts",null,null,null,null,null,null,null,null,null,null,null,null,null,null,null,null,null,null,null,null,null,"Largest Debts"]
[]
[null,null,{"$f":"Data!E13","v":"Debt 1"},null,null,{"$f":"Data!E14","v":"Debt 2"},null,null,{"$f":"Data!E15","v":"Debt 3"},null,null,{"$f":"Data!E16","v":"Debt 4"},null,null,{"$f":"Data!E17","v":"Debt 5"},null,null,{"$f":"Data!E18","v":"Debt 6"},null,null,{"$f":"Data!E19","v":"Debt 7"},null,null,{"$f":"Data!E20","v":"Debt 8"},null,null,{"$f":"Data!E21","v":0},null,null,null,"Total Debt"]
[null,null,"Balance",{"$f":"Data!F13","v":1500},null,"Balance",{"$f":"Data!F14","v":2843},null,"Balance",{"$f":"Data!$F$15","v":6280},null,"Balance",{"$f":"Data!$F$16","v":7214},null,"Balance",{"$f":"Data!$F$17","v":8932},null,"Balance",{"$f":"Data!$F$18","v":10500},null,"Balance",{"$f":"Data!$F$19","v":12068},null,"Balance",{"$f":"Data!$F$20","v":13636},null,"Balance",{"$f":"Data!$F$21","v":0},null,null,{"$f":"SUM(D13:AC13)","v":62973}]
[null,null,"Minimum Payment",{"$f":"Data!G13","v":30},null,"Minimum Payment",{"$f":"Data!G14","v":75},null,"Minimum Payment",{"$f":"Data!$G$15","v":125},null,"Minimum Payment",{"$f":"Data!$G$16","v":100},null,"Minimum Payment",{"$f":"Data!$G$17","v":120},null,"Minimum Payment",{"$f":"Data!$G$18","v":140},null,"Minimum Payment",{"$f":"Data!$G$19","v":160},null,"Minimum Payment",{"$f":"Data!$G$20","v":180},null,"Minimum Payment",{"$f":"Data!$G$21","v":0},null,null,{"$f":"SUM(D14:AC14)","v":930}]
[null,null,"Interest Rate",{"$f":"Data!H13","v":0.17},null,"Interest Rate",{"$f":"Data!H14","v":0.19},null,"Interest Rate",{"$f":"Data!$H$15","v":0.18},null,"Interest Rate",{"$f":"Data!$H$16","v":0.06},null,"Interest Rate",{"$f":"Data!$H$17","v":0.06},null,"Interest Rate",{"$f":"Data!$H$18","v":0.08},null,"Interest Rate",{"$f":"Data!$H$19","v":0.09},null,"Interest Rate",{"$f":"Data!$H$20","v":0.1},null,"Interest Rate",{"$f":"Data!$H$21","v":0}]
[]
[]
[null,"Month","Payment","Balance",null,"Payment","Balance","Min Pmnt Available","Payment","Balance","Min Pmnt Available","Payment","Balance","Min Pmnt Available","Payment","Balance","Min Pmnt Available","Payment","Balance","Min Pmnt Available","Payment","Balance","Min Pmnt Available","Payment","Balance","Min Pmnt Available","Payment","Balance","Min Pmnt Available",null,"Total Payments",null,"Debt 1","Month Paid Off",null,"Debt 2","Month Paid Off",null,"Debt 3","Month Paid Off",null,"Debt 4","Month Paid Off",null,"Debt 5","Month Paid Off",null,"Debt 6","Month Paid Off",null,"Debt 7","Month Paid Off",null,"Debt 8","Month Paid Off"]
[null,1,{"$f":"IF((J7+J6+D14)>=D13,D13,(J6+J7+D14))","v":30},{"$f":"IF(D13-C19<=0,0,(D13-C19))","v":1470},null,{"$f":"IF((J6+J7+D14+G14)>=(D13+G13),G13,IF(AND(C19=D13,C19<>0),(J6+J7+D14-D13+G14),G14))","v":75},{"$f":"IF(G13-F19<=0,0,(G13-F19))","v":2768},0,{"$f":"IF((J6+J7+D14+G14+J14)>=(G13+J13+D13),J13,IF(AND(F19=G13, F19<>0),(J6+J7-G13-D13+D14+G14+J14),J14))","v":125},{"$f":"IF(J13-I19<=0,0,(J13-I19))","v":6155},0,{"$f":"IF((J6+J7+D14+G14+J14+M14)>=(J13+M13+G13+D13),M13,IF(AND(I19=J13, I19<>0),(J6+J7-J13-G13-D13+D14+G14+J14+M14),M14))","v":100},{"$f":"IF(M13-L19<=0,0,(M13-L19))","v":7114},0,{"$f":"IF((J6+J7+D14+G14+J14+M14+P14)>=(M13+P13+J13+G13+D13),P13,IF(AND(L19=M13,L19<>0),(J6+J7-M13-J13-G13-D13+D14+G14+J14+M14+P14),P14))","v":120},{"$f":"IF(P13-O19<=0,0,(P13-O19))","v":8812},0,{"$f":"IF((J6+J7+D14+G14+J14+M14+P14+S14)>=(P13+S13+M13+J13+G13+D13),S13,IF(AND(O19=P13,O19<>0),(J6+J7-P13-M13-J13-G13-D13+D14+G14+J14+M14+P14+S14),S14))","v":140},{"$f":"IF(S13-R19<=0,0,(S13-R19))","v":10360},0,{"$f":"IF(($J$6+$J$7+D14+G14+J14+M14+P14+S14+V14)>=(S13+V13+P13+M13+J13+G13+D13),V13,IF(AND(R19=S$13,R19<>0),($J$6+$J$7-S13-P13-M13-J13-G13-D13+D14+G14+J14+M14+P14+S14+V14),V14))","v":160},{"$f":"IF(V13-U19<=0,0,(V13-U19))","v":11908},0,{"$f":"IF(($J$6+$J$7+D14+G14+J14+M14+P14+S14+V14+Y14)>=(V13+Y13+S13+P13+M13+J13+G13+D13),Y13,IF(AND(U19=V$13,U19<>0),($J$6+$J$7-V13-S13-P13-M13-J13-G13-D13+SUM(D14,G14,J14,M14,P14,S14,V14+Y14)),Y14))","v":180},{"$f":"IF(Y13-X19<=0,0,(Y13-X19))","v":13456},0,{"$f":"IF(($J$6+$J$7+D14+G14+J14+M14+P14+S14+V14+Y14+AB14)>=(Y13+AB13+V13+S13+P13+M13+J13+G13+D13),AB13,IF(AND(X19=Y$13,X19<>0),($J$6+$J$7-Y13-V13-S13-P13-M13-J13-G13-D13+D14+G14+J14+M14+P14+S14+V14+Y14+AB14),AB14))","v":0},{"$f":"IF(AB13-AA19<=0,0,(AB13-AA19))","v":0},0,null,{"$f":"SUM(C19,F19,I19,L19,O19,R19,U19,X19,AA19)","v":930},null,{"$f":"D19","v":1470},1,null,{"$f":"G19","v":2768},1,null,{"$f":"J19","v":6155},1,null,{"$f":"M19","v":7114},1,null,{"$f":"P19","v":8812},1,null,{"$f":"S19","v":10360},1,null,{"$f":"V19","v":11908},1,null,{"$f":"Y19","v":13456},1]
[null,2,{"$f":"IF((D19-$J$6-$D$14-SUM(H20,K20,N20,Q20,T20,W20,Z20,AC20))<=0,($J$6+(D19-$J$6)),($J$6+$D$14+SUM(H20,K20,N20,Q20,T20,W20,Z20,AC20)))","v":30},{"$f":"IF((D19-C20)<=0.0001,0,(D19-C20)*(1+(D$15/12)))","v":1460.4},null,{"$f":"IF(AND(((G19-$J$6+C20-G$14-D$14-SUM(K20,N20,Q20,T20,W20,Z20,AC20))<=0),D20=0),G19,IF(D20=0,$J$6-C20+G$14+D$14+SUM(K20,N20,Q20,T20,W20,Z20,AC20),G$14))","v":75},{"$f":"IF((G19-F20)<=0.0001,0,(G19-F20)*(1+(G$15/12)))","v":2735.6391666666668},{"$f":"IF(G19=0,G$14,0)","v":0},{"$f":"IF(AND(((J19-$J$6+F20+C20-J$14-G$14-D$14-SUM(N20,Q20,T20,W20,Z20,AC20))<=0),G20+D20=0),J19,IF(J$14>=J19,J19,IF(AND(G20=0,D20=0),$J$6-F20-C20+J$14+G$14+D$14+SUM(N20,Q20,T20,W20,Z20,AC20),J$14)))","v":125},{"$f":"IF((J19-I20)<=0.0001,0,(J19-I20)*(1+(J$15/12)))","v":6120.45},{"$f":"IF(J19=0,J$14,0)","v":0},{"$f":"IF(AND(((M19-$J$6+I20+F20+C20-M$14-J$14-G$14-D$14-SUM(Q20,T20,W20,Z20,AC20))<=0),J20+G20+D20=0),M19,IF(M$14>=M19,M19, IF(AND(J20=0,G20=0,D20=0),$J$6-I20-F20-C20+M$14+J$14+G$14+D$14+SUM(Q20,T20,W20,Z20,AC20),M$14)))","v":100},{"$f":"IF((M19-L20)<=0.0001,0,(M19-L20)*(1+(M$15/12)))","v":7049.0699999999988},{"$f":"IF(M19=0,M$14,0)","v":0},{"$f":"IF(AND(((P19-$J$6+L20+I20+F20+C20-P$14-M$14-J$14-G$14-D$14-SUM(T20,W20,Z20,AC20))<=0),M20+J20+G20+D20=0),P19,IF(P$14>=P19,P19,IF(AND(M20=0,J20=0,G20=0,D20=0),$J$6-L20-I20-F20-C20+P$14+M$14+J$14+G$14+D$14+SUM(T20,W20,Z20,AC20),P$14)))","v":120},{"$f":"IF((P19-O20)<=0.0001,0,(P19-O20)*(1+(P$15/12)))","v":8735.4599999999991},{"$f":"IF(P19=0,P$14,0)","v":0},{"$f":"IF(AND(((S19-$J$6+O20+L20+I20+F20+C20-S$14-P$14-M$14-J$14-G$14-D$14-SUM(W20,Z20,AC20))<=0),P20+M20+J20+G20+D20=0),S19,IF(S$14>=S19,S19,IF(AND(P20=0,M20=0,J20=0,G20=0),$J$6-O20-L20-I20-F20-C20+S$14+P$14+M$14+J$14+G$14+D$14+SUM(W20,Z20,AC20),S$14)))","v":140},{"$f":"IF((S19-R20)<=0.0001,0,(S19-R20)*(1+(S$15/12)))","v":10288.133333333333},{"$f":"IF(S19=0,S$14,0)","v":0},{"$f":"IF(AND(((V19-$J$6+R20+O20+L20+I20+F20+C20-V$14-S$14-P$14-M$14-J$14-G$14-D$14-SUM(Z20,AC20))<=0),S20+P20+M20+J20+G20+D20=0),V19,IF(V$14>=V19,V19,IF(AND(S20=0,P20=0,M20=0,J20=0,G20=0,D20=0),$J$6-R20-O20-L20-I20-F20-C20+V$14+S$14+P$14+M$14+J$14+G$14+D$14+SUM(Z20,AC20),V$14)))","v":160},{"$f":"IF((V19-U20)<=0.0001,0,(V19-U20)*(1+(V$15/12)))","v":11836.11},{"$f":"IF(V19=0,V$14,0)","v":0},{"$f":"IF(AND(((Y19-$J$6+U20+R20+O20+L20+I20+F20+C20-Y$14-V$14-S$14-P$14-M$14-J$14-G$14-D$14-SUM(AC20))<=0),V20+S20+P20+M20+J20+G20+D20=0),Y19,IF(Y$14>=Y19,Y19,IF(AND(V20=0,S20=0,P20=0,M20=0,J20=0,G20=0,D20=0),$J$6-U20-R20-O20-L20-I20-F20-C20+Y$14+V$14+S$14+P$14+M$14+J$14+G$14+D$14+SUM(AC20),Y$14)))","v":180},{"$f":"IF((Y19-X20)<=0.0001,0,(Y19-X20)*(1+(Y$15/12)))","v":13386.633333333333},{"$f":"IF(Y19=0,Y$14,0)","v":0},{"$f":"IF(AND(((AB19-$J$6+X20+U20+R20+O20+L20+I20+F20+C20-AB$14-Y$14-V$14-S$14-P$14-M$14-J$14-G$14-D$14)<=0),Y20+V20+S20+P20+M20+J20+G20+D20=0),AB19,IF(AB$14>=AB19,AB19,IF(AND(Y20=0,V20=0,S20=0,P20=0,M20=0,J20=0,G20=0,D20=0),$J$6-X20-U20-R20-O20-L20-I20-F20-C20+AB$14+Y$14+V$14+S$14+P$14+M$14+J$14+G$14+D$14,AB$14)))","v":0},{"$f":"IF((AB19-AA20)<=0.0001,0,(AB19-AA20)*(1+(AB$15/12)))","v":0},{"$f":"IF(AB19=0,AB$14,0)","v":0},null,930,null,1460.4,2,null,2735.6391666666668,2,null,6120.45,2,null,7049.0699999999988,2,null,8735.4599999999991,2,null,10288.133333333333,2,null,11836.11,2,null,13386.633333333333,2]
{"$rows_left_out":119}
{"sheet":"Debt Payoff Chart","index":3,"n_rows":7,"n_cols":20,"rows_kept":7,"cut":false,"hidden":false,"merged":[]}
[]
[]
[null,null,null,null,null,null,null,null,null,null,null,null,null,null,null,null,null,null,"Provided by: LifeAndMyFinances.com"]
[null,null,null,null,null,null,null,null,null,null,null,null,null,null,null,null,null,null,null,"Copyright 2023"]
[null,null,null,null,null,null,null,"Enter all your numbers in the Debt Snowball Calculator tab and then click \"Refresh Chart\" to the right."]
[null,null,null,null,null,null,null,"Then, print this sheet, put it on your fridge, and mark how well you're doing vs. your goal!"]
[null,null,null,null,null,null,null,"Color in the squares as you go and pay off that debt faster than you planned! Good luck!"]

{"sheet":"Charts","index":4,"n_rows":127,"n_cols":46,"rows_kept":127,"cut":false,"hidden":true,"merged":[[0,42,1,72],[5,45,5,50],[0,0,1,5],[0,7,1,15],[0,34,1,40],[5,8,5,10],[0,17,1,21],[0,23,1,25],[0,27,1,32]]}
["Data Table",null,null,null,null,null,null,"Debt Payoff Chart",null,null,null,null,null,null,null,null,null,"Principal Vs Interest",null,null,null,null,null,"Labels",null,null,null,"Labels",null,null,null,null,null,null,"Remaining Months bar Chart",null,null,null,null,null,null,null,"Remaining Months bar Chart"]
[]
[]
[]
[null,null,null,null,null,null,null,null,null,null,null,null,null,null,null,null,null,null,null,null,null,null,null,null,null,null,null,null,"Name","Amount"]
[null,"Month","Debt Amount","#",null,"Debt Payoff Month",null,null,"Table Axes Settings",null,null,null,"Month","Debt Amount",null,null,null,null,"Total Payments","Initial Debt","Interest",null,null,null,"Dashboard",null,null,null,{"$f":"Data!E13:F13:INDEX(Data!E13:E44, COUNTA(Data!E13:E44))","v":"Debt 1"},1500,null,null,null,null,null,"Debt","Months",null,"Debt","Months",null,null,null,null,"Path:",{"$f":"LEFT(CELL(\"filename\"),FIND(\"?\",SUBSTITUTE(CELL(\"filename\"),\"\\\",\"?\",LEN(CELL(\"filename\"))-LEN(SUBSTITUTE(CELL(\"filename\"),\"\\\",\"\")))))","v":{"$error":"#VALUE!"}}]
[null,0,{"$f":"SUM('Debt Snowball Calculator'!D13:AC13)","v":62973},0,null,{"$f":"IFERROR(VLOOKUP(B7,$C$7:$D$127,2,FALSE), 120)","v":97},null,null,null,"X","Y",null,{"$f":"B7:INDEX(B7:B127, COUNTIF(C7:C127, \">0\"))","v":0},{"$f":"C7:INDEX(C7:C127, COUNTIF(C7:C127, \">0\"))","v":62973},null,null,null,null,{"$f":"SUM('Debt Snowball Calculator'!AE19:AE138)","v":89752.600629771114},{"$f":"C7","v":62973},{"$f":"S7-T7","v":26779.600629771114},null,null,null,{"$f":"\"Beginning Total Debt: \" &TEXT(T7, \"$#,#\")","v":"Beginning Total Debt: $62,973"},null,null,null,"Debt 2",2843,null,null,null,null,null,{"$f":"Data!E13:INDEX(Data!E13:E44, COUNTA(Data!E13:E44))","v":"Debt 1"},{"$f":"IF(AJ7<>\"\", COUNTIF(INDEX('Debt Snowball Calculator'!$C$19:$AC$138,, MATCH(AJ7, 'Debt Snowball Calculator'!$C$12:$AC$12, 0)), \">0\"), \"\")","v":63},null,{"$f":"AJ7:INDEX(_xlfn.ANCHORARRAY(AJ7), COUNTA(_xlfn.ANCHORARRAY(AJ7)))","v":"Debt 1"},{"$f":"AK7:INDEX(AK7:AK38, COUNTA(_xlfn.ANCHORARRAY(AJ7)))","v":63}]
[null,1,{"$f":"SUM('Debt Snowball Calculator'!D19,'Debt Snowball Calculator'!G19,'Debt Snowball Calculator'!J19,'Debt Snowball Calculator'!M19,'Debt Snowball Calculator'!P19,'Debt Snowball Calculator'!S19,'Debt Snowball Calculator'!V19,'Debt Snowball Calculator'!Y19,'Debt Snowball Calculator'!AB19)","v":62043},1,null,null,null,null,"Max",{"$f":"MIN(120, $F$7)","v":97},{"$f":"K10*11","v":66000},null,1,62043,null,null,null,null,null,null,null,null,null,null,{"$f":"IF(Dashboard!F2>0, \"With extra payments of: $\" & Dashboard!F2, \"With no extra payments\")","v":"With no extra payments"},null,null,null,"Debt 3",6280,null,null,null,null,null,"Debt 2",{"$f":"IF(AJ8<>\"\", COUNTIF(INDEX('Debt Snowball Calculator'!$C$19:$AC$138,, MATCH(AJ8, 'Debt Snowball Calculator'!$C$12:$AC$12, 0)), \">0\"), \"\")","v":62},null,"Debt 2",62]
[null,2,{"$f":"SUM('Debt Snowball Calculator'!D20,'Debt Snowball Calculator'!G20,'Debt Snowball Calculator'!J20,'Debt Snowball Calculator'!M20,'Debt Snowball Calculator'!P20,'Debt Snowball Calculator'!S20,'Debt Snowball Calculator'!V20,'Debt Snowball Calculator'!Y20,'Debt Snowball Calculator'!AB20)","v":61611.895833333328},2,null,null,null,null,"Min",0,0,null,2,61611.895833333328,null,null,null,null,null,null,null,null,null,null,{"$f":"IF(Dashboard!F4>0, \"And an initial payment of: $\" & Dashboard!F4, \"With no initial payment\")","v":"With no initial payment"},null,null,null,"Debt 4",7214,null,null,null,null,null,"Debt 3",{"$f":"IF(AJ9<>\"\", COUNTIF(INDEX('Debt Snowball Calculator'!$C$19:$AC$138,, MATCH(AJ9, 'Debt Snowball Calculator'!$C$12:$AC$12, 0)), \">0\"), \"\")","v":76},null,"Debt 3",76]
[null,3,{"$f":"SUM('Debt Snowball Calculator'!D21,'Debt Snowball Calculator'!G21,'Debt Snowball Calculator'!J21,'Debt Snowball Calculator'!M21,'Debt Snowball Calculator'!P21,'Debt Snowball Calculator'!S21,'Debt Snowball Calculator'!V21,'Debt Snowball Calculator'!Y21,'Debt Snowball Calculator'!AB21)","v":61177.321345138887},3,null,null,null,null,"Increment",{"$f":"MAX(1,ROUNDUP(F7/60, 0))","v":2},{"$f":"MAX(1,ROUNDUP($C$7/11,-3))","v":6000},null,3,61177.321345138887,null,null,null,null,null,null,null,null,null,null,{"$f":"\"You could be debt free in \" & TEXT(F7/12, \"0.0\") & \" years\" & IF(ISNA(VLOOKUP(B7,$C$7:$D$127,2,FALSE)), \", or more\", \"\")","v":"You could be debt free in 8.1 years"},null,null,null,"Debt 5",8932,null,null,null,null,null,"Debt 4",{"$f":"IF(AJ10<>\"\", COUNTIF(INDEX('Debt Snowball Calculator'!$C$19:$AC$138,, MATCH(AJ10, 'Debt Snowball Calculator'!$C$12:$AC$12, 0)), \">0\"), \"\")","v":80},null,"Debt 4",80]
[null,4,{"$f":"SUM('Debt Snowball Calculator'!D22,'Debt Snowball Calculator'!G22,'Debt Snowball Calculator'!J22,'Debt Snowball Calculator'!M22,'Debt Snowball Calculator'!P22,'Debt Snowball Calculator'!S22,'Debt Snowball Calculator'!V22,'Debt Snowball Calculator'!Y22,'Debt Snowball Calculator'!AB22)","v":60739.243130552655},4,null,null,null,null,null,null,null,null,4,60739.243130552655,null,null,null,null,null,null,null,null,null,null,{"$f":"IF(COUNTA(Data!E13:E44)>0, \"...debt free in \" & TEXT(F7/12, \"0.0\") & \" years\" & IF(ISNA(VLOOKUP(B7,$C$7:$D$127,2,FALSE)), \", or more\", \"\"), \"\")","v":"...debt free in 8.1 years"},null,null,null,"Debt 6",10500,null,null,null,null,null,"Debt 5",{"$f":"IF(AJ11<>\"\", COUNTIF(INDEX('Debt Snowball Calculator'!$C$19:$AC$138,, MATCH(AJ11, 'Debt Snowball Calculator'!$C$12:$AC$12, 0)), \">0\"), \"\")","v":83},null,"Debt 5",83]
[null,5,{"$f":"SUM('Debt Snowball Calculator'!D23,'Debt Snowball Calculator'!G23,'Debt Snowball Calculator'!J23,'Debt Snowball Calculator'!M23,'Debt Snowball Calculator'!P23,'Debt Snowball Calculator'!S23,'Debt Snowball Calculator'!V23,'Debt Snowball Calculator'!Y23,'Debt Snowball Calculator'!AB23)","v":60297.627402910235},5,null,null,null,null,null,null,null,null,5,60297.627402910235,null,null,null,null,null,null,null,null,null,null,null,null,null,null,"Debt 7",12068,null,null,null,null,null,"Debt 6",{"$f":"IF(AJ12<>\"\", COUNTIF(INDEX('Debt Snowball Calculator'!$C$19:$AC$138,, MATCH(AJ12, 'Debt Snowball Calculator'!$C$12:$AC$12, 0)), \">0\"), \"\")","v":88},null,"Debt 6",88]
[null,6,{"$f":"SUM('Debt Snowball Calculator'!D24,'Debt Snowball Calculator'!G24,'Debt Snowball Calculator'!J24,'Debt Snowball Calculator'!M24,'Debt Snowball Calculator'!P24,'Debt Snowball Calculator'!S24,'Debt Snowball Calculator'!V24,'Debt Snowball Calculator'!Y24,'Debt Snowball Calculator'!AB24)","v":59852.439988784914},6,null,null,null,null,null,null,null,null,6,59852.439988784914,null,null,null,null,null,null,null,null,null,null,"Data",null,null,null,"Debt 8",13636,null,null,null,null,null,"Debt 7",{"$f":"IF(AJ13<>\"\", COUNTIF(INDEX('Debt Snowball Calculator'!$C$19:$AC$138,, MATCH(AJ13, 'Debt Snowball Calculator'!$C$12:$AC$12, 0)), \">0\"), \"\")","v":92},null,"Debt 7",92]
[null,7,{"$f":"SUM('Debt Snowball Calculator'!D25,'Debt Snowball Calculator'!G25,'Debt Snowball Calculator'!J25,'Debt Snowball Calculator'!M25,'Debt Snowball Calculator'!P25,'Debt Snowball Calculator'!S25,'Debt Snowball Calculator'!V25,'Debt Snowball Calculator'!Y25,'Debt Snowball Calculator'!AB25)","v":59403.646322955865},7,null,null,null,null,null,null,null,null,7,59403.646322955865,null,null,null,null,null,null,null,null,null,null,{"$f":"IF(COUNTA(Data!E13:E44)>0, \"With these inputs, you could be debt free in \" & TEXT(F7/12, \"0.0\") & \" years\" & IF(ISNA(VLOOKUP(B7,$C$7:$D$127,2,FALSE)), \", or more\", \"\"), \"\")","v":"With these inputs, you could be debt free in 8.1 years"},null,null,null,null,null,null,null,null,null,null,"Debt 8",{"$f":"IF(AJ14<>\"\", COUNTIF(INDEX('Debt Snowball Calculator'!$C$19:$AC$138,, MATCH(AJ14, 'Debt Snowball Calculator'!$C$12:$AC$12, 0)), \">0\"), \"\")","v":97},null,"Debt 8",97]
[null,8,{"$f":"SUM('Debt Snowball Calculator'!D26,'Debt Snowball Calculator'!G26,'Debt Snowball Calculator'!J26,'Debt Snowball Calculator'!M26,'Debt Snowball Calculator'!P26,'Debt Snowball Calculator'!S26,'Debt Snowball Calculator'!V26,'Debt Snowball Calculator'!Y26,'Debt Snowball Calculator'!AB26)","v":58951.2114433057},8,null,null,null,null,null,null,null,null,8,58951.2114433057,null,null,null,null,null,null,null,null,null,null,null,null,null,null,null,null,null,null,null,null,null,null,{"$f":"IF(AJ15<>\"\", COUNTIF(INDEX('Debt Snowball Calculator'!$C$19:$AC$138,, MATCH(AJ15, 'Debt Snowball Calculator'!$C$12:$AC$12, 0)), \">0\"), \"\")","v":""}]
[null,9,{"$f":"SUM('Debt Snowball Calculator'!D27,'Debt Snowball Calculator'!G27,'Debt Snowball Calculator'!J27,'Debt Snowball Calculator'!M27,'Debt Snowball Calculator'!P27,'Debt Snowball Calculator'!S27,'Debt Snowball Calculator'!V27,'Debt Snowball Calculator'!Y27,'Debt Snowball Calculator'!AB27)","v":58495.099985645953},9,null,null,null,null,null,null,null,null,9,58495.099985645953,null,null,null,null,null,null,null,null,null,null,null,null,null,null,null,null,null,null,null,null,null,null,{"$f":"IF(AJ16<>\"\", COUNTIF(INDEX('Debt Snowball Calculator'!$C$19:$AC$138,, MATCH(AJ16, 'Debt Snowball Calculator'!$C$12:$AC$12, 0)), \">0\"), \"\")","v":""}]
[null,10,{"$f":"SUM('Debt Snowball Calculator'!D28,'Debt Snowball Calculator'!G28,'Debt Snowball Calculator'!J28,'Debt Snowball Calculator'!M28,'Debt Snowball Calculator'!P28,'Debt Snowball Calculator'!S28,'Debt Snowball Calculator'!V28,'Debt Snowball Calculator'!Y28,'Debt Snowball Calculator'!AB28)","v":58035.276178469772},10,null,null,null,null,null,null,null,null,10,58035.276178469772,null,null,null,null,null,null,null,null,null,null,null,null,null,null,null,null,null,null,null,null,null,null,{"$f":"IF(AJ17<>\"\", COUNTIF(INDEX('Debt Snowball Calculator'!$C$19:$AC$138,, MATCH(AJ17, 'Debt Snowball Calculator'!$C$12:$AC$12, 0)), \">0\"), \"\")","v":""}]
[null,11,{"$f":"SUM('Debt Snowball Calculator'!D29,'Debt Snowball Calculator'!G29,'Debt Snowball Calculator'!J29,'Debt Snowball Calculator'!M29,'Debt Snowball Calculator'!P29,'Debt Snowball Calculator'!S29,'Debt Snowball Calculator'!V29,'Debt Snowball Calculator'!Y29,'Debt Snowball Calculator'!AB29)","v":57571.703837630608},11,null,null,null,null,null,null,null,null,11,57571.703837630608,null,null,null,null,null,null,null,null,null,null,null,null,null,null,null,null,null,null,null,null,null,null,{"$f":"IF(AJ18<>\"\", COUNTIF(INDEX('Debt Snowball Calculator'!$C$19:$AC$138,, MATCH(AJ18, 'Debt Snowball Calculator'!$C$12:$AC$12, 0)), \">0\"), \"\")","v":""}]
[null,12,{"$f":"SUM('Debt Snowball Calculator'!D30,'Debt Snowball Calculator'!G30,'Debt Snowball Calculator'!J30,'Debt Snowball Calculator'!M30,'Debt Snowball Calculator'!P30,'Debt Snowball Calculator'!S30,'Debt Snowball Calculator'!V30,'Debt Snowball Calculator'!Y30,'Debt Snowball Calculator'!AB30)","v":57104.346360945769},12,null,null,null,null,null,null,null,null,12,57104.346360945769,null,null,null,null,null,null,null,null,null,null,null,null,null,null,null,null,null,null,null,null,null,null,{"$f":"IF(AJ19<>\"\", COUNTIF(INDEX('Debt Snowball Calculator'!$C$19:$AC$138,, MATCH(AJ19, 'Debt Snowball Calculator'!$C$12:$AC$12, 0)), \">0\"), \"\")","v":""}]
[null,13,{"$f":"SUM('Debt Snowball Calculator'!D31,'Debt Snowball Calculator'!G31,'Debt Snowball Calculator'!J31,'Debt Snowball Calculator'!M31,'Debt Snowball Calculator'!P31,'Debt Snowball Calculator'!S31,'Debt Snowball Calculator'!V31,'Debt Snowball Calculator'!Y31,'Debt Snowball Calculator'!AB31)","v":56633.166722723807},13,null,null,null,null,null,null,null,null,13,56633.166722723807,null,null,null,null,null,null,null,null,null,null,null,null,null,null,null,null,null,null,null,null,null,null,{"$f":"IF(AJ20<>\"\", COUNTIF(INDEX('Debt Snowball Calculator'!$C$19:$AC$138,, MATCH(AJ20, 'Debt Snowball Calculator'!$C$12:$AC$12, 0)), \">0\"), \"\")","v":""}]
{"$rows_left_out":107}