{"text_format":"1","workbook":"xlsx","n_sheets":10,"sheets":["Generators_PL","Generators_PL_Canada","GENSET_ACCY_6-20kW","GENSET_ACCY_24-150kW","PORTABLES_PL","ATS_PL","ATS_PL_Canada","ATS_PARTS_PL","PORTABLES PRICING ANALYSIS","PORTABLES_PARTS"],"not_rendered":{"charts":0,"images":1,"macros":1,"external_links":4,"defined_names":18,"comments":1,"pivot_tables":0},"unopened":[],"bounds":{"document_bytes":16777216,"sheet_cells":100000,"rows_first":2000,"rows_last":500,"rows_between":2000,"halvings":0,"cell_chars":16384,"cell_head_chars":4096},"cells_cut":0,"cells_raw":0,"read":"whole","date_system":"1900"}

{"sheet":"Generators_PL","index":0,"n_rows":129,"n_cols":8,"rows_kept":129,"cut":false,"hidden":false,"merged":[[3,5,3,6],[114,0,115,7],[61,0,62,7],[9,0,10,7],[17,0,18,7],[92,0,93,7],[74,0,75,7],[36,0,37,7]]}
[null,null,null,null,null,null,null,"Residential Price List"]
[null,null,null,null,null,null,null,"EFFECTIVE DATE: 05/01/2023"]
[null,null,null,null,null,null,null,"Pricing is in USD"]
[]
["*denotes new or updated models"]
["Specification #","Description","Standby (kW)","LCB (Amp)","Net Price","List Price","MSRP","MAP"]
["RESIDENTIAL GENERATOR PRICE LIST"]
[]
["AIR-COOLED AUTOMATIC STANDBY GENERATOR, LPG, COLOR : KOHLER CASHMERE"]
["Standard Features: cUL-US Approval, Steel 58 dBA Sound Shield, Standard Air Intake, VSC Controller with 2.5-Amp Battery Charger, Flexible Fuel Line, Hydraulic Magnetic Type Breaker, Five-Year Comprehensive/ 18-Month Off-Grid Warranty, Field Convertible to Natural Gas Fuel"]
[]
["6VSG-QS18","6VSG, 48V, Oil Makeup kit",6,"N/A",{"$f":"F12*F$4","v":0},6885,{"$f":"VLOOKUP($A12,'[1]CURRENT PRICING'!$B:$F,4,FALSE)","v":5585},{"$f":"VLOOKUP($A12,'[1]CURRENT PRICING'!$B:$F,5,FALSE)","v":5474}]
["6VSG-QS19","6VSG, 36V, Oil Makeup Kit, Comm Kit",6,"N/A",0,7135,{"$f":"VLOOKUP($A13,'[1]CURRENT PRICING'!$B:$F,4,FALSE)","v":5788},{"$f":"VLOOKUP($A13,'[1]CURRENT PRICING'!$B:$F,5,FALSE)","v":5672}]
["6VSG-QS20","6VSG, 48V, Oil Makeup Kit, Comm Kit",6,"N/A",0,6995,{"$f":"VLOOKUP($A14,'[1]CURRENT PRICING'!$B:$F,4,FALSE)","v":5675},{"$f":"VLOOKUP($A14,'[1]CURRENT PRICING'!$B:$F,5,FALSE)","v":5561}]
["6VSG-QS21","6VSG, 48V",6,"N/A",0,6592,{"$f":"VLOOKUP($A15,'[1]CURRENT PRICING'!$B:$F,4,FALSE)","v":5348},{"$f":"VLOOKUP($A15,'[1]CURRENT PRICING'!$B:$F,5,FALSE)","v":5241}]
["6VSG-QS22","6VSG, 24V",6,"N/A",0,6915,{"$f":"VLOOKUP($A16,'[1]CURRENT PRICING'!$B:$F,4,FALSE)","v":5610},{"$f":"VLOOKUP($A16,'[1]CURRENT PRICING'!$B:$F,5,FALSE)","v":5497}]
["AIR-COOLED AUTOMATIC STANDBY GENERATOR, NATURAL GAS, COLOR : KOHLER CASHMERE"]
["Standard Features: UL2200/CSA Approval, Battery Cables, Fuel Solenoid Valve & Secondary Regulator, Oil Drain Extension With Shutoff Valve, Rodent-Resistant Construction, Critical Silencer, Sound-Deadening, Flame-Retardant Sound Shield Foam, Carb- And EPA-Certified Fuel System, Flex Fuel Line, Easy-Connect Terminal Block, Five-Year Comprehensive Warranty, Field Convertible to LPG Fuel, OnCue Plus"]
[]
["10RESV-QS8","10RESV, 1 PH, 240V, UL/cUL",10,50,{"$f":"F20*F$4","v":0},4180,3395,3325]
["10RESVL-100LC12","10RESVL,RXT 100 Amp, LC-12 spaces, NEMA1",10,50,{"$f":"F21*F$4","v":0},4865,3950,3870]
["12RES-QS11","12RES, 1 PH, 120/240V, UL/cUL (No OnCue Plus on ADC Controller)",12,40,0,6195,5025,4925]
["12RESV-QS8","12RESV, 1 PH, 240V, UL/cUL",12,60,0,4745,3845,3770]
["12RESVL-100LC12","12RESVL,RXT 100 Amp, LC-12 spaces, NEMA1",12,60,0,5430,4405,4315]
["14RCA-QS5","14RCA, 1PH, 240V, cUL/CSA - Mossy Oak Shadow Grass Habitat",14,70,0,6535,5300,5195]
["14RCA-QS6","14RCA, 1 PH, 240V, cUL/US, CSA",14,70,0,5335,4325,4240]
["14RCA-QS7","14RCA, 3 PH, 208V, cUL, CSA",14,50,0,5535,4490,4400]
["14RCA-QS8","14RCA, 3 PH, 240V, cUL, CSA",14,50,0,5535,4490,4400]
["14RCA-QS9","14RCA, 3 PH, 480V, cUL, CSA",14,25,0,5535,4490,4400]
["14RCA-QS10","14RCA, 1PH, 240V, cUL/CSA - Mossy Oak Break-Up Country",14,70,0,6535,5300,5195]
["14RCA-QS11","14RCA, 1PH, 240V, cUL/CSA - Mossy Oak Original Bottomland",14,70,0,6535,5300,5195]
["14RCAL-200SELS","14RCAL,RXT 200 Amp,SE,Load Shed,NEMA 3R",14,70,0,6340,5215,5110]
["14RCAL-100LC16","14RCA, 1 PH, 240V, cUL, RXT 100 AMP",14,70,0,6020,4885,4790]
["14RESAL-100LC16","14RESAL, RXT 100 Amp, LC, NEMA 1",14,70,0,5820,4725,4630]
["14RESAL-200SELS","14RESAL,RXT 200 Amp,SE,Load Shed,NEMA 3R",14,70,0,6140,5055,4950]
["AIR-COOLED AUTOMATIC STANDBY GENERATOR, NATURAL GAS, COLOR : KOHLER CASHMERE"]
["Standard Features: UL2200/CSA Approval, Battery Cables, Fuel Solenoid Valve & Secondary Regulator, Oil Drain Extension With Shutoff Valve, Rodent-Resistant Construction, Critical Silencer, Sound-Deadening, Flame-Retardant Sound Shield Foam, Carb- And EPA-Certified Fuel System, Flex Fuel Line, Easy-Connect Terminal Block, Five-Year Comprehensive Warranty, Field Convertible to LPG Fuel, OnCue Plus"]
[]
["14RESA-QS32","14RESA, 1 PH, 240V, cUL/US, CSA",14,70,{"$f":"F39*F$4","v":0},5135,4165,4080]
["14RESA-QS33","14RESA, 3 PH, 208V, cUL/US, CSA",14,50,0,5335,4325,4240]
["14RESA-QS34","14RESA, 3 PH, 240V, cUL/US, CSA",14,50,0,5335,4325,4240]
["14RESA-QS35","14RESA, 3 PH, 480V, cUL/US, CSA",14,25,0,5335,4325,4240]
["20RCA-QS5","20RCA, 1PH, 240V, cUL/CSA - Mossy Oak Shadow Grass Habitat",20,100,0,7400,6535,6405]
["20RCA-QS6","20RCA, 1 PH, 240V, cUL/US, CSA",20,100,0,6200,5550,5440]
["20RCA-QS7","20RCA, 3 PH, 208V, cUL/US, CSA",20,70,0,6400,5715,5600]
["20RCA-QS8","20RCA, 3 PH, 240V, cUL/US, CSA",20,60,0,6400,5715,5600]
["20RCA-QS9","20RCA, 3 PH, 480V, cUL/US, CSA",20,30,0,6400,5715,5600]
["20RCA-QS10","20RCA, 1PH, 240V, cUL/CSA - Mossy Oak Break-Up Country",20,100,0,7400,6535,6405]
["20RCA-QS11","20RCA, 1PH, 240V, cUL/CSA - Mossy Oak Original Bottomland",20,100,0,7400,6535,6405]
["20RCAL-200SELS","20RCAL, RXT 200 A SE, N3R, w/LOAD Man",20,100,0,7205,6440,6310]
["20RESCL-200SELS","20RESCL, RXT 200 Amp, SE, Load Shed Kit, NEMA 3R",20,100,0,7005,6275,6145]
["20RESC-QS15","20RESC, 1 PH, 240V, cUL/US, CSA",20,100,0,6000,5385,5275]
["20RESC-QS16","20RESC, 3 PH, 208V, cUL/US, CSA",20,70,0,6200,5550,5440]
["20RESC-QS17","20RESC, 3 PH, 240V, cUL/US, CSA",20,60,0,6200,5550,5440]
["26RCA-QS1 ","26RCA, 1 PH, 240V, cUL, CSA ",26,125,0,7935,6520,6390]
["26RCA-QS50","26RCA, 1 PH, 240V, cUL, CSA, Cold Weather Kit",26,125,0,8675,7130,6985]
["26RCA-QS5","26RCA, 1 PH, 240V, cUL, CSA,  Mossy Oak Shadow Grass Habitat",26,125,0,9135,7505,7355]
["26RCA-QS10  ","26RCA, 1 PH, 240V, cUL, CSA, Mossy Oak Break-Up Country",26,125,0,9135,7505,7355]
["26RCA-QS11 ","26RCA, 1 PH, 240V, cUL, CSA, Mossy Oak Original Bottomland",26,125,0,9135,7505,7355]
["26RCAL-200SELS ","26RCAL, RXT 200 Amp, SE, N3R, w/LOAD Man ",26,125,0,8940,7340,7195]
["LIQUID-COOLED AUTOMATIC STANDBY GENERATOR, NG/LP, Color: Kohler Cashmere"]
["Standard Features: UL2200/CSA, 60 Hz, Aluminum Sound Shield, Unit Mounted Radiator, Standard Air Intake, RDC2 Controller which includes a 2.5AMP Battery Charger, Flexible Fuel Lines, Coolant in generator, 45 C Cooling System and 5-Year Comprehensive Warranty, OnCue Plus"]
[]
["24RCLA-QS1","24RCLA, 1 PH, 240V, UL, CSA ",24,100,{"$f":"F64*F$4","v":0},15675,12730,12475]
["24RCLA-QS2","24RCLA, 3 PH, 208V, UL, CSA ",24,90,0,15675,12730,12475]
["24RCLA-QS3","24RCLA, 3 PH, 240V, UL, CSA",24,80,0,15675,12730,12475]
["24RCLA-QS4","24RCLA, 3 PH, 480V, UL, CSA",24,40,0,15675,12730,12475]
["24RCLA-QS50","24RCLA, 1 PH, 240V, UL, CSA, Blk Heater",24,100,0,16280,13225,12960]
["30RCLA-QS1","30RCLA, 1 PH, 240V, UL, CSA",30,150,0,17895,14535,14245]
["30RCLA-QS2","30RCLA, 3 PH, 208V, UL, CSA",30,125,0,17895,14535,14245]
["30RCLA-QS3","30RCLA, 3 PH, 240V, UL, CSA",30,100,0,17895,14535,14245]
["30RCLA-QS4","30RCLA, 3 PH, 480V, UL, CSA",30,50,0,17895,14535,14245]
["30RCLA-QS50","30RCLA, 1 PH, 240V, UL, CSA, Blk Heater",30,150,0,18455,14990,14690]
["LIQUID-COOLED AUTOMATIC STANDBY GENERATOR, NG/LP, Color: Kohler Cashmere"]
["Standard Features: UL2200/CSA, 60 Hz, Aluminum Sound Shield, Unit Mounted Radiator, Standard Air Intake, RDC2 Controller which includes a 2.5AMP Battery Charger, Flexible Fuel Lines, Coolant in generator, 45 C Cooling System and 5-Year Comprehensive Warranty, OnCue Plus"]
[]
["38RCLC-QS1","38RCLC, 1 PH, 240V, UL, CSA",38,175,{"$f":"F77*F$4","v":0},19905,16170,15845]
["38RCLC-QS2","38RCLC, 3 PH, 208V, UL, CSA",38,150,0,19905,16170,15845]
["38RCLC-QS3","38RCLC, 3 PH, 240V, UL, CSA",38,125,0,19905,16170,15845]
["38RCLC-QS4","38RCLC, 3 PH, 480V, UL, CSA",38,60,0,19905,16170,15845]
["38RCLC-QS50","38RCLC, 1 PH, 240V, UL, CSA, Blk Heater",38,175,0,20475,16635,16300]
["48RCLC-QS5","48RCLC, 1 PH, 240V, UL, CSA",48,200,0,22715,18450,18080]
["48RCLC-QS6","48RCLC, 3 PH, 208V, UL, CSA",48,175,0,22715,18450,18080]
["48RCLC-QS7","48RCLC, 3 PH, 240V, UL, CSA",48,150,0,22715,18450,18080]
["48RCLC-QS8","48RCLC, 3 PH, 480V, UL, CSA",48,80,0,22715,18450,18080]
["48RCLC-QS51","48RCLC, 1 PH, 240V, UL, CSA, Blk Heater",48,200,0,23290,18920,18540]
["60RCLB-QS5","60RCLB, 1 PH, 240V, UL, CSA",60,250,0,27865,22635,22180]
["60RCLB-QS6","60RCLB, 3 PH, 208V, UL, CSA",60,225,0,27865,22635,22180]
["60RCLB-QS7","60RCLB, 3 PH, 240V, UL, CSA",60,200,0,27865,22635,22180]
["60RCLB-QS8","60RCLB, 3 PH, 480V, UL, CSA",60,100,0,27865,22635,22180]
["60RCLB-QS51","60RCLB, 1 PH, 240V, UL, CSA, Blk Heater",60,250,0,28515,23165,22700]
["LIQUID-COOLED AUTOMATIC STANDBY GENERATOR, NATURAL GAS, Color: Kohler Cashmere"]
["Standard Features: UL2200/CSA, Sound Shield, 45C Unit Mounted Radiator, Standard Air Intake, APM402 Controller, Flexible Fuel Lines, 12V-6A Battery Charger, Additional Gas Solenoid Valve, Rodent Guards, Silencer, Coolant in generator, Block Heater installed and 5-Year Basic Warranty"]
[]
["KG80R-QS","KG80R, 1 PH, 120/240, 4T9X Alternator, Steel Enclosure",80,350,{"$f":"F95*F$4","v":0},33945,27330,26785]
["KG80R-QS1","KG80R, 1 PH, 120/240, 4T9X Alternator, Aluminum Enclosure",80,350,0,35355,28465,27895]
["KG80R-QS2","KG80R, 3 Ph, 120/208, 4R9X Alternator, Steel Enclosure",80,300,0,33955,27335,26790]
["KG80R-QS3","KG80R, 3 Ph, 120/240, 4R9X Alternator, Steel Enclosure",80,250,0,33955,27335,26790]
["KG80R-QS4","KG80R, 3 Ph, 277/480, 4R9X Alternator, Steel Enclosure",80,125,0,33955,27335,26790]
["KG80R-QS5","KG80R, 3 Ph, 120/208, 4R9X Alternator, Aluminum Enclosure",80,300,0,35385,28490,27920]
["KG80R-QS6","KG80R, 1 PH, 120/240, 4T9X Alternator, Steel Enclosure, w/Catalyst, CA/MA Compliant",80,350,0,36035,29010,28430]
["KG80R-QS7","KG80R, 1 PH, 120/240, 4T9X Alternator, Aluminum Enclosure, w/Catalyst, CA/MA Compliant",80,350,0,37410,30115,29515]
["KG80R-QS8","KG80R, 3 Ph, 120/208, 4R9X Alternator, Steel Enclosure, w/Catalyst, CA/MA Compliant",80,300,0,36010,28990,28410]
["KG80R-QS20","KG80R, 1PH, 120/240, 4T9X Alternator, Aluminum Enclosure, Auto Dual Fuel",80,300,0,35945,28927.82,28360.61]
["KG80R-QS21","KG80R, 1PH, 120/240, 4T9X Alternator, Aluminum Enclosure, Auto Dual Fuel, CA/MA Compliant",80,300,0,37355,30062.560000000001,29473.1]
["KG100R-QS","KG100R, 1 PH, 120/240, 4T13X Alternator, Steel Enclosure, CA/MA Compliant",100,600,0,39290,31635,31000]
["KG100R-QS1","KG100R, 1 PH, 120/240, 4T13X Alternator, Aluminum Enclosure, CA/MA Compliant",100,600,0,40675,32750,32095]
["KG100R-QS2","KG100R, 3 Ph, 120/208, 4R12X Alternator, Steel Enclosure, CA/MA Compliant",100,350,0,39290,31635,31000]
["KG100R-QS3","KG100R, 3 Ph, 120/240, 4R12X Alternator, Steel Enclosure, CA/MA Compliant",100,300,0,39290,31635,31000]
["KG100R-QS4","KG100R, 3 Ph, 277/480, 4R12X Alternator, Steel Enclosure, CA/MA Compliant",100,150,0,39290,31635,31000]
["KG100R-QS5","KG100R, 3 Ph, 120/208, 4R12X Alternator, Aluminum Enclosure, CA/MA Compliant",100,350,0,40675,32750,32095]
["KG100R-QS6","KG100R, 3Ph,  600V, Aluminum Enclosure, 12V Run Relay, 2/5 IO",100,125,0,40675,32750,32095]
["KG100R-QS20","KG100R, 1PH, 120/240, 4T9X Alternator, Aluminum, Auto Dual Fuel, CA/MA Compliant",100,350,0,41290,33229.370000000003,32577.81]
["LIQUID-COOLED AUTOMATIC STANDBY GENERATOR, NATURAL GAS, Color: Kohler Cashmere"]
["Standard Features: UL2200/CSA, Sound Shield, 45C Unit Mounted Radiator, Standard Air Intake, APM402 Controller, Flexible Fuel Lines, 12V-6A Battery Charger, Additional Gas Solenoid Valve, Rodent Guards, Silencer, Coolant in generator, Block Heater installed and 5-Year Basic Warranty"]
[]
["KG125R-QS","KG125R, 1 PH, 120/240, 4T13X Alternator, Steel Enclosure",125,600,{"$f":"F117*F$4","v":0},41515,33040,32380]
["KG125R-QS1","KG125R, 1 PH, 120/240, 4T13X Alternator, Aluminum Enclosure",125,600,0,42950,34185,33500]
["KG125R-QS2","KG125R, 3 Ph, 120/208, 4R13X Alternator, Steel Enclosure",125,600,0,41515,33040,32380]
["KG125R-QS3","KG125R, 3 Ph, 120/240, 4R13X Alternator, Steel Enclosure",125,400,0,41515,33040,32380]
["KG125R-QS4","KG125R, 3 Ph, 277/480, 4R13X Alternator, Steel Enclosure",125,200,0,41515,33040,32380]
["KG125R-QS5","KG125R, 3 Ph, 120/208, 4R13X Alternator, Aluminum Enclosure",125,600,0,42950,34185,33500]
["150ERESC-QS8","150ERESC, 1 PH, 120/240, 4T13X Alternator, Steel Enclosure",150,600,0,46540,37185,36440]
["150ERESC-QS9","150ERESC, 1 PH, 120/240, 4T13X Alternator, Aluminum Enclosure",150,600,0,47860,38240,37475]
["150ERESC-QS10","150ERESC, 3 Ph, 120/208, 4S13X Alternator, Aluminum  Enclosure",150,600,0,47860,38240,37475]
["150ERESC-QS11","150ERESC, 3Ph,  600V, Aluminum Enclosure, 12V Run Relay, 2/5 IO",150,225,0,47860,38240,37475]
["150ERESC-MV10","150ERESC, 3 Ph, 120/208, 4S13X Alternator, Steel Enclosure",150,600,0,46560,37200,36455]
["150ERESC-MV11","150ERESC, 3 Ph, 120/240, 4S13X Alternator, Steel Enclosure",150,600,0,46560,37200,36455]
["150ERESC-MV12","150ERESC, 3 Ph, 277/480. 4S13X Alternator, Steel Enclosure",150,250,0,46560,37200,36455]

{"sheet":"Generators_PL_Canada","index":1,"n_rows":129,"n_cols":11,"rows_kept":129,"cut":false,"hidden":false,"merged":[[4,8,4,9],[9,0,10,9],[17,0,18,9],[4,4,4,7],[36,0,37,9],[61,0,62,9],[74,0,75,9],[92,0,93,9],[114,0,115,9]]}
[null,null,null,null,null,null,null,null,null,"Residential Price List"]
[null,"CANADA",null,null,null,null,null,null,null,{"$f":"Generators_PL!H2","v":"EFFECTIVE DATE: 05/01/2023"}]
[null,null,null,null,null,null,null,null,null,{"$f":"Generators_PL!F4","v":0}]
[]
["*denotes new or updated models",null,null,null,"USD",null,null,null,"CAD",null,1.35]
["Specification #","Description","Standby (kW)","LCB (Amp)","Net Price","List Price","MSRP","MAP","MSRP","MAP"]
["RESIDENTIAL GENERATOR PRICE LIST"]
[]
["AIR-COOLED AUTOMATIC STANDBY GENERATOR, LPG, COLOR : KOHLER CASHMERE"]
["Standard Features: UL2200/CSA Approval, Steel 58 dBA Sound Shield, Standard Air Intake, VSC Controller with 2.5-Amp Battery Charger, Flexible Fuel Line, Hydraulic Magnetic Type Breaker, Five-Year Comprehensive/ 18-Month Off-Grid Warranty, Field Convertible to Natural Gas Fuel"]
[]
["6VSG-QS18","6VSG, 48V, Oil Makeup kit",6,"N/A",{"$f":"F12*$J$3","v":0},{"$f":"Generators_PL!F12","v":6885},{"$f":"Generators_PL!G12","v":5585},{"$f":"Generators_PL!H12","v":5474},{"$f":"G12*$K$5","v":7539.7500000000009},{"$f":"H12*$K$5","v":7389.9000000000005}]
["6VSG-QS19","6VSG, 36V, Oil Makeup Kit, Comm Kit",6,"N/A",{"$f":"F13*$J$3","v":0},{"$f":"Generators_PL!F13","v":7135},{"$f":"Generators_PL!G13","v":5788},{"$f":"Generators_PL!H13","v":5672},{"$f":"G13*$K$5","v":7813.8},{"$f":"H13*$K$5","v":7657.2000000000007}]
["6VSG-QS20","6VSG, 48V, Oil Makeup Kit, Comm Kit",6,"N/A",{"$f":"F14*$J$3","v":0},{"$f":"Generators_PL!F14","v":6995},{"$f":"Generators_PL!G14","v":5675},{"$f":"Generators_PL!H14","v":5561},7661.2500000000009,7507.35]
["6VSG-QS21","6VSG, 48V",6,"N/A",{"$f":"F15*$J$3","v":0},{"$f":"Generators_PL!F15","v":6592},{"$f":"Generators_PL!G15","v":5348},{"$f":"Generators_PL!H15","v":5241},7219.8,7075.35]
["6VSG-QS22","6VSG, 24V",6,"N/A",{"$f":"F16*$J$3","v":0},{"$f":"Generators_PL!F16","v":6915},{"$f":"Generators_PL!G16","v":5610},{"$f":"Generators_PL!H16","v":5497},7573.5000000000009,7420.9500000000007]
["AIR-COOLED AUTOMATIC STANDBY GENERATOR, NATURAL GAS, COLOR : KOHLER CASHMERE"]
["Standard Features: UL2200/CSA Approval, Battery Cables, Fuel Solenoid Valve & Secondary Regulator, Oil Drain Extension With Shutoff Valve, Rodent-Resistant Construction, Critical Silencer, Sound-Deadening, Flame-Retardant Sound Shield Foam, Carb- And EPA-Certified Fuel System, Flex Fuel Line, Easy-Connect Terminal Block, Five-Year Comprehensive Warranty, Field Convertible to LPG Fuel, OnCue Plus"]
[]
["10RESV-QS8","10RESV, 1 PH, 240V, UL/cUL",10,50,{"$f":"F20*$J$3","v":0},{"$f":"Generators_PL!F20","v":4180},{"$f":"Generators_PL!G20","v":3395},{"$f":"Generators_PL!H20","v":3325},{"$f":"G20*$K$5","v":4583.25},{"$f":"H20*$K$5","v":4488.75}]
["10RESVL-100LC12","10RESVL,RXT 100 Amp, LC-12 spaces, NEMA1",10,50,{"$f":"F21*$J$3","v":0},{"$f":"Generators_PL!F21","v":4865},{"$f":"Generators_PL!G21","v":3950},{"$f":"Generators_PL!H21","v":3870},5332.5,5224.5]
["12RES-QS11","12RES, 1 PH, 120/240V, UL/cUL (No OnCue Plus on ADC Controller)",12,40,{"$f":"F22*$J$3","v":0},{"$f":"Generators_PL!F22","v":6195},{"$f":"Generators_PL!G22","v":5025},{"$f":"Generators_PL!H22","v":4925},6783.75,6648.75]
["12RESV-QS8","12RESV, 1 PH, 240V, UL/cUL",12,60,{"$f":"F23*$J$3","v":0},{"$f":"Generators_PL!F23","v":4745},{"$f":"Generators_PL!G23","v":3845},{"$f":"Generators_PL!H23","v":3770},5190.75,5089.5]
["12RESVL-100LC12","12RESVL,RXT 100 Amp, LC-12 spaces, NEMA1",12,60,{"$f":"F24*$J$3","v":0},{"$f":"Generators_PL!F24","v":5430},{"$f":"Generators_PL!G24","v":4405},{"$f":"Generators_PL!H24","v":4315},5946.75,5825.25]
["14RCA-QS5","14RCA, 1PH, 240V, cUL/CSA - Mossy Oak Shadow Grass Habitat",14,70,{"$f":"F25*$J$3","v":0},6535,5300,5195,7155.0000000000009,7013.2500000000009]
["14RCA-QS6","14RCA, 1 PH, 240V, cUL/US, CSA",14,70,{"$f":"F26*$J$3","v":0},5335,4325,4240,5838.75,5724]
["14RCA-QS7","14RCA, 3 PH, 208V, cUL, CSA",14,50,{"$f":"F27*$J$3","v":0},5535,4490,4400,6061.5,5940]
["14RCA-QS8","14RCA, 3 PH, 240V, cUL, CSA",14,50,{"$f":"F28*$J$3","v":0},5535,4490,4400,6061.5,5940]
["14RCA-QS9","14RCA, 3 PH, 480V, cUL, CSA",14,25,{"$f":"F29*$J$3","v":0},5535,4490,4400,6061.5,5940]
["14RCAL-200SELS","14RCAL,RXT 200 Amp,SE,Load Shed,NEMA 3R",14,70,{"$f":"F30*$J$3","v":0},6425,5215,5110,7040.2500000000009,6898.5]
["14RCA-QS10","14RCA, 1PH, 240V, cUL/CSA - Mossy Oak Break-Up Country",14,70,{"$f":"F31*$J$3","v":0},6535,5300,5195,7155.0000000000009,7013.2500000000009]
["14RCA-QS11","14RCA, 1PH, 240V, cUL/CSA - Mossy Oak Original Bottomland",14,70,{"$f":"F32*$J$3","v":0},6535,5300,5195,7155.0000000000009,7013.2500000000009]
["14RCAL-100LC16","14RCA, 1 PH, 240V, cUL, RXT 100 AMP",14,70,{"$f":"F33*$J$3","v":0},{"$f":"Generators_PL!F33","v":6020},{"$f":"Generators_PL!G33","v":4885},{"$f":"Generators_PL!H33","v":4790},6594.75,6466.5]
["14RESAL-100LC16","14RESAL, RXT 100 Amp, LC, NEMA 1",14,70,{"$f":"F34*$J$3","v":0},{"$f":"Generators_PL!F34","v":5820},{"$f":"Generators_PL!G34","v":4725},{"$f":"Generators_PL!H34","v":4630},6378.75,6250.5]
["14RESAL-200SELS","14RESAL,RXT 200 Amp,SE,Load Shed,NEMA 3R",14,70,{"$f":"F35*#REF!","v":{"$error":"#REF!"}},6525,5290,5185]
["AIR-COOLED AUTOMATIC STANDBY GENERATOR, NATURAL GAS, COLOR : KOHLER CASHMERE"]
["Standard Features: UL2200/CSA Approval, Battery Cables, Fuel Solenoid Valve & Secondary Regulator, Oil Drain Extension With Shutoff Valve, Rodent-Resistant Construction, Critical Silencer, Sound-Deadening, Flame-Retardant Sound Shield Foam, Carb- And EPA-Certified Fuel System, Flex Fuel Line, Easy-Connect Terminal Block, Five-Year Comprehensive Warranty, Field Convertible to LPG Fuel, OnCue Plus"]
[]
["14RESA-QS32","14RESA, 1 PH, 240V, cUL/US, CSA",14,70,{"$f":"F39*$J$3","v":0},{"$f":"Generators_PL!F39","v":5135},{"$f":"Generators_PL!G39","v":4165},{"$f":"Generators_PL!H39","v":4080},{"$f":"G39*$K$5","v":5622.75},{"$f":"H39*$K$5","v":5508}]
["14RESA-QS33","14RESA, 3 PH, 208V, cUL/US, CSA",14,50,{"$f":"F40*$J$3","v":0},{"$f":"Generators_PL!F40","v":5335},{"$f":"Generators_PL!G40","v":4325},{"$f":"Generators_PL!H40","v":4240},{"$f":"G40*$K$5","v":5838.75},{"$f":"H40*$K$5","v":5724}]
["14RESA-QS34","14RESA, 3 PH, 240V, cUL/US, CSA",14,50,{"$f":"F41*$J$3","v":0},{"$f":"Generators_PL!F41","v":5335},{"$f":"Generators_PL!G41","v":4325},{"$f":"Generators_PL!H41","v":4240},5838.75,5724]
["14RESA-QS35","14RESA, 3 PH, 480V, cUL/US, CSA",14,25,{"$f":"F42*$J$3","v":0},{"$f":"Generators_PL!F42","v":5335},{"$f":"Generators_PL!G42","v":4325},{"$f":"Generators_PL!H42","v":4240},5838.75,5724]
["20RCA-QS5","20RCA, 1PH, 240V, cUL/CSA - Mossy Oak Shadow Grass Habitat",20,100,{"$f":"F43*$J$3","v":0},7930,6535,6405,8822.25,8646.75]
["20RCA-QS6","20RCA, 1 PH, 240V, cUL/US, CSA",20,100,{"$f":"F44*$J$3","v":0},{"$f":"Generators_PL!F44","v":6200},{"$f":"Generators_PL!G44","v":5550},{"$f":"Generators_PL!H44","v":5440},7492.5000000000009,7344.0000000000009]
["20RCA-QS7","20RCA, 3 PH, 208V, cUL/US, CSA",20,70,{"$f":"F45*$J$3","v":0},{"$f":"Generators_PL!F45","v":6400},{"$f":"Generators_PL!G45","v":5715},{"$f":"Generators_PL!H45","v":5600},7715.2500000000009,7560.0000000000009]
["20RCA-QS8","20RCA, 3 PH, 240V, cUL/US, CSA",20,60,{"$f":"F46*$J$3","v":0},{"$f":"Generators_PL!F46","v":6400},{"$f":"Generators_PL!G46","v":5715},{"$f":"Generators_PL!H46","v":5600},7715.2500000000009,7560.0000000000009]
["20RCA-QS9","20RCA, 3 PH, 480V, cUL/US, CSA",20,30,{"$f":"F47*$J$3","v":0},{"$f":"Generators_PL!F47","v":6400},{"$f":"Generators_PL!G47","v":5715},{"$f":"Generators_PL!H47","v":5600},7715.2500000000009,7560.0000000000009]
["20RCAL-200SELS","20RCA, 1PH, 240V, cUL/CSA - Mossy Oak Break-Up Country",20,100,{"$f":"F48*$J$3","v":0},{"$f":"Generators_PL!F50","v":7205},{"$f":"Generators_PL!G50","v":6440},{"$f":"Generators_PL!H50","v":6310},8694,8518.5]
["20RESCL-200SELS","20RCA, 1PH, 240V, cUL/CSA - Mossy Oak Original Bottomland",20,100,{"$f":"F49*$J$3","v":0},{"$f":"Generators_PL!F51","v":7005},{"$f":"Generators_PL!G51","v":6275},{"$f":"Generators_PL!H51","v":6145},8471.25,8295.75]
["20RCA-QS10","20RCA, 1PH, 240V, cUL/CSA - Mossy Oak Break-Up Country",20,100,{"$f":"F50*$J$3","v":0},7930,6535,6405,8822.25,8646.75]
["20RCA-QS11","20RCA, 1PH, 240V, cUL/CSA - Mossy Oak Original Bottomland",20,100,{"$f":"F51*$J$3","v":0},7930,6535,6405,8822.25,8646.75]
["20RESC-QS15","20RESC, 1 PH, 240V, cUL/US, CSA",20,100,{"$f":"F52*$J$3","v":0},{"$f":"Generators_PL!F52","v":6000},{"$f":"Generators_PL!G52","v":5385},{"$f":"Generators_PL!H52","v":5275},7269.7500000000009,7121.2500000000009]
["20RESC-QS16","20RESC, 3 PH, 208V, cUL/US, CSA",20,70,{"$f":"F53*$J$3","v":0},{"$f":"Generators_PL!F53","v":6200},{"$f":"Generators_PL!G53","v":5550},{"$f":"Generators_PL!H53","v":5440},7492.5000000000009,7344.0000000000009]
["20RESC-QS17","20RESC, 3 PH, 240V, cUL/US, CSA",20,60,{"$f":"F54*$J$3","v":0},{"$f":"Generators_PL!F54","v":6200},{"$f":"Generators_PL!G54","v":5550},{"$f":"Generators_PL!H54","v":5440},7492.5000000000009,7344.0000000000009]
["26RCA-QS1 ","26RCA, 1 PH, 240V, cUL, CSA ",26,125,{"$f":"F55*$J$3","v":0},7935,6520,6390,8802,8626.5]
["26RCA-QS50","26RCA, 1 PH, 240V, cUL, CSA, Cold Weather Kit",26,125,{"$f":"F56*$J$3","v":0},8675,7130,6985,9625.5,9429.75]
["26RCA-QS5","26RCA, 1 PH, 240V, cUL, CSA,  Mossy Oak Shadow Grass Habitat",26,125,{"$f":"F57*$J$3","v":0},9135,7505,7355,10131.75,9929.25]
["26RCA-QS10  ","26RCA, 1 PH, 240V, cUL, CSA, Mossy Oak Break-Up Country",26,125,{"$f":"F58*$J$3","v":0},9135,7505,7355,10131.75,9929.25]
["26RCA-QS11 ","26RCA, 1 PH, 240V, cUL, CSA, Mossy Oak Original Bottomland",26,125,{"$f":"F59*$J$3","v":0},9135,7505,7355,10131.75,9929.25]
["26RCAL-200SELS ","26RCAL, RXT 200 Amp, SE, N3R, w/LOAD Man ",26,125,{"$f":"F60*$J$3","v":0},8940,7340,7195]
["LIQUID-COOLED AUTOMATIC STANDBY GENERATOR, NG/LP, Color: Kohler Cashmere"]
["Standard Features: UL2200/CSA, 60 Hz, Aluminum Sound Shield, Unit Mounted Radiator, Standard Air Intake, RDC2 Controller which includes a 2.5AMP Battery Charger, Flexible Fuel Lines, Coolant in generator, 45 C Cooling System and 5-Year Comprehensive Warranty, OnCue Plus"]
[]
["24RCLA-QS1","24RCLA, 1 PH, 240V, UL, CSA ",24,100,{"$f":"F64*$J$3","v":0},{"$f":"Generators_PL!F64","v":15675},{"$f":"Generators_PL!G64","v":12730},{"$f":"Generators_PL!H64","v":12475},{"$f":"G64*$K$5","v":17185.5},{"$f":"H64*$K$5","v":16841.25}]
["24RCLA-QS2","24RCLA, 3 PH, 208V, UL, CSA ",24,90,{"$f":"F65*$J$3","v":0},{"$f":"Generators_PL!F65","v":15675},{"$f":"Generators_PL!G65","v":12730},{"$f":"Generators_PL!H65","v":12475},17185.5,16841.25]
["24RCLA-QS3","24RCLA, 3 PH, 240V, UL, CSA",24,80,{"$f":"F66*$J$3","v":0},{"$f":"Generators_PL!F66","v":15675},{"$f":"Generators_PL!G66","v":12730},{"$f":"Generators_PL!H66","v":12475},17185.5,16841.25]
["24RCLA-QS4","24RCLA, 3 PH, 480V, UL, CSA",24,40,{"$f":"F67*$J$3","v":0},{"$f":"Generators_PL!F67","v":15675},{"$f":"Generators_PL!G67","v":12730},{"$f":"Generators_PL!H67","v":12475},17185.5,16841.25]
["24RCLA-QS50","24RCLA, 1 PH, 240V, UL, CSA, Blk Heater",24,100,{"$f":"F68*$J$3","v":0},{"$f":"Generators_PL!F68","v":16280},{"$f":"Generators_PL!G68","v":13225},{"$f":"Generators_PL!H68","v":12960},17853.75,17496]
["30RCLA-QS1","30RCLA, 1 PH, 240V, UL, CSA",30,150,{"$f":"F69*$J$3","v":0},{"$f":"Generators_PL!F69","v":17895},{"$f":"Generators_PL!G69","v":14535},{"$f":"Generators_PL!H69","v":14245},19622.25,19230.75]
["30RCLA-QS2","30RCLA, 3 PH, 208V, UL, CSA",30,125,{"$f":"F70*$J$3","v":0},{"$f":"Generators_PL!F70","v":17895},{"$f":"Generators_PL!G70","v":14535},{"$f":"Generators_PL!H70","v":14245},19622.25,19230.75]
["30RCLA-QS3","30RCLA, 3 PH, 240V, UL, CSA",30,100,{"$f":"F71*$J$3","v":0},{"$f":"Generators_PL!F71","v":17895},{"$f":"Generators_PL!G71","v":14535},{"$f":"Generators_PL!H71","v":14245},19622.25,19230.75]
["30RCLA-QS4","30RCLA, 3 PH, 480V, UL, CSA",30,50,{"$f":"F72*$J$3","v":0},{"$f":"Generators_PL!F72","v":17895},{"$f":"Generators_PL!G72","v":14535},{"$f":"Generators_PL!H72","v":14245},19622.25,19230.75]
["30RCLA-QS50","30RCLA, 1 PH, 240V, UL, CSA, Blk Heater",30,150,{"$f":"F73*$J$3","v":0},{"$f":"Generators_PL!F73","v":18455},{"$f":"Generators_PL!G73","v":14990},{"$f":"Generators_PL!H73","v":14690},20236.5,19831.5]
["LIQUID-COOLED AUTOMATIC STANDBY GENERATOR, NG/LP, Color: Kohler Cashmere"]
["Standard Features: UL2200/CSA, 60 Hz, Aluminum Sound Shield, Unit Mounted Radiator, Standard Air Intake, RDC2 Controller which includes a 2.5AMP Battery Charger, Flexible Fuel Lines, Coolant in generator, 45 C Cooling System and 5-Year Comprehensive Warranty, OnCue Plus"]
[]
["38RCLC-QS1","38RCLB, 1 PH, 240V, UL, CSA",38,175,{"$f":"F77*$J$3","v":0},{"$f":"Generators_PL!F77","v":19905},{"$f":"Generators_PL!G77","v":16170},{"$f":"Generators_PL!H77","v":15845},{"$f":"G77*$K$5","v":21829.5},{"$f":"H77*$K$5","v":21390.75}]
["38RCLC-QS2","38RCLB, 3 PH, 208V, UL, CSA",38,150,{"$f":"F78*$J$3","v":0},{"$f":"Generators_PL!F78","v":19905},{"$f":"Generators_PL!G78","v":16170},{"$f":"Generators_PL!H78","v":15845},21829.5,21390.75]
["38RCLC-QS3","38RCLB, 3 PH, 240V, UL, CSA",38,125,{"$f":"F79*$J$3","v":0},{"$f":"Generators_PL!F79","v":19905},{"$f":"Generators_PL!G79","v":16170},{"$f":"Generators_PL!H79","v":15845},21829.5,21390.75]
["38RCLC-QS4","38RCLB, 3 PH, 480V, UL, CSA",38,60,{"$f":"F80*$J$3","v":0},{"$f":"Generators_PL!F80","v":19905},{"$f":"Generators_PL!G80","v":16170},{"$f":"Generators_PL!H80","v":15845},21829.5,21390.75]
["38RCLC-QS50","38RCLB, 1 PH, 240V, UL, CSA, Blk Heater",38,175,{"$f":"F81*$J$3","v":0},{"$f":"Generators_PL!F81","v":20475},{"$f":"Generators_PL!G81","v":16635},{"$f":"Generators_PL!H81","v":16300},22457.25,22005]
["48RCLC-QS5","48RCLC, 1 PH, 240V, UL, CSA",48,200,{"$f":"F82*$J$3","v":0},{"$f":"Generators_PL!F82","v":22715},{"$f":"Generators_PL!G82","v":18450},{"$f":"Generators_PL!H82","v":18080},24907.5,24408]
["48RCLC-QS6","48RCLC, 3 PH, 208V, UL, CSA",48,175,{"$f":"F83*$J$3","v":0},{"$f":"Generators_PL!F83","v":22715},{"$f":"Generators_PL!G83","v":18450},{"$f":"Generators_PL!H83","v":18080},24907.5,24408]
["48RCLC-QS7","48RCLC, 3 PH, 240V, UL, CSA",48,150,{"$f":"F84*$J$3","v":0},{"$f":"Generators_PL!F84","v":22715},{"$f":"Generators_PL!G84","v":18450},{"$f":"Generators_PL!H84","v":18080},24907.5,24408]
["48RCLC-QS8","48RCLC, 3 PH, 480V, UL, CSA",48,80,{"$f":"F85*$J$3","v":0},{"$f":"Generators_PL!F85","v":22715},{"$f":"Generators_PL!G85","v":18450},{"$f":"Generators_PL!H85","v":18080},24907.5,24408]
["48RCLC-QS51","48RCLC, 1 PH, 240V, UL, CSA, Blk Heater",48,200,{"$f":"F86*$J$3","v":0},{"$f":"Generators_PL!F86","v":23290},{"$f":"Generators_PL!G86","v":18920},{"$f":"Generators_PL!H86","v":18540},25542,25029]
["60RCLB-QS5","60RCLB, 1 PH, 240V, UL, CSA",60,250,{"$f":"F87*$J$3","v":0},{"$f":"Generators_PL!F87","v":27865},{"$f":"Generators_PL!G87","v":22635},{"$f":"Generators_PL!H87","v":22180},30557.250000000004,29943.000000000004]
["60RCLB-QS6","60RCLB, 3 PH, 208V, UL, CSA",60,225,{"$f":"F88*$J$3","v":0},{"$f":"Generators_PL!F88","v":27865},{"$f":"Generators_PL!G88","v":22635},{"$f":"Generators_PL!H88","v":22180},30557.250000000004,29943.000000000004]
["60RCLB-QS7","60RCLB, 3 PH, 240V, UL, CSA",60,200,{"$f":"F89*$J$3","v":0},{"$f":"Generators_PL!F89","v":27865},{"$f":"Generators_PL!G89","v":22635},{"$f":"Generators_PL!H89","v":22180},30557.250000000004,29943.000000000004]
["60RCLB-QS8","60RCLB, 3 PH, 480V, UL, CSA",60,100,{"$f":"F90*$J$3","v":0},{"$f":"Generators_PL!F90","v":27865},{"$f":"Generators_PL!G90","v":22635},{"$f":"Generators_PL!H90","v":22180},30557.250000000004,29943.000000000004]
["60RCLB-QS51","60RCLB, 1 PH, 240V, UL, CSA, Blk Heater",60,250,{"$f":"F91*$J$3","v":0},{"$f":"Generators_PL!F91","v":28515},{"$f":"Generators_PL!G91","v":23165},{"$f":"Generators_PL!H91","v":22700},31272.750000000004,30645.000000000004]
["LIQUID-COOLED AUTOMATIC STANDBY GENERATOR, NATURAL GAS, Color: Kohler Cashmere"]
["Standard Features: UL2200/CSA, Sound Shield, 45C Unit Mounted Radiator, Standard Air Intake, APM402 Controller, Flexible Fuel Lines, 12V-6A Battery Charger, Additional Gas Solenoid Valve, Rodent Guards, Silencer, Coolant in generator, Block Heater installed and 5-Year Basic Warranty"]
[]
["KG80R-QS","KG80R, 1 PH, 120/240, 4T9X Alternator, Steel Enclosure",80,350,{"$f":"F95*$J$3","v":0},{"$f":"Generators_PL!F95","v":33945},{"$f":"Generators_PL!G95","v":27330},{"$f":"Generators_PL!H95","v":26785},{"$f":"G95*$K$5","v":36895.5},{"$f":"H95*$K$5","v":36159.75}]
["KG80R-QS1","KG80R, 1 PH, 120/240, 4T9X Alternator, Aluminum Enclosure",80,350,{"$f":"F96*$J$3","v":0},{"$f":"Generators_PL!F96","v":35355},{"$f":"Generators_PL!G96","v":28465},{"$f":"Generators_PL!H96","v":27895},38427.75,37658.25]
["KG80R-QS2","KG80R, 3 Ph, 120/208, 4R9X Alternator, Steel Enclosure",80,300,{"$f":"F97*$J$3","v":0},{"$f":"Generators_PL!F97","v":33955},{"$f":"Generators_PL!G97","v":27335},{"$f":"Generators_PL!H97","v":26790},36902.25,36166.5]
["KG80R-QS3","KG80R, 3 Ph, 120/240, 4R9X Alternator, Steel Enclosure",80,250,{"$f":"F98*$J$3","v":0},{"$f":"Generators_PL!F98","v":33955},{"$f":"Generators_PL!G98","v":27335},{"$f":"Generators_PL!H98","v":26790},36902.25,36166.5]
["KG80R-QS4","KG80R, 3 Ph, 277/480, 4R9X Alternator, Steel Enclosure",80,125,{"$f":"F99*$J$3","v":0},{"$f":"Generators_PL!F99","v":33955},{"$f":"Generators_PL!G99","v":27335},{"$f":"Generators_PL!H99","v":26790},36902.25,36166.5]
["KG80R-QS5","KG80R, 3 Ph, 120/208, 4R9X Alternator, Aluminum Enclosure",80,300,{"$f":"F100*$J$3","v":0},{"$f":"Generators_PL!F100","v":35385},{"$f":"Generators_PL!G100","v":28490},{"$f":"Generators_PL!H100","v":27920},38461.5,37692]
["KG80R-QS6","KG80R, 1 PH, 120/240, 4T9X Alternator, Steel Enclosure, w/Catalyst, CA/MA Compliant",80,350,{"$f":"F101*$J$3","v":0},{"$f":"Generators_PL!F101","v":36035},{"$f":"Generators_PL!G101","v":29010},{"$f":"Generators_PL!H101","v":28430},39163.5,38380.5]
["KG80R-QS7","KG80R, 1 PH, 120/240, 4T9X Alternator, Aluminum Enclosure, w/Catalyst, CA/MA Compliant",80,350,{"$f":"F102*$J$3","v":0},{"$f":"Generators_PL!F102","v":37410},{"$f":"Generators_PL!G102","v":30115},{"$f":"Generators_PL!H102","v":29515},40655.25,39845.25]
["KG80R-QS8","KG80R, 3 Ph, 120/208, 4R9X Alternator, Steel Enclosure, w/Catalyst, CA/MA Compliant",80,300,{"$f":"F103*$J$3","v":0},{"$f":"Generators_PL!F103","v":36010},{"$f":"Generators_PL!G103","v":28990},{"$f":"Generators_PL!H103","v":28410},39136.5,38353.5]
["KG80R-QS20","KG80R, 1PH, 120/240, 4T9X Alternator, Aluminum Enclosure, Auto Dual Fuel",80,300,{"$f":"F104*$J$3","v":0},{"$f":"Generators_PL!F104","v":35945},{"$f":"Generators_PL!G104","v":28927.82},{"$f":"Generators_PL!H104","v":28360.61},39052.557000000001,38286.823500000006]
["KG80R-QS21","KG80R, 1PH, 120/240, 4T9X Alternator, Aluminum Enclosure, Auto Dual Fuel, CA/MA Compliant",80,300,{"$f":"F105*$J$3","v":0},{"$f":"Generators_PL!F105","v":37355},{"$f":"Generators_PL!G105","v":30062.560000000001},{"$f":"Generators_PL!H105","v":29473.1},40584.456000000006,39788.684999999998]
["KG100R-QS","KG100R, 1 PH, 120/240, 4T13X Alternator, Steel Enclosure, CA/MA Compliant",100,600,{"$f":"F106*$J$3","v":0},{"$f":"Generators_PL!F106","v":39290},{"$f":"Generators_PL!G106","v":31635},{"$f":"Generators_PL!H106","v":31000},42707.25,41850]
["KG100R-QS1","KG100R, 1 PH, 120/240, 4T13X Alternator, Aluminum Enclosure, CA/MA Compliant",100,600,{"$f":"F107*$J$3","v":0},{"$f":"Generators_PL!F107","v":40675},{"$f":"Generators_PL!G107","v":32750},{"$f":"Generators_PL!H107","v":32095},44212.5,43328.25]
["KG100R-QS2","KG100R, 3 Ph, 120/208, 4R12X Alternator, Steel Enclosure, CA/MA Compliant",100,350,{"$f":"F108*$J$3","v":0},{"$f":"Generators_PL!F108","v":39290},{"$f":"Generators_PL!G108","v":31635},{"$f":"Generators_PL!H108","v":31000},42707.25,41850]
["KG100R-QS3","KG100R, 3 Ph, 120/240, 4R12X Alternator, Steel Enclosure, CA/MA Compliant",100,300,{"$f":"F109*$J$3","v":0},{"$f":"Generators_PL!F109","v":39290},{"$f":"Generators_PL!G109","v":31635},{"$f":"Generators_PL!H109","v":31000},42707.25,41850]
["KG100R-QS4","KG100R, 3 Ph, 277/480, 4R12X Alternator, Steel Enclosure, CA/MA Compliant",100,150,{"$f":"F110*$J$3","v":0},{"$f":"Generators_PL!F110","v":39290},{"$f":"Generators_PL!G110","v":31635},{"$f":"Generators_PL!H110","v":31000},42707.25,41850]
["KG100R-QS5","KG100R, 3 Ph, 120/208, 4R12X Alternator, Aluminum Enclosure, CA/MA Compliant",100,350,{"$f":"F111*$J$3","v":0},{"$f":"Generators_PL!F111","v":40675},{"$f":"Generators_PL!G111","v":32750},{"$f":"Generators_PL!H111","v":32095},44212.5,43328.25]
["KG100R-QS6","KG100R, 3Ph,  600V, Aluminum Enclosure, 12V Run Relay, 2/5 IO",100,125,{"$f":"F112*$J$3","v":0},40675,32750,32095,44212.5,43328.25]
["KG100R-QS20","KG100R, 1PH, 120/240, 4T9X Alternator, Aluminum, Auto Dual Fuel, CA/MA Compliant",100,350,{"$f":"F113*$J$3","v":0},{"$f":"Generators_PL!F113","v":41290},{"$f":"Generators_PL!G113","v":33229.370000000003},{"$f":"Generators_PL!H113","v":32577.81},44859.649500000007,43980.043500000007]
["LIQUID-COOLED AUTOMATIC STANDBY GENERATOR, NATURAL GAS, Color: Kohler Cashmere"]
["Standard Features: UL2200/CSA, Sound Shield, 45C Unit Mounted Radiator, Standard Air Intake, APM402 Controller, Flexible Fuel Lines, 12V-6A Battery Charger, Additional Gas Solenoid Valve, Rodent Guards, Silencer, Coolant in generator, Block Heater installed and 5-Year Basic Warranty"]
[]
["KG125R-QS","KG125R, 1 PH, 120/240, 4T13X Alternator, Steel Enclosure",125,600,{"$f":"F117*$J$3","v":0},{"$f":"Generators_PL!F117","v":41515},{"$f":"Generators_PL!G117","v":33040},{"$f":"Generators_PL!H117","v":32380},{"$f":"G117*$K$5","v":44604},{"$f":"H117*$K$5","v":43713}]
["KG125R-QS1","KG125R, 1 PH, 120/240, 4T13X Alternator, Aluminum Enclosure",125,600,{"$f":"F118*$J$3","v":0},{"$f":"Generators_PL!F118","v":42950},{"$f":"Generators_PL!G118","v":34185},{"$f":"Generators_PL!H118","v":33500},46149.75,45225]
["KG125R-QS2","KG125R, 3 Ph, 120/208, 4R13X Alternator, Steel Enclosure",125,600,{"$f":"F119*$J$3","v":0},{"$f":"Generators_PL!F119","v":41515},{"$f":"Generators_PL!G119","v":33040},{"$f":"Generators_PL!H119","v":32380},44604,43713]
["KG125R-QS3","KG125R, 3 Ph, 120/240, 4R13X Alternator, Steel Enclosure",125,400,{"$f":"F120*$J$3","v":0},{"$f":"Generators_PL!F120","v":41515},{"$f":"Generators_PL!G120","v":33040},{"$f":"Generators_PL!H120","v":32380},44604,43713]
["KG125R-QS4","KG125R, 3 Ph, 277/480, 4R13X Alternator, Steel Enclosure",125,200,{"$f":"F121*$J$3","v":0},{"$f":"Generators_PL!F121","v":41515},{"$f":"Generators_PL!G121","v":33040},{"$f":"Generators_PL!H121","v":32380},44604,43713]
["KG125R-QS5","KG125R, 3 Ph, 120/208, 4R13X Alternator, Aluminum Enclosure",125,600,{"$f":"F122*$J$3","v":0},{"$f":"Generators_PL!F122","v":42950},{"$f":"Generators_PL!G122","v":34185},{"$f":"Generators_PL!H122","v":33500},46149.75,45225]
["150ERESC-QS8","150ERESC, 1 PH, 120/240, 4T13X Alternator, Steel Enclosure",150,600,{"$f":"F123*$J$3","v":0},{"$f":"Generators_PL!F123","v":46540},{"$f":"Generators_PL!G123","v":37185},{"$f":"Generators_PL!H123","v":36440},50199.75,49194]
["150ERESC-QS9","150ERESC, 1 PH, 120/240, 4T13X Alternator, Aluminum Enclosure",150,600,{"$f":"F124*$J$3","v":0},{"$f":"Generators_PL!F124","v":47860},{"$f":"Generators_PL!G124","v":38240},{"$f":"Generators_PL!H124","v":37475},51624,50591.25]
["150ERESC-QS10","150ERESC, 3 Ph, 120/208, 4S13X Alternator, Aluminum  Enclosure",150,600,{"$f":"F125*$J$3","v":0},{"$f":"Generators_PL!F125","v":47860},{"$f":"Generators_PL!G125","v":38240},{"$f":"Generators_PL!H125","v":37475},51624,50591.25]
["150ERESC-QS11","150ERESC, 3Ph,  600V, Aluminum Enclosure, 12V Run Relay, 2/5 IO",150,225,{"$f":"F126*$J$3","v":0},47860,38240,37475,51624,50591.25]
["150ERESC-MV10","150ERESC, 3 Ph, 120/208, 4S13X Alternator, Steel Enclosure",150,600,{"$f":"F127*$J$3","v":0},{"$f":"Generators_PL!F127","v":46560},{"$f":"Generators_PL!G127","v":37200},{"$f":"Generators_PL!H127","v":36455},50220,49214.25]
["150ERESC-MV11","150ERESC, 3 Ph, 120/240, 4S13X Alternator, Steel Enclosure",150,600,{"$f":"F128*$J$3","v":0},{"$f":"Generators_PL!F128","v":46560},{"$f":"Generators_PL!G128","v":37200},{"$f":"Generators_PL!H128","v":36455},50220,49214.25]
["150ERESC-MV12","150ERESC, 3 Ph, 277/480. 4S13X Alternator, Steel Enclosure",150,250,{"$f":"F129*$J$3","v":0},{"$f":"Generators_PL!F129","v":46560},{"$f":"Generators_PL!G129","v":37200},{"$f":"Generators_PL!H129","v":36455},50220,49214.25]

{"sheet":"GENSET_ACCY_6-20kW","index":2,"n_rows":58,"n_cols":19,"rows_kept":58,"cut":false,"hidden":false,"merged":[]}
[615,null,null,null,null,null,null,null,null,null,null,null,null,null,null,null,null,null,{"$f":"Generators_PL!H1","v":"Residential Price List"}]
[null,null,null,null,null,null,null,null,null,null,null,null,null,null,null,null,null,null,{"$f":"Generators_PL!H2","v":"EFFECTIVE DATE: 05/01/2023"}]
[null,null,null,null,null,null,null,null,null,null,null,null,null,null,null,null,null,null,{"$f":"Generators_PL!H3","v":"Pricing is in USD"}]
[null,null,null,null,{"$f":"Generators_PL!F4","v":0}]
[null,null,"Please click on the following link to access Accessory Kit Pricing",":AMP STOCK ORDERS"]
["OLD PART NUMBER (superseded by the New Part Number starting on 4/3/2023)","NEW PART NUMBER ","Description","Net Price","Aftermarket Parts \nList Price","MSRP","MAP","6VSG","8.5RES","12RES","8/10/12RESV(L)","8RESV(L)","10/12RESV(L)","14RES(L)","14RCA(L)","14RESA(L)","20RCA(L)","20RESC(L)","26RCA(L)"]
["RESIDENTIAL AIR COOLED GENSET PARTS & ACCESSORIES PRICE LIST"]
[]
["GM85144-KP1-QS","GM85144-1","PowerSync® Automatic Paralleling Module (APM)",{"$f":"E9*E$4","v":0},3150,null,null,null,null,null,null,null,null,"X","X","X","X","X"]
["GM86368-KP1-QS","GM86368-S1","Circuit Breaker Kit - 14Kw (70 Amp)",0,125,null,null,null,null,null,null,null,null,"X","X","X"]
["GM86369-KP1-QS","GM86369-S1","Circuit Breaker Kit - 20kW (100 Amp)",0,160,null,null,null,null,null,null,null,null,null,null,null,"X","X"]
["GM92001-KP1-QS","GM92001-1","Power Relay Module (PRM)",0,160,null,null,null,null,null,"X",null,null,"X","X","X","X","X"]
["GM81529-KP1-QS","GM81529-S1"," Programmable Interface Module (PIM) (UL)",0,390,null,null,null,null,null,"X",null,null,"X","X","X","X","X"]
["GM81529-KP2-QS","GM81529-S2"," Programmable Interface Module (PIM) (CSA)",0,390,null,null,null,null,null,"X",null,null,"X","X","X","X","X"]
["GM17250-KP1-QS","GM17250-S1"," 400 Amp Current Transformer – Larger Inner Diameter\n(for use with LCM or Load Shed kit, if required)",0,187,null,null,null,null,null,"X",null,null,"X","X","X","X","X"]
["GM114539-KP1-QS","GM114539-S1","OnCue Plus- Wireless Radio Kit",0,210,null,null,"X",null,null,"X","X","X","X","X","X","X","X"]
["GM19462-KP4-QS","GM19462-S4","Carburetor Heater 120V",0,189,null,null,"X","X","X",null,null,null,"X","X","X"]
["GM19462-KP3-QS","GM19462-S3","Carburetor Heater, 240V",0,218,null,null,null,null,null,null,null,null,"X","X","X"]
["GM57969-KP5-QS","GM57969-S","Carburetor Heater, 40W, 120V",0,189,null,null,null,null,null,"X",null,null,null,null,null,"X","X"]
["GM57969-KP3-QS","GM57969-S3","Carburetor Heater, 240V",0,189,null,null,null,null,null,null,null,null,null,null,null,"X","X"]
["GM79141-KP3-QS","GM79141-S","Fuel Regulator Heater, 120V",0,311,null,null,null,null,null,null,null,null,null,null,null,"X","X"]
["GM79141-KP2-QS","GM79141-S2","Fuel Regulator Heater, 240V",0,311,null,null,null,null,null,null,null,null,null,null,null,"X","X"]
["GM92406-KP3-QS","GM92406-S3","Battery Heater, 120V",0,255,null,null,null,null,"X","X",null,null,"X","X",null,"X","X"]
["GM92406-KP2-QS","GM92406-S2","Battery Heater, 240V",0,275,null,null,null,null,null,null,null,null,"X",null,null,"X","X"]
["GM75513-KP1","GM106374-S","Battery Group Size 51  500CCA",0,158,null,null,"X",null,"X","X",null,null,null,"X","X","X","X"]
["GM48808-KP1","GM106369-S","Battery Group Size 26  500CCA",0,141.84120000000001,null,null,null,"X","X"]
["GM101615-KP1-QS","GM101615-S1","Alternator Brush Cover",0,23,null,null,null,null,null,null,null,null,null,"X","X","X","X"]
["GM102176-KP1-QS","GM102176-S1","Pressure Sensor Cover",0,7,null,null,null,null,null,null,null,null,"X","X","X","X","X"]
["GM110949-KP1-QS","GM110949-S1","Breather Tube Heater/Oil Heater Kit, 120V (14 kW)",0,356,null,null,null,null,null,null,null,null,null,"X","X"]
["GM110949-KP2-QS","GM110949-S2","Breather Tube Heater/Oil Heater Kit, 120V (20 kW)",0,336,null,null,null,null,null,null,null,null,null,null,null,"X","X"]
["GM110948-KP1-QS","GM110948-S1","Cold Weather Package Kit, 120V (14kW)",0,590,null,null,null,null,null,null,null,null,null,"X","X"]
["GM110948-KP2-QS","GM110948-S2","Cold Weather Package Kit, 120V (20kW)",0,640,null,null,null,null,null,null,null,null,null,null,null,"X","X"]
[null,"GM110948-S3","Cold Weather Package Kit, 120V (26kW)",null,670,null,null,null,null,null,null,null,null,null,null,null,null,null,"X"]
[null,"GM119028-S1","120V Battery Heater Kit",null,40.89,null,null,null,null,null,null,null,null,null,null,null,null,null,"X"]
[null,"GM119027-S1","Flex Fuel Line",null,159.31,null,null,null,null,null,null,null,null,null,null,null,null,null,"X"]
["GM107377-KP-QS","GM107377-S","Vent Tube Plug Kit",0,18,null,null,null,null,null,null,null,null,null,null,null,null,"X"]
["GM85224-KP1-QS","GM85224-S1"," Oil Makeup Kit",0,400,null,null,"X"]
["GM85409-KP1-QS","GM85409-S1"," Spark Arrestor - USFS Approved",0,28,null,null,"X"]
["GM90095-KP1-QS","GM90095-S1","Emergency Stop - Composite Enclosure: Non-locking",0,65,null,null,null,null,null,null,null,null,null,null,"X",null,"X"]
["GM103279-KP1-QS","GM103279-S1","Lockable Emergency Stop - Remote Mounting",0,131,null,null,null,null,null,"X",null,null,"X","X","X","X","X"]
["GM113935-KP1-QS","GM113935-S2","Lockable Emergency Stop - Enclosure Mounting",0,131,null,null,null,null,null,"X","X","X","X","X","X","X","X"]
["GM92228-KP1-QS","No Change ","3\" Concrete Mounting Pad (only comes in quantities of 5)   SHIPS WITHIN US ONLY",{"$f":"E42*$E$4","v":0},225,185.39999999999998,178.20000000000002,null,null,null,null,null,"X"]
["GM92228-KP2-QS","No Change ","4\" Concrete Mounting Pad (only comes in quantities of 5)   SHIPS WITHIN US ONLY",0,280,230.72,221.76000000000002,null,null,null,null,null,"X"]
["GM90969-KP1-QS","No Change ","3\" Concrete Mounting Pad (only comes in quantities of 5)   SHIPS WITHIN US ONLY",0,243,200.232,192.45600000000002,null,null,null,null,null,null,null,null,"X",null,"X"]
["GM90969-KP2-QS","No Change ","4\" Concrete Mounting Pad (only comes in quantities of 5)   SHIPS WITHIN US ONLY",0,291,239.78399999999999,230.47200000000001,null,null,null,null,null,null,null,null,"X",null,"X"]
["GM104820-KP1-QS","No Change ","3\" Concrete Mounting Pad (only comes in quantities of 5)   SHIPS WITHIN US ONLY",{"$f":"E46*$E$4","v":0},243,200.232,192.45600000000002,null,null,null,null,null,null,null,"X",null,"X"]
["GM104820-KP2-QS","No Change ","4\" Concrete Mounting Pad (only comes in quantities of 5)   SHIPS WITHIN US ONLY",0,291,239.78399999999999,230.47200000000001,null,null,null,null,null,null,null,"X",null,"X"]
["GM90365-SKP1-QS","GM90365","Maintenance Kit – SV620 (8RESV/L Kit)",{"$f":"E48*E$4","v":0},71,null,null,null,null,null,null,"X"]
["GM90366-SKP1-QS","GM90366","Maintenance Kit – KT725 (10/12RESV/L Kit)",0,87,null,null,null,null,null,null,null,"X"]
["GM62345-SKP1-QS","GM62345","Maintenance Kit – CH640",0,93,null,null,null,"X"]
["GM62346-SKP1-QS","GM62346","Maintenance Kit – CH740",0,85.2,null,null,"X",null,"X",null,null,null,"X","X","X"]
["GM62347-SKP1-QS","GM62347","Maintenance Kit – CH1000",0,102,null,null,null,null,null,null,null,null,null,null,null,"X","X"]
["GM94923","No Change ","RESV Display Unit",0,940]
["GM109323","No Change ","RCA Display Unit",0,1005]
["GM32333-KP7-QS","GM32333-S2","Harness, 25', Remote Panel",{"$f":"E55*E$4","v":0},419.83]
["GM32333-KP8-QS","GM32323-S8","Harness, 100'  Remote Panel",0,0]
["GM118073","No Change ","7 Year Comprehensive Warranty",0,695,{"$f":"VLOOKUP($A57,'[2]CURRENT PRICING'!$B:$F,4,FALSE)","v":750},{"$f":"VLOOKUP($A57,'[2]CURRENT PRICING'!$B:$F,5,FALSE)","v":750},"X","X","X","X","X","X","X","X","X","X","X"]
["GM118074","No Change ","10 Year Comprehensive Warranty",0,995,{"$f":"VLOOKUP($A58,'[2]CURRENT PRICING'!$B:$F,4,FALSE)","v":1050},{"$f":"VLOOKUP($A58,'[2]CURRENT PRICING'!$B:$F,5,FALSE)","v":1050},"X","X","X","X","X","X","X","X","X","X","X"]

{"sheet":"GENSET_ACCY_24-150kW","index":3,"n_rows":41,"n_cols":16,"rows_kept":41,"cut":false,"hidden":false,"merged":[]}
[null,null,null,null,null,null,null,null,null,null,null,null,null,null,null,{"$f":"Generators_PL!H1","v":"Residential Price List"}]
[null,null,null,null,null,null,null,null,null,null,null,null,null,null,null,{"$f":"Generators_PL!H2","v":"EFFECTIVE DATE: 05/01/2023"}]
[null,null,null,null,null,null,null,null,null,null,null,null,null,null,null,{"$f":"Generators_PL!H3","v":"Pricing is in USD"}]
[null,null,null,null,{"$f":"Generators_PL!F4","v":0}]
[null,null,"Please click on the following link to access Accessory Kit Pricing",":AMP STOCK ORDERS"]
["OLD PART NUMBER (superseded by the New Part Number starting on 4/3/2023)","NEW PART NUMBER ","Description","Net Price","Aftermarket Parts \nList Price","MSRP","MAP","24RCL","30RCL","38RCLB","48RCL/RCLA/RCLB","60RCL/60RCLA","KG80R","KG100R","KG125R","150ERESC"]
["RESIDENTIAL LIQUID COOLED GENSET PARTS & ACCESSORIES PRICE LIST"]
[]
[null,"GM115956-S1","48/60 RCL Auto Dual fuel Changeover Kit",{"$f":"E9*$E$4","v":0},709.3,null,null,null,null,null,"X","X"]
["GM81529-KP1-QS","GM81529-S1"," Programmable Interface Module (PIM) (UL)",0,390,null,null,"X","X","X","X","X"]
["GM81529-KP2-QS","GM81529-S2"," Programmable Interface Module (PIM) (CSA)",0,390,null,null,"X","X","X","X","X"]
["GM92001-KP1-QS","GM92001-1","Power Relay Module (PRM)",0,160,null,null,"X","X","X","X","X"]
["GM17250-KP1-QS","GM17250-S1"," 400 Amp Current Transformer – Larger Inner Diameter\n(for use with LCM or Load Shed kit, if required)",0,187,null,null,"X","X","X","X"]
["GM17250-KP2-QS","GM17250-S2"," 500 Amp Current Transformer \n(for use with LCM or Load Shed kit, if required)",0,187,null,null,null,null,null,null,"X"]
["GM114539-KP1-QS","GM114539-S1","OnCue Plus- Wireless Radio Kit",0,210,null,null,"X","X","X","X","X"]
["GM104703-KP1","GM104703-S1","Battery Heater, 120V, 65W",0,187.9930677763771,null,null,"X","X","X","X","X","X","X","X","X"]
["GM89020-KP1","GM106373-S","Battery Group Size 24  650CCA",0,174.44,null,null,"X","X","X","X","X"]
["GM90235-KP1-QS","GM90235-S1","Block Heater, 500W, 120V",0,115,null,null,"X","X","X"]
["GM90235-KP2","GM90235-S2","Block Heater, 500W, 240V",0,115,null,null,"X","X","X"]
["GM78529-KP1-QS","GM78529-S1","Block Heater, 1500W, 120V",0,115,null,null,null,null,null,"X","X"]
["GM78529-KP2","GM78529-S2","Block Heater, 1500W, 240V",0,115,null,null,null,null,null,"X","X"]
["GM78171-KP1","GM78171-S1","Crankcase Vent Heater Kit",0,1128.6199999999999,null,null,null,null,null,null,null,null,null,null,"X"]
["GM93357-KP1-QS","GM93357-S2","Oil Pan Heater - 120V",0,150,null,null,"X","X","X"]
["GM93357-KP2","GM93357-S1","Oil Pan Heater - 240V",0,150,null,null,"X","X","X"]
["GM103279-KP1-QS","GM103279-S1","Lockable Emergency Stop - Remote Mounting",0,131,null,null,"X","X","X","X","X","X","X","X","X"]
["GM113935-KP2-QS","GM113935-S2","Lockable Emergency Stop - Enclosure Mounting",0,131,null,null,"X","X","X","X","X"]
["GM91356-KP1","GM91356-S1","REMOTE ANNUNCIATOR",0,1035.0416507301434,null,null,null,null,null,null,null,"X","X","X","X"]
["GM91356-KP2","GM91356-S2","REMOTE ANNUNCIATOR W/ ATS",0,1197.7381475518052,null,null,null,null,null,null,null,"X","X","X","X"]
["GM91356-KP3","GM91356-S3","REMOTE ANNUNCIATOR W/ 4 ATS",0,1292.470294139611,null,null,null,null,null,null,null,"X","X","X","X"]
["GM62466-KP1","GM62466-S1","REMOTE ANNUNCIATOR POWER SUPPLY",0,60,null,null,null,null,null,null,null,"X","X","X","X"]
["GM41143-KP2","GM41143-S2","CONVERTER, MODBUS/ETHERNET",0,641.01314675419769,null,null,null,null,null,null,null,"X","X","X","X"]
["PA-343303","PA-343303","Gaseous filter",0,165,null,null,null,null,null,null,null,"X","X","X","X"]
["GM93396-SKP1-QS","GM93396","Maintenance Kit – 2.2L",0,123,null,null,"X","X","X"]
["GM86771-SKP1-QS","GM86771","Maintenance Kit – 4.3L",0,90,null,null,null,null,"X"]
["GM83718-SKP1-QS","GM83718","Maintenance Kit – 5.0L",0,127,null,null,null,null,null,"X"]
["GM89979-SKP1-QS","GM89979","Maintenance Kit – 5.7L",0,140.19999999999999,null,null,null,null,null,null,"X"]
["GM106686-SKP1-QS","GM106686-S","Maintenance Kit - 6.2L",0,190,null,null,null,null,null,"X","X"]
[221886,"No Change ","5 Year Comprehensive Warranty",{"$f":"E38*$E$4","v":0},703,null,null,null,null,null,null,null,"X","X"]
[221887,"No Change ","5 Year Comprehensive Warranty",0,1452,null,null,null,null,null,null,null,null,null,"X","X"]
["GM118078","No Change ","7 Year Comprehensive Warranty",0,995,{"$f":"VLOOKUP($A40,'[2]CURRENT PRICING'!$B:$F,4,FALSE)","v":1095},{"$f":"VLOOKUP($A40,'[2]CURRENT PRICING'!$B:$F,5,FALSE)","v":1095},"X","X","X","X","X"]
["GM118079","No Change ","10 Year Comprehensive Warranty",0,1395,{"$f":"VLOOKUP($A41,'[2]CURRENT PRICING'!$B:$F,4,FALSE)","v":1495},{"$f":"VLOOKUP($A41,'[2]CURRENT PRICING'!$B:$F,5,FALSE)","v":1495},"X","X","X","X","X"]

{"sheet":"PORTABLES_PL","index":4,"n_rows":68,"n_cols":22,"rows_kept":68,"cut":false,"hidden":true,"merged":[[5,1,5,3],[5,14,5,16],[5,10,5,12]]}
[null,null,null,null,null,null,null,null,null,null,null,null,null,null,null,null,null,null,null,null,null,{"$f":"[3]Generators_PL!H1","v":"Residential Price List"}]
[null,null,null,null,null,null,null,null,null,null,null,null,null,null,null,null,null,null,null,null,null,{"$f":"Generators_PL!H2","v":"EFFECTIVE DATE: 05/01/2023"}]
[null,null,null,null,null,null,null,null,null,null,null,null,null,null,null,null,null,null,null,null,null,{"$f":"[3]Generators_PL!H3","v":"Pricing is in USD"}]
[]
["*denotes new or updated models"]
[null,"Certifications",null,null,null,null,null,null,null,null,"Size (in.)",null,null,null,"Plugs"]
["Specification #","EPA","CARB","CSA","Description","Rated\n(kW)","Running\n(kW)","Fuel\nTank\nSize\n(Gal)","GFCI","Weight","L","W","H","Low Oil\nShutdown","USB Plug","AC Plug","DC Plug","Pallet\nQty","Net Price","Available Quantity             (as of 10/20/22)","Special Exit Price                 (no additional multipliers/ discounts applies)","SRP                     "]
["PORTABLE GENSETS: 50-State ARB/EPA"]
[]
["PA-eGen18iS-3001","x","x","x","Portables Inverter 1800W Solar Charge ",1.8,1.44,"N/A","Y",116,22,18,26,"N/A",2,2,2,8,{"$f":"IF(ISERROR(VLOOKUP($J10,[3]INPUTS!$H:$I,2,FALSE)),INDEX('[3]CURRENT PRICING'!$A:$U,MATCH($A10,'[3]CURRENT PRICING'!$B:$B,0),MATCH([3]Generators_PL!$H$1,'[3]CURRENT PRICING'!$11:$11,0)),VLOOKUP($J10,[3]INPUTS!$H:$I,2,FALSE))","v":944.32500000000005},{"$f":"VLOOKUP($A10,'[3]CURRENT PRICING'!$B:$F,3,FALSE)","v":1399},{"$f":"VLOOKUP($A10,'[3]CURRENT PRICING'!$B:$F,4,FALSE)","v":1329},{"$f":"VLOOKUP($A10,'[3]CURRENT PRICING'!$B:$F,5,FALSE)","v":1199}]
["PA-GEN50-3003","x","x","x","5.0kW Portable with Mobility Kit",5,4.3,8,"N",189,31,23,24,"Y","N/A",5,"N/A",6,{"$f":"IF(ISERROR(VLOOKUP($J11,[3]INPUTS!$H:$I,2,FALSE)),INDEX('[3]CURRENT PRICING'!$A:$U,MATCH($A11,'[3]CURRENT PRICING'!$B:$B,0),MATCH([3]Generators_PL!$H$1,'[3]CURRENT PRICING'!$11:$11,0)),VLOOKUP($J11,[3]INPUTS!$H:$I,2,FALSE))","v":741.82500000000005},{"$f":"VLOOKUP($A11,'[3]CURRENT PRICING'!$B:$F,3,FALSE)","v":1099},{"$f":"VLOOKUP($A11,'[3]CURRENT PRICING'!$B:$F,4,FALSE)","v":899},{"$f":"VLOOKUP($A11,'[3]CURRENT PRICING'!$B:$F,5,FALSE)","v":849}]
["PA-GEN50-3102","x","x","x","5.0kW Portable w Mobility Kit, CO Monitor",5,4.3,8,"N",189,31,23,24,"Y","N/A",5,"N/A",6,{"$f":"IF(ISERROR(VLOOKUP($J12,[3]INPUTS!$H:$I,2,FALSE)),INDEX('[3]CURRENT PRICING'!$A:$U,MATCH($A12,'[3]CURRENT PRICING'!$B:$B,0),MATCH([3]Generators_PL!$H$1,'[3]CURRENT PRICING'!$11:$11,0)),VLOOKUP($J12,[3]INPUTS!$H:$I,2,FALSE))","v":944.32500000000005},195,{"$f":"VLOOKUP($A12,'[3]CURRENT PRICING'!$B:$F,4,FALSE)","v":835},{"$f":"VLOOKUP($A12,'[3]CURRENT PRICING'!$B:$F,5,FALSE)","v":1049}]
["PA-PRO64-3002","x","x","x","6.4kW Portable, Tri-Fuel Ready, w Mobility Kit",6.4,5.2,8,"Y",196,35,23,24,"Y","N/A",6,1,6,{"$f":"IF(ISERROR(VLOOKUP($J13,[3]INPUTS!$H:$I,2,FALSE)),INDEX('[3]CURRENT PRICING'!$A:$U,MATCH($A13,'[3]CURRENT PRICING'!$B:$B,0),MATCH([3]Generators_PL!$H$1,'[3]CURRENT PRICING'!$11:$11,0)),VLOOKUP($J13,[3]INPUTS!$H:$I,2,FALSE))","v":1011.825},{"$f":"VLOOKUP($A13,'[3]CURRENT PRICING'!$B:$F,3,FALSE)","v":1499},{"$f":"VLOOKUP($A13,'[3]CURRENT PRICING'!$B:$F,4,FALSE)","v":1349},{"$f":"VLOOKUP($A13,'[3]CURRENT PRICING'!$B:$F,5,FALSE)","v":1299}]
["PA-PRO37-3101","x","x","x","3.7kW Portable, CO Monitor",3.7,3,3.4,"Y",134,25,20,21,"Y","N/A",6,"N/A",16,{"$f":"IF(ISERROR(VLOOKUP($J14,[3]INPUTS!$H:$I,2,FALSE)),INDEX('[3]CURRENT PRICING'!$A:$U,MATCH($A14,'[3]CURRENT PRICING'!$B:$B,0),MATCH([3]Generators_PL!$H$1,'[3]CURRENT PRICING'!$11:$11,0)),VLOOKUP($J14,[3]INPUTS!$H:$I,2,FALSE))","v":910.57500000000005},79,{"$f":"VLOOKUP($A14,'[3]CURRENT PRICING'!$B:$F,4,FALSE)","v":715},{"$f":"VLOOKUP($A14,'[3]CURRENT PRICING'!$B:$F,5,FALSE)","v":1049}]
["PA-PRO64-3102","x","x","x","6.4kW Portable,  w Mobility Kit, CO Monitor",6.4,5.2,8,"Y",198,29.4,21.4,22.3,"Y","N/A",6,"N/A",6,{"$f":"IF(ISERROR(VLOOKUP($J15,[3]INPUTS!$H:$I,2,FALSE)),INDEX('[3]CURRENT PRICING'!$A:$U,MATCH($A15,'[3]CURRENT PRICING'!$B:$B,0),MATCH([3]Generators_PL!$H$1,'[3]CURRENT PRICING'!$11:$11,0)),VLOOKUP($J15,[3]INPUTS!$H:$I,2,FALSE))","v":876.82500000000005},89,{"$f":"VLOOKUP($A15,'[3]CURRENT PRICING'!$B:$F,4,FALSE)","v":870},{"$f":"VLOOKUP($A15,'[3]CURRENT PRICING'!$B:$F,5,FALSE)","v":999}]
["PA-PRO64E-3002","x","x","x","6.4kW Portable,  Electric Start w Mobility Kit",6.4,5.2,8,"Y",218,35,23,24,"Y","N/A",6,1,6,{"$f":"IF(ISERROR(VLOOKUP($J16,[3]INPUTS!$H:$I,2,FALSE)),INDEX('[3]CURRENT PRICING'!$A:$U,MATCH($A16,'[3]CURRENT PRICING'!$B:$B,0),MATCH([3]Generators_PL!$H$1,'[3]CURRENT PRICING'!$11:$11,0)),VLOOKUP($J16,[3]INPUTS!$H:$I,2,FALSE))","v":1214.325},{"$f":"VLOOKUP($A16,'[3]CURRENT PRICING'!$B:$F,3,FALSE)","v":1799},{"$f":"VLOOKUP($A16,'[3]CURRENT PRICING'!$B:$F,4,FALSE)","v":1599},{"$f":"VLOOKUP($A16,'[3]CURRENT PRICING'!$B:$F,5,FALSE)","v":1449}]
["PA-PRO64E-3002-CA","x","x","x","6.4kW Portable, Tri-Fuel, Electric Start w Mobility Kit",6.4,5.2,8,"Y",218,35,23,24,"Y","N/A",6,1,6,{"$f":"IF(ISERROR(VLOOKUP($J17,[3]INPUTS!$H:$I,2,FALSE)),INDEX('[3]CURRENT PRICING'!$A:$U,MATCH($A17,'[3]CURRENT PRICING'!$B:$B,0),MATCH([3]Generators_PL!$H$1,'[3]CURRENT PRICING'!$11:$11,0)),VLOOKUP($J17,[3]INPUTS!$H:$I,2,FALSE))","v":1146.825},{"$f":"VLOOKUP($A17,'[3]CURRENT PRICING'!$B:$F,3,FALSE)","v":1699},{"$f":"VLOOKUP($A17,'[3]CURRENT PRICING'!$B:$F,4,FALSE)","v":1549},{"$f":"VLOOKUP($A17,'[3]CURRENT PRICING'!$B:$F,5,FALSE)","v":1449}]
["PA-PRO64E-3102","x","x","x","6.4kW Portable w  Electric Start, Mobility Kit, CO Monitor",6.4,5.2,8,"Y",196,35,23,24,"Y","N/A",6,1,6,{"$f":"IF(ISERROR(VLOOKUP($J18,[3]INPUTS!$H:$I,2,FALSE)),INDEX('[3]CURRENT PRICING'!$A:$U,MATCH($A18,'[3]CURRENT PRICING'!$B:$B,0),MATCH([3]Generators_PL!$H$1,'[3]CURRENT PRICING'!$11:$11,0)),VLOOKUP($J18,[3]INPUTS!$H:$I,2,FALSE))","v":1315.575},154,{"$f":"VLOOKUP($A18,'[3]CURRENT PRICING'!$B:$F,4,FALSE)","v":995},{"$f":"VLOOKUP($A18,'[3]CURRENT PRICING'!$B:$F,5,FALSE)","v":1599}]
["PA-PRO90-3002","x","x","x","9.0kW Portable w Mobility Kit",9,7.2,8,"Y",224,35,23,24,"Y","N/A",6,1,4,{"$f":"IF(ISERROR(VLOOKUP($J19,[3]INPUTS!$H:$I,2,FALSE)),INDEX('[3]CURRENT PRICING'!$A:$U,MATCH($A19,'[3]CURRENT PRICING'!$B:$B,0),MATCH([3]Generators_PL!$H$1,'[3]CURRENT PRICING'!$11:$11,0)),VLOOKUP($J19,[3]INPUTS!$H:$I,2,FALSE))","v":1383.075},90,{"$f":"VLOOKUP($A19,'[3]CURRENT PRICING'!$B:$F,4,FALSE)","v":925},{"$f":"VLOOKUP($A19,'[3]CURRENT PRICING'!$B:$F,5,FALSE)","v":1699}]
["PA-PRO90-3102","x","x","x","9.0kW Portable w Mobility Kit, CO Monitor",9,7.2,8,"Y",218,29.4,21.4,22.3,"Y","N/A",6,"N/A",4,{"$f":"IF(ISERROR(VLOOKUP($J20,[3]INPUTS!$H:$I,2,FALSE)),INDEX('[3]CURRENT PRICING'!$A:$U,MATCH($A20,'[3]CURRENT PRICING'!$B:$B,0),MATCH([3]Generators_PL!$H$1,'[3]CURRENT PRICING'!$11:$11,0)),VLOOKUP($J20,[3]INPUTS!$H:$I,2,FALSE))","v":1450.575},88,{"$f":"VLOOKUP($A20,'[3]CURRENT PRICING'!$B:$F,4,FALSE)","v":995},{"$f":"VLOOKUP($A20,'[3]CURRENT PRICING'!$B:$F,5,FALSE)","v":1799}]
["PA-PRO90E-3102","x","x","x","9.0kW Portable w Electric Start, Mobility Kit, CO Monitor",9,7.2,8,"Y",224,35,23,24,"Y","N/A",6,1,4,null,167,{"$f":"VLOOKUP($A21,'[3]CURRENT PRICING'!$B:$F,4,FALSE)","v":1095},{"$f":"VLOOKUP($A21,'[3]CURRENT PRICING'!$B:$F,5,FALSE)","v":2049}]
["PA-PRO90E-3002","x","x","x","9.0kW Portable, Electric Start w Mobility Kit",9,7.2,8,"Y",240,35,23,24,"Y","N/A",6,1,6,{"$f":"IF(ISERROR(VLOOKUP($J22,[3]INPUTS!$H:$I,2,FALSE)),INDEX('[3]CURRENT PRICING'!$A:$U,MATCH($A22,'[3]CURRENT PRICING'!$B:$B,0),MATCH([3]Generators_PL!$H$1,'[3]CURRENT PRICING'!$11:$11,0)),VLOOKUP($J22,[3]INPUTS!$H:$I,2,FALSE))","v":1450.575},{"$f":"VLOOKUP($A22,'[3]CURRENT PRICING'!$B:$F,3,FALSE)","v":2149},{"$f":"VLOOKUP($A22,'[3]CURRENT PRICING'!$B:$F,4,FALSE)","v":1999},{"$f":"VLOOKUP($A22,'[3]CURRENT PRICING'!$B:$F,5,FALSE)","v":1899}]
[]
["PORTABLE GENSETS: 49-State EPA"]
[]
["PA-GEN50-2003","x",null,"x","5.0kW Portable w Mobility Kit",5,4.3,8,"N",180,32,24,25,"Y","N/A",5,"N/A",6,{"$f":"IF(ISERROR(VLOOKUP($J26,[3]INPUTS!$H:$I,2,FALSE)),INDEX('[3]CURRENT PRICING'!$A:$U,MATCH($A26,'[3]CURRENT PRICING'!$B:$B,0),MATCH([3]Generators_PL!$H$1,'[3]CURRENT PRICING'!$11:$11,0)),VLOOKUP($J26,[3]INPUTS!$H:$I,2,FALSE))","v":775.57500000000005},170,{"$f":"VLOOKUP($A26,'[3]CURRENT PRICING'!$B:$F,4,FALSE)","v":655},{"$f":"VLOOKUP($A26,'[3]CURRENT PRICING'!$B:$F,5,FALSE)","v":849}]
["PA-GEN50-2102","x",null,"x","5.0kW Portable w Mobility Kit, CO Monitor",5,4.3,8,"Y",180,19.399999999999999,21.4,22.3,"Y","N/A",5,"N/A",6,{"$f":"IF(ISERROR(VLOOKUP($J27,[3]INPUTS!$H:$I,2,FALSE)),INDEX('[3]CURRENT PRICING'!$A:$U,MATCH($A27,'[3]CURRENT PRICING'!$B:$B,0),MATCH([3]Generators_PL!$H$1,'[3]CURRENT PRICING'!$11:$11,0)),VLOOKUP($J27,[3]INPUTS!$H:$I,2,FALSE))","v":843.07500000000005},360,{"$f":"VLOOKUP($A27,'[3]CURRENT PRICING'!$B:$F,4,FALSE)","v":830},{"$f":"VLOOKUP($A27,'[3]CURRENT PRICING'!$B:$F,5,FALSE)","v":949}]
["PA-PRO37-2101","x",null,"x","3.7kW Portable, CO Monitor",3.7,3,3.4,"Y",134,25,20,21,"Y","N/A",6,"N/A",16,null,160,{"$f":"VLOOKUP($A28,'[3]CURRENT PRICING'!$B:$F,4,FALSE)","v":710},{"$f":"VLOOKUP($A28,'[3]CURRENT PRICING'!$B:$F,5,FALSE)","v":999}]
["PA-PRO64-2002","x",null,"x","6.4kW Portable,  w Mobility Kit",6.4,5.2,8,"Y",198,29.4,21.4,22.3,"Y","N/A",6,"N/A",6,{"$f":"IF(ISERROR(VLOOKUP($J29,[3]INPUTS!$H:$I,2,FALSE)),INDEX('[3]CURRENT PRICING'!$A:$U,MATCH($A29,'[3]CURRENT PRICING'!$B:$B,0),MATCH([3]Generators_PL!$H$1,'[3]CURRENT PRICING'!$11:$11,0)),VLOOKUP($J29,[3]INPUTS!$H:$I,2,FALSE))","v":944.32500000000005},289,{"$f":"VLOOKUP($A29,'[3]CURRENT PRICING'!$B:$F,4,FALSE)","v":690},{"$f":"VLOOKUP($A29,'[3]CURRENT PRICING'!$B:$F,5,FALSE)","v":1099}]
["PA-PRO64E-2002","x",null,"x","6.4kW Portable,  w Electric Start, Mobility Kit",6.4,5.2,8,"Y",174,35,23,24,"Y","N/A",6,1,6,{"$f":"IF(ISERROR(VLOOKUP($J30,[3]INPUTS!$H:$I,2,FALSE)),INDEX('[3]CURRENT PRICING'!$A:$U,MATCH($A30,'[3]CURRENT PRICING'!$B:$B,0),MATCH([3]Generators_PL!$H$1,'[3]CURRENT PRICING'!$11:$11,0)),VLOOKUP($J30,[3]INPUTS!$H:$I,2,FALSE))","v":1113.075},120,{"$f":"VLOOKUP($A30,'[3]CURRENT PRICING'!$B:$F,4,FALSE)","v":800},{"$f":"VLOOKUP($A30,'[3]CURRENT PRICING'!$B:$F,5,FALSE)","v":1349}]
["PA-PRO64E-2102","x",null,"x","6.4kW Portable,  w Electric Kit, Mobility Kit, CO Monitor",6.4,5.2,8,"Y",198,29.4,21.4,22.3,"Y","N/A",6,1,6,{"$f":"IF(ISERROR(VLOOKUP($J31,[3]INPUTS!$H:$I,2,FALSE)),INDEX('[3]CURRENT PRICING'!$A:$U,MATCH($A31,'[3]CURRENT PRICING'!$B:$B,0),MATCH([3]Generators_PL!$H$1,'[3]CURRENT PRICING'!$11:$11,0)),VLOOKUP($J31,[3]INPUTS!$H:$I,2,FALSE))","v":1214.325},720,{"$f":"VLOOKUP($A31,'[3]CURRENT PRICING'!$B:$F,4,FALSE)","v":990},{"$f":"VLOOKUP($A31,'[3]CURRENT PRICING'!$B:$F,5,FALSE)","v":1499}]
["PA-PRO90-2002","x",null,"x","9.0kW Portable w Mobility Kit",9,7.2,8,"Y",199,35,23,24,"Y","N/A",6,1,4,{"$f":"IF(ISERROR(VLOOKUP($J32,[3]INPUTS!$H:$I,2,FALSE)),INDEX('[3]CURRENT PRICING'!$A:$U,MATCH($A32,'[3]CURRENT PRICING'!$B:$B,0),MATCH([3]Generators_PL!$H$1,'[3]CURRENT PRICING'!$11:$11,0)),VLOOKUP($J32,[3]INPUTS!$H:$I,2,FALSE))","v":1248.075},185,{"$f":"VLOOKUP($A32,'[3]CURRENT PRICING'!$B:$F,4,FALSE)","v":810},{"$f":"VLOOKUP($A32,'[3]CURRENT PRICING'!$B:$F,5,FALSE)","v":1599}]
["PA-PRO90E-2002","x",null,"x","9.0kW Portable,  w Electric Start, Mobility Kit",9,7.2,8,"Y",200,35,23,24,"Y","N/A",6,1,4,{"$f":"IF(ISERROR(VLOOKUP($J33,[3]INPUTS!$H:$I,2,FALSE)),INDEX('[3]CURRENT PRICING'!$A:$U,MATCH($A33,'[3]CURRENT PRICING'!$B:$B,0),MATCH([3]Generators_PL!$H$1,'[3]CURRENT PRICING'!$11:$11,0)),VLOOKUP($J33,[3]INPUTS!$H:$I,2,FALSE))","v":1484.325},92,{"$f":"VLOOKUP($A33,'[3]CURRENT PRICING'!$B:$F,4,FALSE)","v":1000},{"$f":"VLOOKUP($A33,'[3]CURRENT PRICING'!$B:$F,5,FALSE)","v":1899}]
["PA-PRO90E-2102","x",null,"x","9.0kW Portable,  w Electric Start, Mobility Kit, CO Monitor",9,7.2,8,"Y",218,29.4,21.4,22.3,"Y","N/A",6,1,4,{"$f":"IF(ISERROR(VLOOKUP($J34,[3]INPUTS!$H:$I,2,FALSE)),INDEX('[3]CURRENT PRICING'!$A:$U,MATCH($A34,'[3]CURRENT PRICING'!$B:$B,0),MATCH([3]Generators_PL!$H$1,'[3]CURRENT PRICING'!$11:$11,0)),VLOOKUP($J34,[3]INPUTS!$H:$I,2,FALSE))","v":1551.825},423,{"$f":"VLOOKUP($A34,'[3]CURRENT PRICING'!$B:$F,4,FALSE)","v":1085},{"$f":"VLOOKUP($A34,'[3]CURRENT PRICING'!$B:$F,5,FALSE)","v":1949}]
[]
["PORTABLE GENSETS: ACCESSORIES"]
[]
["17 755 60-S","x",null,null,"Tri-Fuel Regulator Kit (PRO64 models)",null,null,null,null,null,null,null,null,null,null,null,null,null,{"$f":"IF(ISERROR(VLOOKUP($J38,[3]INPUTS!$H:$I,2,FALSE)),INDEX('[3]CURRENT PRICING'!$A:$U,MATCH($A38,'[3]CURRENT PRICING'!$B:$B,0),MATCH([3]Generators_PL!$H$1,'[3]CURRENT PRICING'!$11:$11,0)),VLOOKUP($J38,[3]INPUTS!$H:$I,2,FALSE))","v":76.275000000000006},{"$f":"VLOOKUP($A38,'[3]CURRENT PRICING'!$B:$F,3,FALSE)","v":113},{"$f":"VLOOKUP($A38,'[3]CURRENT PRICING'!$B:$F,4,FALSE)","v":101},{"$f":"VLOOKUP($A38,'[3]CURRENT PRICING'!$B:$F,5,FALSE)","v":97}]
["17 337 10-S","x",null,null,"Natural Gas Fuel Optimizer Kit  (PRO64 models)",null,null,null,null,null,null,null,null,null,null,null,null,null,{"$f":"IF(ISERROR(VLOOKUP($J39,[3]INPUTS!$H:$I,2,FALSE)),INDEX('[3]CURRENT PRICING'!$A:$U,MATCH($A39,'[3]CURRENT PRICING'!$B:$B,0),MATCH([3]Generators_PL!$H$1,'[3]CURRENT PRICING'!$11:$11,0)),VLOOKUP($J39,[3]INPUTS!$H:$I,2,FALSE))","v":0.67500000000000004},28,{"$f":"VLOOKUP($A39,'[3]CURRENT PRICING'!$B:$F,4,FALSE)","v":1},{"$f":"VLOOKUP($A39,'[3]CURRENT PRICING'!$B:$F,5,FALSE)","v":1}]
["17 755 56-S","x",null,null,"Natural Gas Tri-Fuel Hose Kit  (PRO64 models)",null,null,null,null,null,null,null,null,null,null,null,null,null,{"$f":"IF(ISERROR(VLOOKUP($J40,[3]INPUTS!$H:$I,2,FALSE)),INDEX('[3]CURRENT PRICING'!$A:$U,MATCH($A40,'[3]CURRENT PRICING'!$B:$B,0),MATCH([3]Generators_PL!$H$1,'[3]CURRENT PRICING'!$11:$11,0)),VLOOKUP($J40,[3]INPUTS!$H:$I,2,FALSE))","v":55.35},{"$f":"VLOOKUP($A40,'[3]CURRENT PRICING'!$B:$F,3,FALSE)","v":82},{"$f":"VLOOKUP($A40,'[3]CURRENT PRICING'!$B:$F,4,FALSE)","v":73},{"$f":"VLOOKUP($A40,'[3]CURRENT PRICING'!$B:$F,5,FALSE)","v":70}]
["17 755 57-S","x",null,null,"Liquid Propane Tri-Fuel Hose Kit  (PRO64 models)",null,null,null,null,null,null,null,null,null,null,null,null,null,{"$f":"IF(ISERROR(VLOOKUP($J41,[3]INPUTS!$H:$I,2,FALSE)),INDEX('[3]CURRENT PRICING'!$A:$U,MATCH($A41,'[3]CURRENT PRICING'!$B:$B,0),MATCH([3]Generators_PL!$H$1,'[3]CURRENT PRICING'!$11:$11,0)),VLOOKUP($J41,[3]INPUTS!$H:$I,2,FALSE))","v":39.150000000000006},{"$f":"VLOOKUP($A41,'[3]CURRENT PRICING'!$B:$F,3,FALSE)","v":58},{"$f":"VLOOKUP($A41,'[3]CURRENT PRICING'!$B:$F,4,FALSE)","v":52},{"$f":"VLOOKUP($A41,'[3]CURRENT PRICING'!$B:$F,5,FALSE)","v":50}]
["33 127 01-S","x","x","x","12 Volt Battery Charger ",null,null,null,null,null,null,null,null,null,null,null,null,null,{"$f":"IF(ISERROR(VLOOKUP($J42,[3]INPUTS!$H:$I,2,FALSE)),INDEX('[3]CURRENT PRICING'!$A:$U,MATCH($A42,'[3]CURRENT PRICING'!$B:$B,0),MATCH([3]Generators_PL!$H$1,'[3]CURRENT PRICING'!$11:$11,0)),VLOOKUP($J42,[3]INPUTS!$H:$I,2,FALSE))","v":14.175000000000001},48,{"$f":"VLOOKUP($A42,'[3]CURRENT PRICING'!$B:$F,4,FALSE)","v":9},{"$f":"VLOOKUP($A42,'[3]CURRENT PRICING'!$B:$F,5,FALSE)","v":18}]
["33 755 03-S","x","x","x","60W Solar Panel - folding (eGEN18 compatible)",null,null,null,null,null,null,null,null,null,null,null,null,null,{"$f":"IF(ISERROR(VLOOKUP($J43,[3]INPUTS!$H:$I,2,FALSE)),INDEX('[3]CURRENT PRICING'!$A:$U,MATCH($A43,'[3]CURRENT PRICING'!$B:$B,0),MATCH([3]Generators_PL!$H$1,'[3]CURRENT PRICING'!$11:$11,0)),VLOOKUP($J43,[3]INPUTS!$H:$I,2,FALSE))","v":147.82500000000002},{"$f":"VLOOKUP($A43,'[3]CURRENT PRICING'!$B:$F,3,FALSE)","v":219},{"$f":"VLOOKUP($A43,'[3]CURRENT PRICING'!$B:$F,4,FALSE)","v":199},{"$f":"VLOOKUP($A43,'[3]CURRENT PRICING'!$B:$F,5,FALSE)","v":179}]
["33 755 04-S","x","x","x","150W Panel (5' x 2' x 2\") (eGEN18 compatible)",null,null,null,null,null,null,null,null,null,null,null,null,null,{"$f":"IF(ISERROR(VLOOKUP($J44,[3]INPUTS!$H:$I,2,FALSE)),INDEX('[3]CURRENT PRICING'!$A:$U,MATCH($A44,'[3]CURRENT PRICING'!$B:$B,0),MATCH([3]Generators_PL!$H$1,'[3]CURRENT PRICING'!$11:$11,0)),VLOOKUP($J44,[3]INPUTS!$H:$I,2,FALSE))","v":363.82500000000005},{"$f":"VLOOKUP($A44,'[3]CURRENT PRICING'!$B:$F,3,FALSE)","v":539},{"$f":"VLOOKUP($A44,'[3]CURRENT PRICING'!$B:$F,4,FALSE)","v":479},{"$f":"VLOOKUP($A44,'[3]CURRENT PRICING'!$B:$F,5,FALSE)","v":459}]
["33 755 05-S","x","x","x","25' Solar Extension Cord (one pair)",null,null,null,null,null,null,null,null,null,null,null,null,null,{"$f":"IF(ISERROR(VLOOKUP($J45,[3]INPUTS!$H:$I,2,FALSE)),INDEX('[3]CURRENT PRICING'!$A:$U,MATCH($A45,'[3]CURRENT PRICING'!$B:$B,0),MATCH([3]Generators_PL!$H$1,'[3]CURRENT PRICING'!$11:$11,0)),VLOOKUP($J45,[3]INPUTS!$H:$I,2,FALSE))","v":66.825000000000003},38,{"$f":"VLOOKUP($A45,'[3]CURRENT PRICING'!$B:$F,4,FALSE)","v":37},{"$f":"VLOOKUP($A45,'[3]CURRENT PRICING'!$B:$F,5,FALSE)","v":79}]
["33 755 43-S","x","x","x","Solar Panel Parallel Connector Kit (eGEN18 compatible)",null,null,null,null,null,null,null,null,null,null,null,null,null,{"$f":"IF(ISERROR(VLOOKUP($J46,[3]INPUTS!$H:$I,2,FALSE)),INDEX('[3]CURRENT PRICING'!$A:$U,MATCH($A46,'[3]CURRENT PRICING'!$B:$B,0),MATCH([3]Generators_PL!$H$1,'[3]CURRENT PRICING'!$11:$11,0)),VLOOKUP($J46,[3]INPUTS!$H:$I,2,FALSE))","v":21.6},{"$f":"VLOOKUP($A46,'[3]CURRENT PRICING'!$B:$F,3,FALSE)","v":32},{"$f":"VLOOKUP($A46,'[3]CURRENT PRICING'!$B:$F,4,FALSE)","v":32},{"$f":"VLOOKUP($A46,'[3]CURRENT PRICING'!$B:$F,5,FALSE)","v":28}]
["25 755 53-S","x","x","x","Wireless remote start/stop kit for PRO12.3EFI ",null,null,null,null,null,null,null,null,null,null,null,null,null,{"$f":"IF(ISERROR(VLOOKUP($J47,[3]INPUTS!$H:$I,2,FALSE)),INDEX('[3]CURRENT PRICING'!$A:$U,MATCH($A47,'[3]CURRENT PRICING'!$B:$B,0),MATCH([3]Generators_PL!$H$1,'[3]CURRENT PRICING'!$11:$11,0)),VLOOKUP($J47,[3]INPUTS!$H:$I,2,FALSE))","v":405},18,{"$f":"VLOOKUP($A47,'[3]CURRENT PRICING'!$B:$F,4,FALSE)","v":348},{"$f":"VLOOKUP($A47,'[3]CURRENT PRICING'!$B:$F,5,FALSE)","v":525}]
["34 755 01-S","x","x","x","Mobility Kit for PRO12.3EFI",null,null,null,null,null,null,null,null,null,null,null,null,null,{"$f":"IF(ISERROR(VLOOKUP($J48,[3]INPUTS!$H:$I,2,FALSE)),INDEX('[3]CURRENT PRICING'!$A:$U,MATCH($A48,'[3]CURRENT PRICING'!$B:$B,0),MATCH([3]Generators_PL!$H$1,'[3]CURRENT PRICING'!$11:$11,0)),VLOOKUP($J48,[3]INPUTS!$H:$I,2,FALSE))","v":105.30000000000001},52,{"$f":"VLOOKUP($A48,'[3]CURRENT PRICING'!$B:$F,4,FALSE)","v":76},{"$f":"VLOOKUP($A48,'[3]CURRENT PRICING'!$B:$F,5,FALSE)","v":133}]
["37 755 08","x","x","x","Single Cycle Mobility Kit, Gens & Pumps",null,null,null,null,null,null,null,null,null,null,null,null,null,null,44,{"$f":"VLOOKUP($A49,'[3]CURRENT PRICING'!$B:$F,4,FALSE)","v":42},{"$f":"VLOOKUP($A49,'[3]CURRENT PRICING'!$B:$F,5,FALSE)","v":79}]
["25 755 45-S","x","x","x","Universal Wheelbarrow Handle",null,null,null,null,null,null,null,null,null,null,null,null,null,null,169,{"$f":"VLOOKUP($A50,'[3]CURRENT PRICING'!$B:$F,4,FALSE)","v":10},{"$f":"VLOOKUP($A50,'[3]CURRENT PRICING'!$B:$F,5,FALSE)","v":18}]
["25 755 46-S","x","x","x","Universal Wheel ",null,null,null,null,null,null,null,null,null,null,null,null,null,null,271,{"$f":"VLOOKUP($A51,'[3]CURRENT PRICING'!$B:$F,4,FALSE)","v":28},{"$f":"VLOOKUP($A51,'[3]CURRENT PRICING'!$B:$F,5,FALSE)","v":55}]
["25 755 47-S","x","x","x","Universal Leg ",null,null,null,null,null,null,null,null,null,null,null,null,null,null,22,{"$f":"VLOOKUP($A52,'[3]CURRENT PRICING'!$B:$F,4,FALSE)","v":10},{"$f":"VLOOKUP($A52,'[3]CURRENT PRICING'!$B:$F,5,FALSE)","v":18}]
["25 755 48-S","x","x","x","Universal Lifting ",null,null,null,null,null,null,null,null,null,null,null,null,null,null,1413,{"$f":"VLOOKUP($A53,'[3]CURRENT PRICING'!$B:$F,4,FALSE)","v":7},{"$f":"VLOOKUP($A53,'[3]CURRENT PRICING'!$B:$F,5,FALSE)","v":13}]
["25 755 49-S","x","x","x","Universal Cord Management",null,null,null,null,null,null,null,null,null,null,null,null,null,null,1176,{"$f":"VLOOKUP($A54,'[3]CURRENT PRICING'!$B:$F,4,FALSE)","v":7},{"$f":"VLOOKUP($A54,'[3]CURRENT PRICING'!$B:$F,5,FALSE)","v":13}]
["25 755 50-S","x","x","x","Universal Hand-Truck Handle",null,null,null,null,null,null,null,null,null,null,null,null,null,null,3749,{"$f":"VLOOKUP($A55,'[3]CURRENT PRICING'!$B:$F,4,FALSE)","v":17},{"$f":"VLOOKUP($A55,'[3]CURRENT PRICING'!$B:$F,5,FALSE)","v":27}]
["25 755 51-S","x","x","x","Univerdal Rubber Isolator",null,null,null,null,null,null,null,null,null,null,null,null,null,null,916,{"$f":"VLOOKUP($A56,'[3]CURRENT PRICING'!$B:$F,4,FALSE)","v":4},{"$f":"VLOOKUP($A56,'[3]CURRENT PRICING'!$B:$F,5,FALSE)","v":8}]
[]
["PORTABLE GENSETS: TRANSFER SWITCHES"]
[]
["37 755 06-S","x","x","x","6-Circuit Transfer Switch ",null,null,null,null,null,null,null,null,null,null,null,null,null,{"$f":"IF(ISERROR(VLOOKUP($J60,[3]INPUTS!$H:$I,2,FALSE)),INDEX('[3]CURRENT PRICING'!$A:$U,MATCH($A60,'[3]CURRENT PRICING'!$B:$B,0),MATCH([3]Generators_PL!$H$1,'[3]CURRENT PRICING'!$11:$11,0)),VLOOKUP($J60,[3]INPUTS!$H:$I,2,FALSE))","v":303.75},23,{"$f":"VLOOKUP($A60,'[3]CURRENT PRICING'!$B:$F,4,FALSE)","v":228},{"$f":"VLOOKUP($A60,'[3]CURRENT PRICING'!$B:$F,5,FALSE)","v":383}]
["37 755 07-S","x","x","x","10-Circuit Transfer Switch ",null,null,null,null,null,null,null,null,null,null,null,null,null,{"$f":"IF(ISERROR(VLOOKUP($J61,[3]INPUTS!$H:$I,2,FALSE)),INDEX('[3]CURRENT PRICING'!$A:$U,MATCH($A61,'[3]CURRENT PRICING'!$B:$B,0),MATCH([3]Generators_PL!$H$1,'[3]CURRENT PRICING'!$11:$11,0)),VLOOKUP($J61,[3]INPUTS!$H:$I,2,FALSE))","v":405},62,{"$f":"VLOOKUP($A61,'[3]CURRENT PRICING'!$B:$F,4,FALSE)","v":311},{"$f":"VLOOKUP($A61,'[3]CURRENT PRICING'!$B:$F,5,FALSE)","v":510}]
[]
["PORTABLE GENSETS: WATER PUMPS"]
[]
["PA-WP20-3001","x","x","x","CARB 2 Inch PRO Water Pump",null,null,null,null,null,null,null,null,null,null,null,null,null,{"$f":"IF(ISERROR(VLOOKUP($J65,[3]INPUTS!$H:$I,2,FALSE)),INDEX('[3]CURRENT PRICING'!$A:$U,MATCH($A65,'[3]CURRENT PRICING'!$B:$B,0),MATCH([3]Generators_PL!$H$1,'[3]CURRENT PRICING'!$11:$11,0)),VLOOKUP($J65,[3]INPUTS!$H:$I,2,FALSE))","v":286.875},79,{"$f":"VLOOKUP($A65,'[3]CURRENT PRICING'!$B:$F,4,FALSE)","v":229},{"$f":"VLOOKUP($A65,'[3]CURRENT PRICING'!$B:$F,5,FALSE)","v":375}]
["PA-WP20-3001-MX","x","x","x","CARB 2 inch Water Pump",null,null,null,null,null,null,null,null,null,null,null,null,null,{"$f":"IF(ISERROR(VLOOKUP($J66,[3]INPUTS!$H:$I,2,FALSE)),INDEX('[3]CURRENT PRICING'!$A:$U,MATCH($A66,'[3]CURRENT PRICING'!$B:$B,0),MATCH([3]Generators_PL!$H$1,'[3]CURRENT PRICING'!$11:$11,0)),VLOOKUP($J66,[3]INPUTS!$H:$I,2,FALSE))","v":286.875},{"$f":"VLOOKUP($A66,'[3]CURRENT PRICING'!$B:$F,3,FALSE)","v":425},{"$f":"VLOOKUP($A66,'[3]CURRENT PRICING'!$B:$F,4,FALSE)","v":425},{"$f":"VLOOKUP($A66,'[3]CURRENT PRICING'!$B:$F,5,FALSE)","v":375}]
["PA-WP30-3001","x","x","x","CARB 3 Inch PRO Water Pump",null,null,null,null,null,null,null,null,null,null,null,null,null,{"$f":"IF(ISERROR(VLOOKUP($J67,[3]INPUTS!$H:$I,2,FALSE)),INDEX('[3]CURRENT PRICING'!$A:$U,MATCH($A67,'[3]CURRENT PRICING'!$B:$B,0),MATCH([3]Generators_PL!$H$1,'[3]CURRENT PRICING'!$11:$11,0)),VLOOKUP($J67,[3]INPUTS!$H:$I,2,FALSE))","v":405},{"$f":"VLOOKUP($A67,'[3]CURRENT PRICING'!$B:$F,3,FALSE)","v":600},{"$f":"VLOOKUP($A67,'[3]CURRENT PRICING'!$B:$F,4,FALSE)","v":600},{"$f":"VLOOKUP($A67,'[3]CURRENT PRICING'!$B:$F,5,FALSE)","v":525}]
["PA-WP30-3001-MX","x","x","x","CARB 3 inch Water Pump",null,null,null,null,null,null,null,null,null,null,null,null,null,{"$f":"IF(ISERROR(VLOOKUP($J68,[3]INPUTS!$H:$I,2,FALSE)),INDEX('[3]CURRENT PRICING'!$A:$U,MATCH($A68,'[3]CURRENT PRICING'!$B:$B,0),MATCH([3]Generators_PL!$H$1,'[3]CURRENT PRICING'!$11:$11,0)),VLOOKUP($J68,[3]INPUTS!$H:$I,2,FALSE))","v":405},{"$f":"VLOOKUP($A68,'[3]CURRENT PRICING'!$B:$F,3,FALSE)","v":600},{"$f":"VLOOKUP($A68,'[3]CURRENT PRICING'!$B:$F,4,FALSE)","v":600},{"$f":"VLOOKUP($A68,'[3]CURRENT PRICING'!$B:$F,5,FALSE)","v":525}]

{"sheet":"ATS_PL","index":5,"n_rows":88,"n_cols":18,"rows_kept":88,"cut":false,"hidden":false,"merged":[[2,1,2,2]]}
[null,null,null,null,null,null,null,null,null,null,null,null,null,null,null,null,null,{"$f":"Generators_PL!H1","v":"Residential Price List"}]
[null,null,null,null,null,null,null,null,null,null,null,null,null,null,null,null,null,{"$f":"Generators_PL!H2","v":"EFFECTIVE DATE: 05/01/2023"}]
[null,null,null,null,null,null,null,null,null,null,null,null,null,null,null,null,null,{"$f":"Generators_PL!H3","v":"Pricing is in USD"}]
[null,null,null,null,null,null,null,null,null,null,null,null,null,null,null,{"$f":"Generators_PL!F4","v":0}]
["*denotes new or updated models"]
["Specification #","Amps","Phase","Voltage","Poles/Wire","Encl Type","Encl Material","Load Center","Service Entrance","UL","cUL","CSA","Combined Board w/Load Shed ","Compatible with Load Shed Kit","Net Price","List Price","MSRP","MAP"]
["RESIDENTIAL ATS PRICE LIST"]
[]
["RDT-CFNA-0100A-QS5",100,"1Ph","240V","2Pole/3Wire","NEMA 1","Steel","",null,"X",null,"X",null,"X",{"$f":"P9*$P$4","v":0},845,690,675]
["RDT-CFNA-0200A-QS5",200,"1Ph","240V","2Pole/3Wire","NEMA 1","Steel","",null,"X",null,"X",null,"X",0,1200,980,960]
["RDT-CFNA-100B-MV04",100,"1Ph","240V","2Pole/3Wire","NEMA 1","Steel",16,null,"X","X",null,null,null,0,930,760,745]
["RDT-CFNA-200B-MV04",200,"1Ph","240V","2Pole/3Wire","NEMA 1","Steel",24,null,"X","X",null,null,null,0,1375,1120,1100]
["RDT-CFNC-0100A-QS7",100,"1Ph","240V","2Pole/3Wire","NEMA 3R","Aluminum","",null,"X",null,"X",null,"X",0,935,765,750]
["RDT-CFNC-0200A-QS7",200,"1Ph","240V","2Pole/3Wire","NEMA 3R","Aluminum","",null,"X",null,"X",null,"X",0,1285,1050,1030]
["RDT-CFNC-0100B-QS7",100,"1Ph","240V","2Pole/3Wire","NEMA 3R","Aluminum",16,null,"X","X",null,null,null,0,1015,825,810]
["RDT-CFNC-0200B-QS7",200,"1Ph","240V","2Pole/3Wire","NEMA 3R","Aluminum",24,null,"X","X",null,null,null,0,1590,1295,1270]
["RDT-CFNC-400A-QS10",400,"1Ph","240V","2Pole/3Wire","NEMA 3R","Aluminum","",null,"X",null,null,null,"X",0,2730,2230,2185]
["RDT-CFNC-400A-QS11",400,"1Ph","240V","2Pole/3Wire","NEMA 3R","Aluminum","",null,null,null,"X",null,"X",0,2790,2275,2230]
["RDT-CFNC-200ASEQS4",200,"1Ph","240V","2Pole/3Wire","NEMA 3R","Aluminum","","X","X",null,null,null,"X",0,1725,1410,1380]
["RDT-CFNC-200BSEQS3",200,"1Ph","240V","2Pole/3Wire","NEMA 3R","Aluminum",42,"X","X",null,null,null,null,0,1820,1485,1455]
["RDT-CFNC-400ASEQS5",400,"1Ph","240V","2Pole/3Wire","NEMA 3R","Aluminum","","X","X",null,null,null,"X",0,4530,3700,3625]
["GM85273-SA6",100,"1Ph","240V","2Pole/3Wire","NEMA 1","Steel",12,null,"X",null,null,null,null,0,635,520,510]
["RXT-JFNA-0100B-QS5",100,"1Ph","240V","2Pole/3Wire","NEMA 1","Steel","16",null,"X",null,null,null,null,0,685,560,550]
["RXT-JFNC-0100B-QS4",100,"1Ph","240V","2Pole/3Wire","NEMA 3R","Aluminum","16",null,"X",null,null,null,null,0,740,600,590]
["RXT-JFNC-0100A-QS7",100,"1Ph","240V","2Pole/3Wire","NEMA 3R","Aluminum",null,null,"X",null,"X","X",null,0,645,525,515]
["RXT-JFNC-0200A-QS7",200,"1Ph","240V","2Pole/3Wire","NEMA 3R","Aluminum",null,null,"X",null,"X","X",null,0,930,760,745]
["RXT-JFNC-0400A-QS5",400,"1Ph","240V","2Pole/3Wire","NEMA 3R","Aluminum",null,null,"X",null,null,"X",null,0,2715,2215,2170]
["RXT-JFNC-400A-MV07",400,"1Ph","240V","2Pole/3Wire","NEMA 3R","Aluminum",null,null,null,null,"X","X",null,0,2460,2010,1970]
["RXT-JFNC-100ASEQS4",100,"1Ph","240V","2Pole/3Wire","NEMA 3R","Aluminum",null,"X","X",null,null,"X",null,0,795,650,635]
["RXT-JFNC-150ASEQS3",150,"1Ph","240V","2Pole/3Wire","NEMA 3R","Aluminum",null,"X","X",null,null,"X",null,0,1090,890,870]
["RXT-JFNC-200ASEQS4",200,"1Ph","240V","2Pole/3Wire","NEMA 3R","Aluminum",null,"X","X",null,null,"X",null,0,1005,890,870]
["RXT-JFNC-300ASEQS4",300,"1Ph","240V","2Pole/3Wire","NEMA 3R","Aluminum",null,"X","X",null,null,"X",null,0,4295,3505,3435]
["RXT-JFNC300CSEMV01",300,"1Ph","240V","2Pole/3Wire","NEMA 3R","Aluminum",null,"X",null,null,"X","X",null,0,4295,3505,3435]
["RXT-JFNC-400ASEQS4",400,"1Ph","240V","2Pole/3Wire","NEMA 3R","Aluminum",null,"X","X",null,null,"X",null,0,4295,3505,3435]
["RXT-JFNC-400CSEQS",400,"1Ph","240V","2Pole/3Wire","NEMA 3R","Aluminum",null,"X",null,null,"X","X",null,0,4295,3505,3435]
["RXT-JFNC-100CSEQS3",100,"1Ph","240V","2Pole/3Wire","NEMA 3R","Aluminum",null,"X",null,null,"X","X",null,0,940,765,750]
["RXT-JFNC-200CSEQS3",200,"1Ph","240V","2Pole/3Wire","NEMA 3R","Aluminum",null,"X",null,null,"X","X",null,0,1300,1060,1040]
["3 Phase - UL"]
["RXT-JCTC-0100A-QS4",100,"3Ph","208V","3Pole/4Wire","NEMA 3R","Aluminum",null,null,"X",null,null,null,null,{"$f":"P39*$P$4","v":0},1090,890,870]
["RXT-JFTC-0100A-QS4",100,"3Ph","240V","3Pole/4Wire","NEMA 3R","Aluminum",null,null,"X",null,null,null,null,0,1090,890,870]
["RXT-JMTC-0100A-QS4",100,"3Ph","480V","3Pole/4Wire","NEMA 3R","Aluminum",null,null,"X",null,null,null,null,0,1230,1005,985]
["RXT-JCTC-0200A-QS4",200,"3Ph","208V","3Pole/4Wire","NEMA 3R","Aluminum",null,null,"X",null,null,null,null,0,1660,1355,1330]
["RXT-JFTC-0200A-QS4",200,"3Ph","240V","3Pole/4Wire","NEMA 3R","Aluminum",null,null,"X",null,null,null,null,0,1660,1355,1330]
["RXT-JMTC-0200A-QS3",200,"3Ph","480V","3Pole/4Wire","NEMA 3R","Aluminum",null,null,"X",null,null,null,null,0,1790,1460,1430]
["RXT-JCTC-400A-MV06",400,"3Ph","208V","3Pole/4Wire","NEMA 3R","Aluminum",null,null,"X",null,null,null,null,0,2905,2370,2325]
["RXT-JFTC-400A-MV06",400,"3Ph","240V","3Pole/4Wire","NEMA 3R","Aluminum",null,null,"X",null,null,null,null,0,2905,2370,2325]
["RXT-JMTC-0400A-QS3",400,"3Ph","480V","3Pole/4Wire","NEMA 3R","Aluminum",null,null,"X",null,null,null,null,0,3245,2650,2595]
["RXT-JCVC-100A-MV06",100,"3Ph","208V","4Pole/4Wire","NEMA 3R","Aluminum",null,null,"X",null,null,null,null,0,1740,1420,1390]
["RXT-JFVC-100A-MV06",100,"3Ph","240V","4Pole/4Wire","NEMA 3R","Aluminum",null,null,"X",null,null,null,null,0,1740,1420,1390]
["RXT-JMVC-100A-MV06",100,"3Ph","480V","4Pole/4Wire","NEMA 3R","Aluminum",null,null,"X",null,null,null,null,0,1875,1530,1500]
["RXT-JCVC-200A-MV06",200,"3Ph","208V","4Pole/4Wire","NEMA 3R","Aluminum",null,null,"X",null,null,null,null,0,2140,1745,1710]
["RXT-JFVC-200A-MV06",200,"3Ph","240V","4Pole/4Wire","NEMA 3R","Aluminum",null,null,"X",null,null,null,null,0,2140,1745,1710]
["RXT-JMVC-200A-MV06",200,"3Ph","480V","4Pole/4Wire","NEMA 3R","Aluminum",null,null,"X",null,null,null,null,0,2290,1865,1830]
["RXT-JCVC-400A-MV06",400,"3Ph","208V","4Pole/4Wire","NEMA 3R","Aluminum",null,null,"X",null,null,null,null,0,3655,2985,2925]
["RXT-JFVC-400A-MV06",400,"3Ph","240V","4Pole/4Wire","NEMA 3R","Aluminum",null,null,"X",null,null,null,null,0,3655,2985,2925]
["RXT-JMVC-400A-MV06",400,"3Ph","480V","4Pole/4Wire","NEMA 3R","Aluminum","",null,"X",null,null,null,null,0,4005,3270,3205]
["3 Phase - CSA"]
["RXT-JCTC-100A-MV03",100,"3Ph","208V","3Pole/4Wire","NEMA 3R","Aluminum","",null,"X",null,"X",null,null,{"$f":"P58*$P$4","v":0},1180,965,945]
["RXT-JFTC-100A-MV03",100,"3Ph","240V","3Pole/4Wire","NEMA 3R","Aluminum","",null,"X",null,"X",null,null,0,1180,965,945]
["RXT-JMTC-100A-MV04",100,"3Ph","480V","3Pole/4Wire","NEMA 3R","Aluminum","",null,"X",null,"X",null,null,0,1320,1075,1055]
["RXT-JCTC-200A-MV03",200,"3Ph","208V","3Pole/4Wire","NEMA 3R","Aluminum","",null,"X",null,"X",null,null,0,1700,1390,1360]
["RXT-JFTC-200A-MV03",200,"3Ph","240V","3Pole/4Wire","NEMA 3R","Aluminum","",null,"X",null,"X",null,null,0,1700,1390,1360]
["RXT-JMTC-200A-MV04",200,"3Ph","480V","3Pole/4Wire","NEMA 3R","Aluminum","",null,"X",null,"X",null,null,0,1845,1505,1475]
["RXT-JCTC-400A-MV07",400,"3Ph","208V","3Pole/4Wire","NEMA 3R","Aluminum","",null,"X",null,"X",null,null,0,2950,2410,2360]
["RXT-JFTC-400A-MV07",400,"3Ph","240V","3Pole/4Wire","NEMA 3R","Aluminum","",null,"X",null,"X",null,null,0,2950,2410,2360]
["RXT-JMTC-400A-MV04",400,"3Ph","480V","3Pole/4Wire","NEMA 3R","Aluminum","",null,"X",null,"X",null,null,0,3295,2690,2635]
["RXT-JCVC-100A-MV07",100,"3Ph","208V","4Pole/4Wire","NEMA 3R","Aluminum","",null,"X",null,"X",null,null,0,1780,1455,1425]
["RXT-JFVC-100A-MV07",100,"3Ph","240V","4Pole/4Wire","NEMA 3R","Aluminum","",null,"X",null,"X",null,null,0,1780,1455,1425]
["RXT-JMVC-100A-MV07",100,"3Ph","480V","4Pole/4Wire","NEMA 3R","Aluminum","",null,"X",null,"X",null,null,0,1920,1565,1535]
["RXT-JCVC-200A-MV07",200,"3Ph","208V","4Pole/4Wire","NEMA 3R","Aluminum","",null,"X",null,"X",null,null,0,2190,1785,1750]
["RXT-JFVC-200A-MV07",200,"3Ph","240V","4Pole/4Wire","NEMA 3R","Aluminum","",null,"X",null,"X",null,null,0,2190,1785,1750]
["RXT-JMVC-200A-MV07",200,"3Ph","480V","4Pole/4Wire","NEMA 3R","Aluminum","",null,"X",null,"X",null,null,0,2330,1905,1865]
["RXT-JCVC-400A-MV07",400,"3Ph","208V","4Pole/4Wire","NEMA 3R","Aluminum","",null,"X",null,"X",null,null,0,3700,3020,2960]
["RXT-JFVC-400A-MV07",400,"3Ph","240V","4Pole/4Wire","NEMA 3R","Aluminum","",null,"X",null,"X",null,null,0,3700,3020,2960]
["RXT-JMVC-400A-MV07",400,"3Ph","480V","4Pole/4Wire","NEMA 3R","Aluminum","",null,"X",null,"X",null,null,0,4060,3315,3250]
["Industrial"]
["KEP-DFNC-400NK-QS1",400,"1Ph","240V","2Pole/3Wire","NEMA 3R","Steel","","X","X",null,null,null,null,{"$f":"P77*$P$4","v":0},11841,11604.18,9472.8000000000011]
["KEP-DCTC-400NK-QS1",400,"3Ph","208V","3Pole/4Wire","NEMA 3R","Steel","","X","X",null,null,null,null,0,12363,12115.74,9890.4000000000015]
["KEP-DCTC-600NK-QS1",600,"3Ph","208V","3Pole/4Wire","NEMA 3R","Steel","","X","X",null,null,null,null,0,17628,17275.439999999999,14102.400000000001]
["KEP-DFNC-600NK-QS4",600,"1Ph","240V","2Pole/3Wire","NEMA 3R","Steel","","X","X",null,null,null,null,0,17105,16762.900000000001,13684]
["KEP-DCTC-800NK-QS1",800,"3Ph","208V","3Pole/4Wire","NEMA 3R","Steel","","X","X",null,null,null,null,0,20690,20276.2,16552]
["KEP-DFNC-800NK-QS3 ",800,"1Ph","240V","2Pole/3Wire","NEMA 3R","Steel","","X","X",null,null,null,null,0,20170,19766.599999999999,16136]
["KSS-ACTC-0400S-QS2",400,"3Ph","208V","3Pole/4Wire","NEMA 3R","Steel",null,null,null,null,null,null,null,0,7536,7385.28,6028.8]
["KSS-ACTC-0600S-QS1",600,"3Ph","208V","3Pole/4Wire","NEMA 3R","Steel","",null,"X",null,"X",null,null,0,10963,10743.74,8770.4]
["KSS-ACTC-0800S-QS1",800,"3Ph","208V","3Pole/4Wire","NEMA 3R","Steel","",null,"X",null,"X",null,null,0,12794,12538.119999999999,10235.200000000001]
["KSS-AFTC-0800S-QS1",800,"3Ph","240V","3Pole/4Wire","NEMA 3R","Steel",null,null,"X",null,"X",null,null,0,12794,12538.119999999999,10235.200000000001]
["KSS-AFNC-0600S-QS1",600,"1Ph","240V","2Pole/3Wire","NEMA 3R","Steel",null,null,"X",null,null,null,null,0,10289,10083.219999999999,8231.2000000000007]
["KSS-JFTC-0800S-QS1",800,"3Ph","240V","3Pole/4Wire","NEMA 3R","Steel",null,null,"X",null,null,null,null,0,8270,8104.5999999999995,6616]

{"sheet":"ATS_PL_Canada","index":6,"n_rows":88,"n_cols":21,"rows_kept":88,"cut":false,"hidden":false,"merged":[[2,1,2,2],[4,14,4,17],[4,18,4,19],[1,5,1,10]]}
[null,null,null,null,null,null,null,null,null,null,null,null,null,null,null,null,null,null,null,{"$f":"Generators_PL!H1","v":"Residential Price List"}]
[null,null,null,null,null,"CANADA",null,null,null,null,null,null,null,null,null,null,null,null,null,{"$f":"Generators_PL!H2","v":"EFFECTIVE DATE: 05/01/2023"}]
[null,null,null,null,null,null,null,null,null,null,null,null,null,null,null,null,null,null,null,{"$f":"Generators_PL!F4","v":0}]
[]
["*denotes new or updated models",null,null,null,null,null,null,null,null,null,null,null,null,null,"USD",null,null,null,"CAD",null,1.35]
["Specification #","Amps","Phase","Voltage","Poles/Wire","Encl Type","Encl Material","Load Center","Service Entrance","UL","cUL","CSA","Combined Board w/Load Shed ","Compatible with Load Shed Kit","Net Price","List Price","MSRP","MAP","MSRP","MAP"]
["RESIDENTIAL ATS PRICE LIST"]
[]
["RDT-CFNA-0100A-QS5",100,"1Ph","240V","2Pole/3Wire","NEMA 1","Steel","",null,"X",null,"X",null,"X",{"$f":"P9*$T$3","v":0},{"$f":"ATS_PL!P9","v":845},{"$f":"ATS_PL!Q9","v":690},{"$f":"ATS_PL!R9","v":675},{"$f":"Q9*$U$5","v":931.50000000000011},911.25000000000011]
["RDT-CFNA-0200A-QS5",200,"1Ph","240V","2Pole/3Wire","NEMA 1","Steel","",null,"X",null,"X",null,"X",{"$f":"P10*$T$3","v":0},{"$f":"ATS_PL!P10","v":1200},{"$f":"ATS_PL!Q10","v":980},{"$f":"ATS_PL!R10","v":960},1323,1296]
["RDT-CFNA-100B-MV04",100,"1Ph","240V","2Pole/3Wire","NEMA 1","Steel",16,null,"X","X",null,null,null,{"$f":"P11*$T$3","v":0},{"$f":"ATS_PL!P11","v":930},{"$f":"ATS_PL!Q11","v":760},{"$f":"ATS_PL!R11","v":745},1026,1005.7500000000001]
["RDT-CFNA-200B-MV04",200,"1Ph","240V","2Pole/3Wire","NEMA 1","Steel",24,null,"X","X",null,null,null,{"$f":"P12*$T$3","v":0},{"$f":"ATS_PL!P12","v":1375},{"$f":"ATS_PL!Q12","v":1120},{"$f":"ATS_PL!R12","v":1100},1512,1485]
["RDT-CFNC-0100A-QS7",100,"1Ph","240V","2Pole/3Wire","NEMA 3R","Aluminum","",null,"X",null,"X",null,"X",{"$f":"P13*$T$3","v":0},{"$f":"ATS_PL!P13","v":935},{"$f":"ATS_PL!Q13","v":765},{"$f":"ATS_PL!R13","v":750},1032.75,1012.5000000000001]
["RDT-CFNC-0200A-QS7",200,"1Ph","240V","2Pole/3Wire","NEMA 3R","Aluminum","",null,"X",null,"X",null,"X",{"$f":"P14*$T$3","v":0},{"$f":"ATS_PL!P14","v":1285},{"$f":"ATS_PL!Q14","v":1050},{"$f":"ATS_PL!R14","v":1030},1417.5,1390.5]
["RDT-CFNC-0100B-QS7",100,"1Ph","240V","2Pole/3Wire","NEMA 3R","Aluminum",16,null,"X","X",null,null,null,{"$f":"P15*$T$3","v":0},{"$f":"ATS_PL!P15","v":1015},{"$f":"ATS_PL!Q15","v":825},{"$f":"ATS_PL!R15","v":810},1113.75,1093.5]
["RDT-CFNC-0200B-QS7",200,"1Ph","240V","2Pole/3Wire","NEMA 3R","Aluminum",24,null,"X","X",null,null,null,{"$f":"P16*$T$3","v":0},{"$f":"ATS_PL!P16","v":1590},{"$f":"ATS_PL!Q16","v":1295},{"$f":"ATS_PL!R16","v":1270},1748.2500000000002,1714.5]
["RDT-CFNC-400A-QS10",400,"1Ph","240V","2Pole/3Wire","NEMA 3R","Aluminum","",null,"X",null,null,null,"X",{"$f":"P17*$T$3","v":0},{"$f":"ATS_PL!P17","v":2730},{"$f":"ATS_PL!Q17","v":2230},{"$f":"ATS_PL!R17","v":2185},3010.5,2949.75]
["RDT-CFNC-400A-QS11",400,"1Ph","240V","2Pole/3Wire","NEMA 3R","Aluminum","",null,null,null,"X",null,"X",{"$f":"P18*$T$3","v":0},{"$f":"ATS_PL!P18","v":2790},{"$f":"ATS_PL!Q18","v":2275},{"$f":"ATS_PL!R18","v":2230},3071.25,3010.5]
["RDT-CFNC-200ASEQS4",200,"1Ph","240V","2Pole/3Wire","NEMA 3R","Aluminum","","X","X",null,null,null,"X",{"$f":"P19*$T$3","v":0},{"$f":"ATS_PL!P19","v":1725},{"$f":"ATS_PL!Q19","v":1410},{"$f":"ATS_PL!R19","v":1380},1903.5000000000002,1863.0000000000002]
["RDT-CFNC-200BSEQS3",200,"1Ph","240V","2Pole/3Wire","NEMA 3R","Aluminum",42,"X","X",null,null,null,null,{"$f":"P20*$T$3","v":0},{"$f":"ATS_PL!P20","v":1820},{"$f":"ATS_PL!Q20","v":1485},{"$f":"ATS_PL!R20","v":1455},2004.7500000000002,1964.2500000000002]
["RDT-CFNC-400ASEQS5",400,"1Ph","240V","2Pole/3Wire","NEMA 3R","Aluminum","","X","X",null,null,null,"X",{"$f":"P21*$T$3","v":0},{"$f":"ATS_PL!P21","v":4530},{"$f":"ATS_PL!Q21","v":3700},{"$f":"ATS_PL!R21","v":3625},4995,4893.75]
["GM85273-SA6",100,"1Ph","240V","2Pole/3Wire","NEMA 1","Steel",12,null,"X",null,null,null,null,{"$f":"P22*$T$3","v":0},{"$f":"ATS_PL!P22","v":635},{"$f":"ATS_PL!Q22","v":520},{"$f":"ATS_PL!R22","v":510},702,688.5]
["RXT-JFNA-0100B-QS5",100,"1Ph","240V","2Pole/3Wire","NEMA 1","Steel","16",null,"X",null,null,null,null,{"$f":"P23*$T$3","v":0},{"$f":"ATS_PL!P23","v":685},{"$f":"ATS_PL!Q23","v":560},{"$f":"ATS_PL!R23","v":550},756,742.5]
["RXT-JFNC-0100B-QS4",100,"1Ph","240V","2Pole/3Wire","NEMA 3R","Aluminum","16",null,"X",null,null,null,null,{"$f":"P24*$T$3","v":0},{"$f":"ATS_PL!P24","v":740},{"$f":"ATS_PL!Q24","v":600},{"$f":"ATS_PL!R24","v":590},810,796.5]
["RXT-JFNC-0100A-QS7",100,"1Ph","240V","2Pole/3Wire","NEMA 3R","Aluminum",null,null,"X",null,"X","X",null,{"$f":"P25*$T$3","v":0},{"$f":"ATS_PL!P25","v":645},{"$f":"ATS_PL!Q25","v":525},{"$f":"ATS_PL!R25","v":515},708.75,695.25]
["RXT-JFNC-0200A-QS7",200,"1Ph","240V","2Pole/3Wire","NEMA 3R","Aluminum",null,null,"X",null,"X","X",null,{"$f":"P26*$T$3","v":0},{"$f":"ATS_PL!P26","v":930},{"$f":"ATS_PL!Q26","v":760},{"$f":"ATS_PL!R26","v":745},1026,1005.7500000000001]
["RXT-JFNC-0400A-QS5",400,"1Ph","240V","2Pole/3Wire","NEMA 3R","Aluminum",null,null,"X",null,null,"X",null,{"$f":"P27*$T$3","v":0},{"$f":"ATS_PL!P27","v":2715},{"$f":"ATS_PL!Q27","v":2215},{"$f":"ATS_PL!R27","v":2170},2990.25,2929.5]
["RXT-JFNC-400A-MV07",400,"1Ph","240V","2Pole/3Wire","NEMA 3R","Aluminum",null,null,null,null,"X","X",null,{"$f":"P28*$T$3","v":0},{"$f":"ATS_PL!P28","v":2460},{"$f":"ATS_PL!Q28","v":2010},{"$f":"ATS_PL!R28","v":1970},2713.5,2659.5]
["RXT-JFNC-100ASEQS4",100,"1Ph","240V","2Pole/3Wire","NEMA 3R","Aluminum",null,"X","X",null,null,"X",null,{"$f":"P29*$T$3","v":0},{"$f":"ATS_PL!P29","v":795},{"$f":"ATS_PL!Q29","v":650},{"$f":"ATS_PL!R29","v":635},877.50000000000011,857.25]
["RXT-JFNC-150ASEQS3",150,"1Ph","240V","2Pole/3Wire","NEMA 3R","Aluminum",null,"X","X",null,null,"X",null,{"$f":"P30*$T$3","v":0},{"$f":"ATS_PL!P30","v":1090},{"$f":"ATS_PL!Q30","v":890},{"$f":"ATS_PL!R30","v":870},1201.5,1174.5]
["RXT-JFNC-200ASEQS4",200,"1Ph","240V","2Pole/3Wire","NEMA 3R","Aluminum",null,"X","X",null,null,"X",null,{"$f":"P31*$T$3","v":0},{"$f":"ATS_PL!P31","v":1005},{"$f":"ATS_PL!Q31","v":890},{"$f":"ATS_PL!R31","v":870},1201.5,1174.5]
["RXT-JFNC-300ASEQS4",300,"1Ph","240V","2Pole/3Wire","NEMA 3R","Aluminum",null,"X","X",null,null,"X",null,{"$f":"P32*$T$3","v":0},{"$f":"ATS_PL!P32","v":4295},{"$f":"ATS_PL!Q32","v":3505},{"$f":"ATS_PL!R32","v":3435},4731.75,4637.25]
["RXT-JFNC300CSEMV01",300,"1Ph","240V","2Pole/3Wire","NEMA 3R","Aluminum",null,"X",null,null,"X","X",null,{"$f":"P33*$T$3","v":0},{"$f":"ATS_PL!P33","v":4295},{"$f":"ATS_PL!Q33","v":3505},{"$f":"ATS_PL!R33","v":3435},4731.75,4637.25]
["RXT-JFNC-400ASEQS4",400,"1Ph","240V","2Pole/3Wire","NEMA 3R","Aluminum",null,"X","X",null,null,"X",null,{"$f":"P34*$T$3","v":0},{"$f":"ATS_PL!P34","v":4295},{"$f":"ATS_PL!Q34","v":3505},{"$f":"ATS_PL!R34","v":3435},4731.75,4637.25]
["RXT-JFNC-400CSEQS",400,"1Ph","240V","2Pole/3Wire","NEMA 3R","Aluminum",null,"X",null,null,"X","X",null,{"$f":"P35*$T$3","v":0},{"$f":"ATS_PL!P35","v":4295},{"$f":"ATS_PL!Q35","v":3505},{"$f":"ATS_PL!R35","v":3435},4731.75,4637.25]
["RXT-JFNC-100CSEQS3",100,"1Ph","240V","2Pole/3Wire","NEMA 3R","Aluminum",null,"X",null,null,"X","X",null,{"$f":"P36*$T$3","v":0},{"$f":"ATS_PL!P36","v":940},{"$f":"ATS_PL!Q36","v":765},{"$f":"ATS_PL!R36","v":750},1032.75,1012.5000000000001]
["RXT-JFNC-200CSEQS3",200,"1Ph","240V","2Pole/3Wire","NEMA 3R","Aluminum",null,"X",null,null,"X","X",null,{"$f":"P37*$T$3","v":0},{"$f":"ATS_PL!P37","v":1300},{"$f":"ATS_PL!Q37","v":1060},{"$f":"ATS_PL!R37","v":1040},1431,1404]
["3 Phase - UL"]
["RXT-JCTC-0100A-QS4",100,"3Ph","208V","3Pole/4Wire","NEMA 3R","Aluminum",null,null,"X",null,null,null,null,{"$f":"P39*$T$3","v":0},{"$f":"ATS_PL!P39","v":1090},{"$f":"ATS_PL!Q39","v":890},{"$f":"ATS_PL!R39","v":870},{"$f":"Q39*$U$5","v":1201.5},{"$f":"R39*$U$5","v":1174.5}]
["RXT-JFTC-0100A-QS4",100,"3Ph","240V","3Pole/4Wire","NEMA 3R","Aluminum",null,null,"X",null,null,null,null,{"$f":"P40*$T$3","v":0},{"$f":"ATS_PL!P40","v":1090},{"$f":"ATS_PL!Q40","v":890},{"$f":"ATS_PL!R40","v":870},{"$f":"Q40*$U$5","v":1201.5},1174.5]
["RXT-JMTC-0100A-QS4",100,"3Ph","480V","3Pole/4Wire","NEMA 3R","Aluminum",null,null,"X",null,null,null,null,{"$f":"P41*$T$3","v":0},{"$f":"ATS_PL!P41","v":1230},{"$f":"ATS_PL!Q41","v":1005},{"$f":"ATS_PL!R41","v":985},1356.75,1329.75]
["RXT-JCTC-0200A-QS4",200,"3Ph","208V","3Pole/4Wire","NEMA 3R","Aluminum",null,null,"X",null,null,null,null,{"$f":"P42*$T$3","v":0},{"$f":"ATS_PL!P42","v":1660},{"$f":"ATS_PL!Q42","v":1355},{"$f":"ATS_PL!R42","v":1330},1829.2500000000002,1795.5000000000002]
["RXT-JFTC-0200A-QS4",200,"3Ph","240V","3Pole/4Wire","NEMA 3R","Aluminum",null,null,"X",null,null,null,null,{"$f":"P43*$T$3","v":0},{"$f":"ATS_PL!P43","v":1660},{"$f":"ATS_PL!Q43","v":1355},{"$f":"ATS_PL!R43","v":1330},1829.2500000000002,1795.5000000000002]
["RXT-JMTC-0200A-QS3",200,"3Ph","480V","3Pole/4Wire","NEMA 3R","Aluminum",null,null,"X",null,null,null,null,{"$f":"P44*$T$3","v":0},{"$f":"ATS_PL!P44","v":1790},{"$f":"ATS_PL!Q44","v":1460},{"$f":"ATS_PL!R44","v":1430},1971.0000000000002,1930.5000000000002]
["RXT-JCTC-400A-MV06",400,"3Ph","208V","3Pole/4Wire","NEMA 3R","Aluminum",null,null,"X",null,null,null,null,{"$f":"P45*$T$3","v":0},{"$f":"ATS_PL!P45","v":2905},{"$f":"ATS_PL!Q45","v":2370},{"$f":"ATS_PL!R45","v":2325},3199.5,3138.75]
["RXT-JFTC-400A-MV06",400,"3Ph","240V","3Pole/4Wire","NEMA 3R","Aluminum",null,null,"X",null,null,null,null,{"$f":"P46*$T$3","v":0},{"$f":"ATS_PL!P46","v":2905},{"$f":"ATS_PL!Q46","v":2370},{"$f":"ATS_PL!R46","v":2325},3199.5,3138.75]
["RXT-JMTC-0400A-QS3",400,"3Ph","480V","3Pole/4Wire","NEMA 3R","Aluminum",null,null,"X",null,null,null,null,{"$f":"P47*$T$3","v":0},{"$f":"ATS_PL!P47","v":3245},{"$f":"ATS_PL!Q47","v":2650},{"$f":"ATS_PL!R47","v":2595},3577.5000000000005,3503.2500000000005]
["RXT-JCVC-100A-MV06",100,"3Ph","208V","4Pole/4Wire","NEMA 3R","Aluminum",null,null,"X",null,null,null,null,{"$f":"P48*$T$3","v":0},{"$f":"ATS_PL!P48","v":1740},{"$f":"ATS_PL!Q48","v":1420},{"$f":"ATS_PL!R48","v":1390},1917.0000000000002,1876.5000000000002]
["RXT-JFVC-100A-MV06",100,"3Ph","240V","4Pole/4Wire","NEMA 3R","Aluminum",null,null,"X",null,null,null,null,{"$f":"P49*$T$3","v":0},{"$f":"ATS_PL!P49","v":1740},{"$f":"ATS_PL!Q49","v":1420},{"$f":"ATS_PL!R49","v":1390},1917.0000000000002,1876.5000000000002]
["RXT-JMVC-100A-MV06",100,"3Ph","480V","4Pole/4Wire","NEMA 3R","Aluminum",null,null,"X",null,null,null,null,{"$f":"P50*$T$3","v":0},{"$f":"ATS_PL!P50","v":1875},{"$f":"ATS_PL!Q50","v":1530},{"$f":"ATS_PL!R50","v":1500},2065.5,2025.0000000000002]
["RXT-JCVC-200A-MV06",200,"3Ph","208V","4Pole/4Wire","NEMA 3R","Aluminum",null,null,"X",null,null,null,null,{"$f":"P51*$T$3","v":0},{"$f":"ATS_PL!P51","v":2140},{"$f":"ATS_PL!Q51","v":1745},{"$f":"ATS_PL!R51","v":1710},2355.75,2308.5]
["RXT-JFVC-200A-MV06",200,"3Ph","240V","4Pole/4Wire","NEMA 3R","Aluminum",null,null,"X",null,null,null,null,{"$f":"P52*$T$3","v":0},{"$f":"ATS_PL!P52","v":2140},{"$f":"ATS_PL!Q52","v":1745},{"$f":"ATS_PL!R52","v":1710},2355.75,2308.5]
["RXT-JMVC-200A-MV06",200,"3Ph","480V","4Pole/4Wire","NEMA 3R","Aluminum",null,null,"X",null,null,null,null,{"$f":"P53*$T$3","v":0},{"$f":"ATS_PL!P53","v":2290},{"$f":"ATS_PL!Q53","v":1865},{"$f":"ATS_PL!R53","v":1830}]
["RXT-JCVC-400A-MV06",400,"3Ph","208V","4Pole/4Wire","NEMA 3R","Aluminum",null,null,"X",null,null,null,null,{"$f":"P54*$T$3","v":0},{"$f":"ATS_PL!P54","v":3655},{"$f":"ATS_PL!Q54","v":2985},{"$f":"ATS_PL!R54","v":2925}]
["RXT-JFVC-400A-MV06",400,"3Ph","240V","4Pole/4Wire","NEMA 3R","Aluminum",null,null,"X",null,null,null,null,{"$f":"P55*$T$3","v":0},{"$f":"ATS_PL!P55","v":3655},{"$f":"ATS_PL!Q55","v":2985},{"$f":"ATS_PL!R55","v":2925}]
["RXT-JMVC-400A-MV06",400,"3Ph","480V","4Pole/4Wire","NEMA 3R","Aluminum","",null,"X",null,null,null,null,{"$f":"P56*$T$3","v":0},{"$f":"ATS_PL!P56","v":4005},{"$f":"ATS_PL!Q56","v":3270},{"$f":"ATS_PL!R56","v":3205}]
["3 Phase - CSA"]
["RXT-JCTC-100A-MV03",100,"3Ph","208V","3Pole/4Wire","NEMA 3R","Aluminum","",null,"X",null,"X",null,null,{"$f":"P58*$T$3","v":0},{"$f":"ATS_PL!P58","v":1180},{"$f":"ATS_PL!Q58","v":965},{"$f":"ATS_PL!R58","v":945},{"$f":"Q58*$U$5","v":1302.75},1275.75]
["RXT-JFTC-100A-MV03",100,"3Ph","240V","3Pole/4Wire","NEMA 3R","Aluminum","",null,"X",null,"X",null,null,{"$f":"P59*$T$3","v":0},{"$f":"ATS_PL!P59","v":1180},{"$f":"ATS_PL!Q59","v":965},{"$f":"ATS_PL!R59","v":945},1302.75,1275.75]
["RXT-JMTC-100A-MV04",100,"3Ph","480V","3Pole/4Wire","NEMA 3R","Aluminum","",null,"X",null,"X",null,null,{"$f":"P60*$T$3","v":0},{"$f":"ATS_PL!P60","v":1320},{"$f":"ATS_PL!Q60","v":1075},{"$f":"ATS_PL!R60","v":1055},1451.25,1424.25]
["RXT-JCTC-200A-MV03",200,"3Ph","208V","3Pole/4Wire","NEMA 3R","Aluminum","",null,"X",null,"X",null,null,{"$f":"P61*$T$3","v":0},{"$f":"ATS_PL!P61","v":1700},{"$f":"ATS_PL!Q61","v":1390},{"$f":"ATS_PL!R61","v":1360},1876.5000000000002,1836.0000000000002]
["RXT-JFTC-200A-MV03",200,"3Ph","240V","3Pole/4Wire","NEMA 3R","Aluminum","",null,"X",null,"X",null,null,{"$f":"P62*$T$3","v":0},{"$f":"ATS_PL!P62","v":1700},{"$f":"ATS_PL!Q62","v":1390},{"$f":"ATS_PL!R62","v":1360},1876.5000000000002,1836.0000000000002]
["RXT-JMTC-200A-MV04",200,"3Ph","480V","3Pole/4Wire","NEMA 3R","Aluminum","",null,"X",null,"X",null,null,{"$f":"P63*$T$3","v":0},{"$f":"ATS_PL!P63","v":1845},{"$f":"ATS_PL!Q63","v":1505},{"$f":"ATS_PL!R63","v":1475},2031.7500000000002,1991.2500000000002]
["RXT-JCTC-400A-MV07",400,"3Ph","208V","3Pole/4Wire","NEMA 3R","Aluminum","",null,"X",null,"X",null,null,{"$f":"P64*$T$3","v":0},{"$f":"ATS_PL!P64","v":2950},{"$f":"ATS_PL!Q64","v":2410},{"$f":"ATS_PL!R64","v":2360},3253.5,3186]
["RXT-JFTC-400A-MV07",400,"3Ph","240V","3Pole/4Wire","NEMA 3R","Aluminum","",null,"X",null,"X",null,null,{"$f":"P65*$T$3","v":0},{"$f":"ATS_PL!P65","v":2950},{"$f":"ATS_PL!Q65","v":2410},{"$f":"ATS_PL!R65","v":2360},3253.5,3186]
["RXT-JMTC-400A-MV04",400,"3Ph","480V","3Pole/4Wire","NEMA 3R","Aluminum","",null,"X",null,"X",null,null,{"$f":"P66*$T$3","v":0},{"$f":"ATS_PL!P66","v":3295},{"$f":"ATS_PL!Q66","v":2690},{"$f":"ATS_PL!R66","v":2635},3631.5000000000005,3557.2500000000005]
["RXT-JCVC-100A-MV07",100,"3Ph","208V","4Pole/4Wire","NEMA 3R","Aluminum","",null,"X",null,"X",null,null,{"$f":"P67*$T$3","v":0},{"$f":"ATS_PL!P67","v":1780},{"$f":"ATS_PL!Q67","v":1455},{"$f":"ATS_PL!R67","v":1425},1964.2500000000002,1923.7500000000002]
["RXT-JFVC-100A-MV07",100,"3Ph","240V","4Pole/4Wire","NEMA 3R","Aluminum","",null,"X",null,"X",null,null,{"$f":"P68*$T$3","v":0},{"$f":"ATS_PL!P68","v":1780},{"$f":"ATS_PL!Q68","v":1455},{"$f":"ATS_PL!R68","v":1425},1964.2500000000002,1923.7500000000002]
["RXT-JMVC-100A-MV07",100,"3Ph","480V","4Pole/4Wire","NEMA 3R","Aluminum","",null,"X",null,"X",null,null,{"$f":"P69*$T$3","v":0},{"$f":"ATS_PL!P69","v":1920},{"$f":"ATS_PL!Q69","v":1565},{"$f":"ATS_PL!R69","v":1535},2112.75,2072.25]
["RXT-JCVC-200A-MV07",200,"3Ph","208V","4Pole/4Wire","NEMA 3R","Aluminum","",null,"X",null,"X",null,null,{"$f":"P70*$T$3","v":0},{"$f":"ATS_PL!P70","v":2190},{"$f":"ATS_PL!Q70","v":1785},{"$f":"ATS_PL!R70","v":1750},2409.75,2362.5]
["RXT-JFVC-200A-MV07",200,"3Ph","240V","4Pole/4Wire","NEMA 3R","Aluminum","",null,"X",null,"X",null,null,{"$f":"P71*$T$3","v":0},{"$f":"ATS_PL!P71","v":2190},{"$f":"ATS_PL!Q71","v":1785},{"$f":"ATS_PL!R71","v":1750},2409.75,2362.5]
["RXT-JMVC-200A-MV07",200,"3Ph","480V","4Pole/4Wire","NEMA 3R","Aluminum","",null,"X",null,"X",null,null,{"$f":"P72*$T$3","v":0},{"$f":"ATS_PL!P72","v":2330},{"$f":"ATS_PL!Q72","v":1905},{"$f":"ATS_PL!R72","v":1865},2571.75,2517.75]
["RXT-JCVC-400A-MV07",400,"3Ph","208V","4Pole/4Wire","NEMA 3R","Aluminum","",null,"X",null,"X",null,null,{"$f":"P73*$T$3","v":0},{"$f":"ATS_PL!P73","v":3700},{"$f":"ATS_PL!Q73","v":3020},{"$f":"ATS_PL!R73","v":2960},4077.0000000000005,3996.0000000000005]
["RXT-JFVC-400A-MV07",400,"3Ph","240V","4Pole/4Wire","NEMA 3R","Aluminum","",null,"X",null,"X",null,null,{"$f":"P74*$T$3","v":0},{"$f":"ATS_PL!P74","v":3700},{"$f":"ATS_PL!Q74","v":3020},{"$f":"ATS_PL!R74","v":2960},4077.0000000000005,3996.0000000000005]
["RXT-JMVC-400A-MV07",400,"3Ph","480V","4Pole/4Wire","NEMA 3R","Aluminum","",null,"X",null,"X",null,null,{"$f":"P75*$T$3","v":0},{"$f":"ATS_PL!P75","v":4060},{"$f":"ATS_PL!Q75","v":3315},{"$f":"ATS_PL!R75","v":3250},4475.25,4387.5]
["Industrial"]
["KEP-DFNC-400NK-QS1",400,"1Ph","240V","2Pole/3Wire","NEMA 3R","Steel","","X","X",null,null,null,null,{"$f":"P77*$T$3","v":0},{"$f":"ATS_PL!P77","v":11841},{"$f":"ATS_PL!Q77","v":11604.18},{"$f":"ATS_PL!R77","v":9472.8000000000011}]
["KEP-DCTC-400NK-QS1",400,"3Ph","208V","3Pole/4Wire","NEMA 3R","Steel","","X","X",null,null,null,null,{"$f":"P78*$T$3","v":0},{"$f":"ATS_PL!P78","v":12363},{"$f":"ATS_PL!Q78","v":12115.74},{"$f":"ATS_PL!R78","v":9890.4000000000015}]
["KEP-DCTC-600NK-QS1",600,"3Ph","208V","3Pole/4Wire","NEMA 3R","Steel","","X","X",null,null,null,null,{"$f":"P79*$T$3","v":0},{"$f":"ATS_PL!P79","v":17628},{"$f":"ATS_PL!Q79","v":17275.439999999999},{"$f":"ATS_PL!R79","v":14102.400000000001}]
["KEP-DFNC-600NK-QS4",600,"1Ph","240V","2Pole/3Wire","NEMA 3R","Steel","","X","X",null,null,null,null,{"$f":"P80*$T$3","v":0},{"$f":"ATS_PL!P80","v":17105},{"$f":"ATS_PL!Q80","v":16762.900000000001},{"$f":"ATS_PL!R80","v":13684}]
["KEP-DCTC-800NK-QS1",800,"3Ph","208V","3Pole/4Wire","NEMA 3R","Steel","","X","X",null,null,null,null,{"$f":"P81*$T$3","v":0},{"$f":"ATS_PL!P81","v":20690},{"$f":"ATS_PL!Q81","v":20276.2},{"$f":"ATS_PL!R81","v":16552},{"$f":"Q81*$U$5","v":27372.870000000003},22345.200000000001]
["KEP-DFNC-800NK-QS3 ",800,"1Ph","240V","2Pole/3Wire","NEMA 3R","Steel","","X","X",null,null,null,null,{"$f":"P82*$T$3","v":0},{"$f":"ATS_PL!P82","v":20170},{"$f":"ATS_PL!Q82","v":19766.599999999999},{"$f":"ATS_PL!R82","v":16136},26684.91,21783.600000000002]
["KSS-ACTC-0400S-QS2",400,"3Ph","208V","3Pole/4Wire","NEMA 3R","Steel",null,null,null,null,null,null,null,{"$f":"P83*$T$3","v":0},{"$f":"ATS_PL!P83","v":7536},{"$f":"ATS_PL!Q83","v":7385.28},{"$f":"ATS_PL!R83","v":6028.8},9970.1280000000006,8138.880000000001]
["KSS-ACTC-0600S-QS1",600,"3Ph","208V","3Pole/4Wire","NEMA 3R","Steel","",null,"X",null,"X",null,null,{"$f":"P84*$T$3","v":0},{"$f":"ATS_PL!P84","v":10963},{"$f":"ATS_PL!Q84","v":10743.74},{"$f":"ATS_PL!R84","v":8770.4},14504.049000000001,11840.04]
["KSS-ACTC-0800S-QS1",800,"3Ph","208V","3Pole/4Wire","NEMA 3R","Steel","",null,"X",null,"X",null,null,{"$f":"P85*$T$3","v":0},{"$f":"ATS_PL!P85","v":12794},{"$f":"ATS_PL!Q85","v":12538.119999999999},{"$f":"ATS_PL!R85","v":10235.200000000001},16926.462,13817.520000000002]
["KSS-AFTC-0800S-QS1",800,"3Ph","240V","3Pole/4Wire","NEMA 3R","Steel",null,null,"X",null,"X",null,null,{"$f":"P86*$T$3","v":0},{"$f":"ATS_PL!P86","v":12794},{"$f":"ATS_PL!Q86","v":12538.119999999999},{"$f":"ATS_PL!R86","v":10235.200000000001},16926.462,13817.520000000002]
["KSS-AFNC-0600S-QS1",600,"1Ph","240V","2Pole/3Wire","NEMA 3R","Steel",null,null,"X",null,null,null,null,{"$f":"P87*$T$3","v":0},{"$f":"ATS_PL!P87","v":10289},{"$f":"ATS_PL!Q87","v":10083.219999999999},{"$f":"ATS_PL!R87","v":8231.2000000000007},13612.347,11112.120000000003]
["KSS-JFTC-0800S-QS1",800,"3Ph","240V","3Pole/4Wire","NEMA 3R","Steel",null,null,"X",null,null,null,null,{"$f":"P88*$T$3","v":0},{"$f":"ATS_PL!P88","v":8270},{"$f":"ATS_PL!Q88","v":8104.5999999999995},{"$f":"ATS_PL!R88","v":6616},10941.21,8931.6]

{"sheet":"ATS_PARTS_PL","index":7,"n_rows":38,"n_cols":11,"rows_kept":38,"cut":false,"hidden":false,"merged":[[2,2,2,3],[25,7,26,9]]}
[null,null,null,null,null,null,null,null,null,null,{"$f":"Generators_PL!H1","v":"Residential Price List"}]
[null,null,null,null,null,null,null,null,null,null,{"$f":"Generators_PL!H2","v":"EFFECTIVE DATE: 05/01/2023"}]
[null,null,null,null,null,null,null,null,null,null,{"$f":"Generators_PL!H3","v":"Pricing is in USD"}]
[null,null,null,null,null,null,null,null,{"$f":"Generators_PL!F4","v":0}]
[null,null,"Please click on the following link to access Accessory Kit Pricing",":AMP STOCK ORDERS"]
["OLD PART NUMBER (superseded by the New Part Number starting on 4/3/2023)","NEW PART NUMBER ","Description","RDT","RXT","Compatible w/ Contactor","Service Entrance","Net Price","Aftermarket Parts\nList Price","MSRP","MAP"]
["RESIDENTIAL ATS LOOSE ACCESSORIES PRICE LIST"]
[]
["GM84662-KP1-QS","GM84662-S1","Status Indicator Module",null,"X",null,null,{"$f":"I9*I$4","v":0},{"$f":"VLOOKUP(B9,'[4]AMP List Prices'!$A:$D,4,FALSE)","v":40}]
["GM84662-KP2-QS","GM84662-S2","Status Indicator Module, Load Control",null,"X",null,null,{"$f":"I10*I$4","v":0},{"$f":"VLOOKUP(B10,'[4]AMP List Prices'!$A:$D,4,FALSE)","v":55}]
["GM29856-KP1","GM29856-S1","Auxiliary Contacts, 100-200A","X","X","GM71468\nGM71469\nGM80547\nGM80549","X",0,{"$f":"VLOOKUP(B11,'[4]AMP List Prices'!$A:$D,4,FALSE)","v":70}]
["GM104789-KP1","GM104789-S1","Auxiliary Contacts, 100-200A","X","X","GM103487\nGM103488\nGM103489\nGM103490\nGM103491\nGM103492","X",0,{"$f":"VLOOKUP(B12,'[4]AMP List Prices'!$A:$D,4,FALSE)","v":14}]
["GM100830-KP1","GM100830-S1","Auxiliary Contacts, 400A","X","X","GM80139\nGM80140\nGM80551\nGM81111\nGM88426\nGM88427","X",0,{"$f":"VLOOKUP(B13,'[4]AMP List Prices'!$A:$D,4,FALSE)","v":32}]
["GM104558-KP1","GM104558-S1","Auxiliary Circuit Breaker kit, 15A, 100-200A",null,"X",null,"X Only",0,{"$f":"VLOOKUP(B14,'[4]AMP List Prices'!$A:$D,4,FALSE)","v":57}]
["GM104558-KP2","GM104558-S2","Auxiliary Circuit Breaker kit, 15A,  400A - Legacy",null,"X",null,"X Only",0,{"$f":"VLOOKUP(B15,'[4]AMP List Prices'!$A:$D,4,FALSE)","v":56}]
["GM104558-KP3","GM104558-S3","Aux Circuit Breaker, 15A, 300-400A",null,"X",null,"X",0,{"$f":"VLOOKUP(B16,'[4]AMP List Prices'!$A:$D,4,FALSE)","v":46}]
["GM104558-KP4","GM104558-S4","Aux Circuit Breaker, 20A, 100-200A",null,"X",null,"X",0,{"$f":"VLOOKUP(B17,'[4]AMP List Prices'!$A:$D,4,FALSE)","v":56}]
["GM104558-KP5","GM104558-S5","Aux Circuit Breaker, 20A, 400A - Legacy",null,"X",null,"X",0,{"$f":"VLOOKUP(B18,'[4]AMP List Prices'!$A:$D,4,FALSE)","v":68}]
["GM104558-KP6","GM104558-S6","Aux Circuit Breaker, 20A, 300-400A",null,"X",null,"X",0,{"$f":"VLOOKUP(B19,'[4]AMP List Prices'!$A:$D,4,FALSE)","v":56}]
["GM92001-KP1-QS","GM92001-1","Power Relay Module (PRM)","X","X",null,null,0,{"$f":"VLOOKUP(B20,'[4]AMP List Prices'!$A:$D,4,FALSE)","v":160}]
["GM38795-KP1","GM38795-S","External Alarm Module","X",null,null,null,0,{"$f":"VLOOKUP(B21,'[4]AMP List Prices'!$A:$D,4,FALSE)","v":252.95}]
["GM38796-KP1","GM38796-S","Accessory Board","X",null,null,null,0,{"$f":"VLOOKUP(B22,'[4]AMP List Prices'!$A:$D,4,FALSE)","v":249}]
["GM38799-KP2","GM38799-S2","Bezel","X",null,null,null,0,{"$f":"VLOOKUP(B23,'[4]AMP List Prices'!$A:$D,4,FALSE)","v":50}]
["GM17250-KP1-QS","GM17250-S1","Current Transformer, 400A","X",null,null,null,0,{"$f":"VLOOKUP(B24,'[4]AMP List Prices'!$A:$D,4,FALSE)","v":187}]
["GM17250-KP2-QS","GM17250-S2","Current Transformer, 500A","X",null,null,null,0,{"$f":"VLOOKUP(B25,'[4]AMP List Prices'!$A:$D,4,FALSE)","v":187}]
["GM47597-KP2","GM47597-S2","Programmable Exerciser, 100 -200A","X",null,null,null,"Email: \nResi-Aftermarketparts@kohler.com for pricing"]
["GM47597-KP1","GM47597-S1","Programmable Exerciser, 400A, 200A SE & 400A SE","X",null,null,"X"]
["GM49867-KP1","GM49867-S1","Circuit Breaker Option Disconnect","X",null,null,"X",0,{"$f":"VLOOKUP(B28,'[4]AMP List Prices'!$A:$D,4,FALSE)","v":19}]
["GM87869-KP1","GM87869-S1","Space Heater w/Hygrostat","X",null,null,"X",0,{"$f":"VLOOKUP(B29,'[4]AMP List Prices'!$A:$D,4,FALSE)","v":680}]
["GM88281-KP1-QS","GM88281-1","Load Shed","X",null,null,"X",0,{"$f":"VLOOKUP(B30,'[4]AMP List Prices'!$A:$D,4,FALSE)","v":286}]
["GM87487-KP1","GM87487-S1","SPD (Normal Side Only)","X",null,null,"X",0,{"$f":"VLOOKUP(B31,'[4]AMP List Prices'!$A:$D,4,FALSE)","v":425}]
["GM87487-KP2","GM87487-S2","SPD (Normal & Emergency)","X",null,null,"X",0,{"$f":"VLOOKUP(B32,'[4]AMP List Prices'!$A:$D,4,FALSE)","v":750}]
["GM39334-KP","No Change ","Production Literature","X",null,null,null,0,{"$f":"VLOOKUP($A33,'[2]CURRENT PRICING'!$B:$F,3,FALSE)","v":15}]
["GM84653-KP","No Change ","Production Literature",null,"X",null,null,0,{"$f":"VLOOKUP($A34,'[2]CURRENT PRICING'!$B:$F,3,FALSE)","v":15}]
["GM39335-KP","No Change ","Technical Literature","X",null,null,null,0,{"$f":"VLOOKUP($A35,'[2]CURRENT PRICING'!$B:$F,3,FALSE)","v":40}]
["GM84652-KP","No Change ","Technical Literature",null,"X",null,null,0,{"$f":"VLOOKUP($A36,'[2]CURRENT PRICING'!$B:$F,3,FALSE)","v":40}]
["GM118076","No Change ","7 Year Comprehensive Warranty","X","X",null,null,0,{"$f":"VLOOKUP($A37,'[2]CURRENT PRICING'!$B:$F,3,FALSE)","v":195}]
["GM118077","No Change ","10 Year Comprehensive Warranty","X","X",null,null,0,{"$f":"VLOOKUP($A38,'[2]CURRENT PRICING'!$B:$F,3,FALSE)","v":295}]

{"sheet":"PORTABLES PRICING ANALYSIS","index":8,"n_rows":14,"n_cols":19,"rows_kept":14,"cut":false,"hidden":true,"merged":[]}
[null,null,null,null,null,0.64,null,0.67332999999999998,null,0.65353000000000006,null,0.70587999999999995,null,0.63724999999999998,null,0.64705999999999997,null,0.69313999999999998]
["Model","COST","MAP","MSRP","LIST","DIST","% Margin","Wholesale - Silver","% Margin","Wholesale - Platinum","% Margin","Etail - Silver","% Margin","Etail - Platinum","% Margin","Etail - Gold","% Margin","Retail","% Margin"]
["PA-eGen18iS-3001",{"$f":"63333/100","v":633.33000000000004},{"$f":"VLOOKUP(A3,PORTABLES_PL!$A:$T,13,FALSE)","v":26},{"$f":"VLOOKUP(A3,PORTABLES_PL!$A:$S,12,FALSE)","v":18},{"$f":"VLOOKUP(A3,PORTABLES_PL!$A:$U,14,FALSE)","v":"N/A"},{"$f":"$E3*F$1","v":{"$error":"#VALUE!"}},{"$f":"(F3-B3)/F3","v":{"$error":"#VALUE!"}},{"$f":"$E3*H$1","v":{"$error":"#VALUE!"}},{"$f":"(H3-B3)/H3","v":{"$error":"#VALUE!"}},{"$f":"$E3*J$1","v":{"$error":"#VALUE!"}},{"$f":"(J3-B3)/J3","v":{"$error":"#VALUE!"}},{"$f":"$E3*L$1","v":{"$error":"#VALUE!"}},{"$f":"(L3-B3)/L3","v":{"$error":"#VALUE!"}},{"$f":"$E3*N$1","v":{"$error":"#VALUE!"}},{"$f":"(N3-B3)/N3","v":{"$error":"#VALUE!"}},{"$f":"$E3*P$1","v":{"$error":"#VALUE!"}},{"$f":"(P3-B3)/P3","v":{"$error":"#VALUE!"}},{"$f":"$E3*R$1","v":{"$error":"#VALUE!"}},{"$f":"(R3-B3)/R3","v":{"$error":"#VALUE!"}}]
["PA-GEN50-3003",{"$f":"50582.51/100","v":505.82510000000002},{"$f":"VLOOKUP(A4,PORTABLES_PL!$A:$T,13,FALSE)","v":24},{"$f":"VLOOKUP(A4,PORTABLES_PL!$A:$S,12,FALSE)","v":23},{"$f":"VLOOKUP(A4,PORTABLES_PL!$A:$U,14,FALSE)","v":"Y"},{"$error":"#VALUE!"},{"$f":"(F4-B4)/F4","v":{"$error":"#VALUE!"}},{"$error":"#VALUE!"},{"$f":"(H4-B4)/H4","v":{"$error":"#VALUE!"}},{"$error":"#VALUE!"},{"$f":"(J4-B4)/J4","v":{"$error":"#VALUE!"}},{"$error":"#VALUE!"},{"$f":"(L4-B4)/L4","v":{"$error":"#VALUE!"}},{"$error":"#VALUE!"},{"$f":"(N4-B4)/N4","v":{"$error":"#VALUE!"}},{"$error":"#VALUE!"},{"$f":"(P4-B4)/P4","v":{"$error":"#VALUE!"}},{"$error":"#VALUE!"},{"$f":"(R4-B4)/R4","v":{"$error":"#VALUE!"}}]
["PA-PRO64-3002",{"$f":"47306/100","v":473.06},{"$f":"VLOOKUP(A5,PORTABLES_PL!$A:$T,13,FALSE)","v":24},{"$f":"VLOOKUP(A5,PORTABLES_PL!$A:$S,12,FALSE)","v":23},{"$f":"VLOOKUP(A5,PORTABLES_PL!$A:$U,14,FALSE)","v":"Y"},{"$error":"#VALUE!"},{"$error":"#VALUE!"},{"$error":"#VALUE!"},{"$error":"#VALUE!"},{"$error":"#VALUE!"},{"$error":"#VALUE!"},{"$error":"#VALUE!"},{"$error":"#VALUE!"},{"$error":"#VALUE!"},{"$error":"#VALUE!"},{"$error":"#VALUE!"},{"$error":"#VALUE!"},{"$error":"#VALUE!"},{"$error":"#VALUE!"}]
["PA-PRO64E-3002",{"$f":"56483/100","v":564.83000000000004},{"$f":"VLOOKUP(A6,PORTABLES_PL!$A:$T,13,FALSE)","v":24},{"$f":"VLOOKUP(A6,PORTABLES_PL!$A:$S,12,FALSE)","v":23},{"$f":"VLOOKUP(A6,PORTABLES_PL!$A:$U,14,FALSE)","v":"Y"},{"$error":"#VALUE!"},{"$error":"#VALUE!"},{"$error":"#VALUE!"},{"$error":"#VALUE!"},{"$error":"#VALUE!"},{"$error":"#VALUE!"},{"$error":"#VALUE!"},{"$error":"#VALUE!"},{"$error":"#VALUE!"},{"$error":"#VALUE!"},{"$error":"#VALUE!"},{"$error":"#VALUE!"},{"$error":"#VALUE!"},{"$error":"#VALUE!"}]
["PA-PRO90-3002",{"$f":"57264/100","v":572.64},{"$f":"VLOOKUP(A7,PORTABLES_PL!$A:$T,13,FALSE)","v":24},{"$f":"VLOOKUP(A7,PORTABLES_PL!$A:$S,12,FALSE)","v":23},{"$f":"VLOOKUP(A7,PORTABLES_PL!$A:$U,14,FALSE)","v":"Y"},{"$error":"#VALUE!"},{"$error":"#VALUE!"},{"$error":"#VALUE!"},{"$error":"#VALUE!"},{"$error":"#VALUE!"},{"$error":"#VALUE!"},{"$error":"#VALUE!"},{"$error":"#VALUE!"},{"$error":"#VALUE!"},{"$error":"#VALUE!"},{"$error":"#VALUE!"},{"$error":"#VALUE!"},{"$error":"#VALUE!"},{"$error":"#VALUE!"}]
["PA-PRO90E-3002",{"$f":"64543/100","v":645.42999999999995},{"$f":"VLOOKUP(A8,PORTABLES_PL!$A:$T,13,FALSE)","v":24},{"$f":"VLOOKUP(A8,PORTABLES_PL!$A:$S,12,FALSE)","v":23},{"$f":"VLOOKUP(A8,PORTABLES_PL!$A:$U,14,FALSE)","v":"Y"},{"$error":"#VALUE!"},{"$error":"#VALUE!"},{"$error":"#VALUE!"},{"$error":"#VALUE!"},{"$error":"#VALUE!"},{"$error":"#VALUE!"},{"$error":"#VALUE!"},{"$error":"#VALUE!"},{"$error":"#VALUE!"},{"$error":"#VALUE!"},{"$error":"#VALUE!"},{"$error":"#VALUE!"},{"$error":"#VALUE!"},{"$error":"#VALUE!"}]
["PA-PRO123EFI-3001",{"$f":"267120/100","v":2671.2},{"$f":"VLOOKUP(A9,PORTABLES_PL!$A:$T,13,FALSE)","v":{"$error":"#N/A"}},{"$f":"VLOOKUP(A9,PORTABLES_PL!$A:$S,12,FALSE)","v":{"$error":"#N/A"}},{"$f":"VLOOKUP(A9,PORTABLES_PL!$A:$U,14,FALSE)","v":{"$error":"#N/A"}},{"$error":"#N/A"},{"$error":"#N/A"},{"$error":"#N/A"},{"$error":"#N/A"},{"$error":"#N/A"},{"$error":"#N/A"},{"$error":"#N/A"},{"$error":"#N/A"},{"$error":"#N/A"},{"$error":"#N/A"},{"$error":"#N/A"},{"$error":"#N/A"},{"$error":"#N/A"},{"$error":"#N/A"}]
["PA-GEN50-2003","N/A",{"$f":"VLOOKUP(A10,PORTABLES_PL!$A:$T,13,FALSE)","v":25},{"$f":"VLOOKUP(A10,PORTABLES_PL!$A:$S,12,FALSE)","v":24},{"$f":"VLOOKUP(A10,PORTABLES_PL!$A:$U,14,FALSE)","v":"Y"},{"$error":"#VALUE!"},null,{"$error":"#VALUE!"},null,{"$error":"#VALUE!"},null,{"$error":"#VALUE!"},null,{"$error":"#VALUE!"},null,{"$error":"#VALUE!"},null,{"$error":"#VALUE!"}]
["PA-PRO64-2002","N/A",{"$f":"VLOOKUP(A11,PORTABLES_PL!$A:$T,13,FALSE)","v":22.3},{"$f":"VLOOKUP(A11,PORTABLES_PL!$A:$S,12,FALSE)","v":21.4},{"$f":"VLOOKUP(A11,PORTABLES_PL!$A:$U,14,FALSE)","v":"Y"},{"$error":"#VALUE!"},null,{"$error":"#VALUE!"},null,{"$error":"#VALUE!"},null,{"$error":"#VALUE!"},null,{"$error":"#VALUE!"},null,{"$error":"#VALUE!"},null,{"$error":"#VALUE!"}]
["PA-PRO64E-2002","N/A",{"$f":"VLOOKUP(A12,PORTABLES_PL!$A:$T,13,FALSE)","v":24},{"$f":"VLOOKUP(A12,PORTABLES_PL!$A:$S,12,FALSE)","v":23},{"$f":"VLOOKUP(A12,PORTABLES_PL!$A:$U,14,FALSE)","v":"Y"},{"$error":"#VALUE!"},null,{"$error":"#VALUE!"},null,{"$error":"#VALUE!"},null,{"$error":"#VALUE!"},null,{"$error":"#VALUE!"},null,{"$error":"#VALUE!"},null,{"$error":"#VALUE!"}]
["PA-PRO90-2002","N/A",{"$f":"VLOOKUP(A13,PORTABLES_PL!$A:$T,13,FALSE)","v":24},{"$f":"VLOOKUP(A13,PORTABLES_PL!$A:$S,12,FALSE)","v":23},{"$f":"VLOOKUP(A13,PORTABLES_PL!$A:$U,14,FALSE)","v":"Y"},{"$error":"#VALUE!"},null,{"$error":"#VALUE!"},null,{"$error":"#VALUE!"},null,{"$error":"#VALUE!"},null,{"$error":"#VALUE!"},null,{"$error":"#VALUE!"},null,{"$error":"#VALUE!"}]
["PA-PRO90E-2002","N/A",{"$f":"VLOOKUP(A14,PORTABLES_PL!$A:$T,13,FALSE)","v":24},{"$f":"VLOOKUP(A14,PORTABLES_PL!$A:$S,12,FALSE)","v":23},{"$f":"VLOOKUP(A14,PORTABLES_PL!$A:$U,14,FALSE)","v":"Y"},{"$error":"#VALUE!"},null,{"$error":"#VALUE!"},null,{"$error":"#VALUE!"},null,{"$error":"#VALUE!"},null,{"$error":"#VALUE!"},null,{"$error":"#VALUE!"},null,{"$error":"#VALUE!"}]

{"sheet":"PORTABLES_PARTS","index":9,"n_rows":23,"n_cols":9,"rows_kept":23,"cut":false,"hidden":true,"merged":[]}
[null,null,null,null,null,"Distribution"]
[null,null,null,null,null,"EFFECTIVE DATE: 4/20/2020"]
[]
[]
[]
["Specification #","Description","MSRP","MAP","List Price","Net Price"]
["PORTABLE GENSETS: ACCESSORIES"]
[]
["17 755 60-S","Tri-Fuel Regulator Kit (PRO64 models)",null,null,null,null,null,null,{"$f":"$F$1&A9","v":"Distribution17 755 60-S"}]
["17 337 10-S","Natural Gas Fuel Optimizer Kit  (PRO64 models)",null,null,null,null,null,null,"Distribution17 337 10-S"]
["17 755 56-S","Natural Gas Tri-Fuel Hose Kit  (PRO64 models)",null,null,null,null,null,null,"Distribution17 755 56-S"]
["17 755 57-S","Liquid Propane Tri-Fuel Hose Kit  (PRO64 models)",null,null,null,null,null,null,"Distribution17 755 57-S"]
["33 127 01-S ","12 Volt Battery Charger ",null,null,null,null,null,null,"Distribution33 127 01-S "]
["33 755 03-S","60W Solar Panel - folding (eGEN18 compatible)",null,null,null,null,null,null,"Distribution33 755 03-S"]
["33 755 04-S","150W Panel (5' x 2' x 2\") (eGEN18 compatible)",null,null,null,null,null,null,"Distribution33 755 04-S"]
["33 755 05-S","25' Solar Extension Cord (one pair)",null,null,null,null,null,null,"Distribution33 755 05-S"]
["33 755 43-S","Solar Panel Parallel Connector Kit (eGEN18 compatible)",null,null,null,null,null,null,"Distribution33 755 43-S"]
["25 755 53-S","Wireless remote start/stop kit for PRO12.3EFI ",null,null,null,null,null,null,"Distribution25 755 53-S"]
[]
["PORTABLE GENSETS: TRANSFER SWITCHES"]
[]
["37 755 06-S","6-Circuit Transfer Switch ",null,null,null,null,null,null,{"$f":"$F$1&A22","v":"Distribution37 755 06-S"}]
["37 755 07-S","10-Circuit Transfer Switch ",null,null,null,null,null,null,{"$f":"$F$1&A23","v":"Distribution37 755 07-S"}]