{"text_format":"1","workbook":"xlsx","n_sheets":10,"sheets":["Generators_PL","Generators_PL_Canada","GENSET_ACCY_6-20kW","GENSET_ACCY_24-150kW","PORTABLES_PL","ATS_PL","ATS_PL_Canada","ATS_PARTS_PL","PORTABLES PRICING ANALYSIS","PORTABLES_PARTS"],"not_rendered":{"charts":0,"images":1,"macros":1,"external_links":4,"defined_names":18,"comments":1,"pivot_tables":0},"unopened":[],"bounds":{"document_bytes":16777216,"sheet_cells":100000,"rows_first":2000,"rows_last":500,"rows_between":2000,"halvings":0,"cell_chars":16384,"cell_head_chars":4096},"cells_cut":0,"cells_raw":0,"read":"whole","date_system":"1900"}

{"sheet":"Generators_PL","index":0,"n_rows":129,"n_cols":8,"rows_kept":129,"cut":false,"hidden":false,"merged":[[3,5,3,6],[114,0,115,7],[61,0,62,7],[9,0,10,7],[17,0,18,7],[92,0,93,7],[74,0,75,7],[36,0,37,7]]}
[null,null,null,null,null,null,null,"Residential Price List"]
[null,null,null,null,null,null,null,"EFFECTIVE DATE: 05/01/2023"]
[null,null,null,null,null,null,null,"Pricing is in USD"]
[]
["*denotes new or updated models"]
["Specification #","Description","Standby (kW)","LCB (Amp)","Net Price","List Price","MSRP","MAP"]
["RESIDENTIAL GENERATOR PRICE LIST"]
[]
["AIR-COOLED AUTOMATIC STANDBY GENERATOR, LPG, COLOR : KOHLER CASHMERE"]
["Standard Features: cUL-US Approval, Steel 58 dBA Sound Shield, Standard Air Intake, VSC Controller with 2.5-Amp Battery Charger, Flexible Fuel Line, Hydraulic Magnetic Type Breaker, Five-Year Comprehensive/ 18-Month Off-Grid Warranty, Field Convertible to Natural Gas Fuel"]
{"$rows_left_out":120}
{"sheet":"Generators_PL_Canada","index":1,"n_rows":129,"n_cols":11,"rows_kept":129,"cut":false,"hidden":false,"merged":[[4,8,4,9],[9,0,10,9],[17,0,18,9],[4,4,4,7],[36,0,37,9],[61,0,62,9],[74,0,75,9],[92,0,93,9],[114,0,115,9]]}
[null,null,null,null,null,null,null,null,null,"Residential Price List"]
[null,"CANADA",null,null,null,null,null,null,null,{"$f":"Generators_PL!H2","v":"EFFECTIVE DATE: 05/01/2023"}]
[null,null,null,null,null,null,null,null,null,{"$f":"Generators_PL!F4","v":0}]
[]
["*denotes new or updated models",null,null,null,"USD",null,null,null,"CAD",null,1.35]
["Specification #","Description","Standby (kW)","LCB (Amp)","Net Price","List Price","MSRP","MAP","MSRP","MAP"]
["RESIDENTIAL GENERATOR PRICE LIST"]
[]
["AIR-COOLED AUTOMATIC STANDBY GENERATOR, LPG, COLOR : KOHLER CASHMERE"]
["Standard Features: UL2200/CSA Approval, Steel 58 dBA Sound Shield, Standard Air Intake, VSC Controller with 2.5-Amp Battery Charger, Flexible Fuel Line, Hydraulic Magnetic Type Breaker, Five-Year Comprehensive/ 18-Month Off-Grid Warranty, Field Convertible to Natural Gas Fuel"]
{"$rows_left_out":120}
{"sheet":"GENSET_ACCY_6-20kW","index":2,"n_rows":58,"n_cols":19,"rows_kept":58,"cut":false,"hidden":false,"merged":[]}
[615,null,null,null,null,null,null,null,null,null,null,null,null,null,null,null,null,null,{"$f":"Generators_PL!H1","v":"Residential Price List"}]
[null,null,null,null,null,null,null,null,null,null,null,null,null,null,null,null,null,null,{"$f":"Generators_PL!H2","v":"EFFECTIVE DATE: 05/01/2023"}]
[null,null,null,null,null,null,null,null,null,null,null,null,null,null,null,null,null,null,{"$f":"Generators_PL!H3","v":"Pricing is in USD"}]
[null,null,null,null,{"$f":"Generators_PL!F4","v":0}]
[null,null,"Please click on the following link to access Accessory Kit Pricing",":AMP STOCK ORDERS"]
["OLD PART NUMBER (superseded by the New Part Number starting on 4/3/2023)","NEW PART NUMBER ","Description","Net Price","Aftermarket Parts \nList Price","MSRP","MAP","6VSG","8.5RES","12RES","8/10/12RESV(L)","8RESV(L)","10/12RESV(L)","14RES(L)","14RCA(L)","14RESA(L)","20RCA(L)","20RESC(L)","26RCA(L)"]
["RESIDENTIAL AIR COOLED GENSET PARTS & ACCESSORIES PRICE LIST"]
[]
["GM85144-KP1-QS","GM85144-1","PowerSync® Automatic Paralleling Module (APM)",{"$f":"E9*E$4","v":0},3150,null,null,null,null,null,null,null,null,"X","X","X","X","X"]
["GM86368-KP1-QS","GM86368-S1","Circuit Breaker Kit - 14Kw (70 Amp)",0,125,null,null,null,null,null,null,null,null,"X","X","X"]
{"$rows_left_out":49}
{"sheet":"GENSET_ACCY_24-150kW","index":3,"n_rows":41,"n_cols":16,"rows_kept":41,"cut":false,"hidden":false,"merged":[]}
[null,null,null,null,null,null,null,null,null,null,null,null,null,null,null,{"$f":"Generators_PL!H1","v":"Residential Price List"}]
[null,null,null,null,null,null,null,null,null,null,null,null,null,null,null,{"$f":"Generators_PL!H2","v":"EFFECTIVE DATE: 05/01/2023"}]
[null,null,null,null,null,null,null,null,null,null,null,null,null,null,null,{"$f":"Generators_PL!H3","v":"Pricing is in USD"}]
[null,null,null,null,{"$f":"Generators_PL!F4","v":0}]
[null,null,"Please click on the following link to access Accessory Kit Pricing",":AMP STOCK ORDERS"]
["OLD PART NUMBER (superseded by the New Part Number starting on 4/3/2023)","NEW PART NUMBER ","Description","Net Price","Aftermarket Parts \nList Price","MSRP","MAP","24RCL","30RCL","38RCLB","48RCL/RCLA/RCLB","60RCL/60RCLA","KG80R","KG100R","KG125R","150ERESC"]
["RESIDENTIAL LIQUID COOLED GENSET PARTS & ACCESSORIES PRICE LIST"]
[]
[null,"GM115956-S1","48/60 RCL Auto Dual fuel Changeover Kit",{"$f":"E9*$E$4","v":0},709.3,null,null,null,null,null,"X","X"]
["GM81529-KP1-QS","GM81529-S1"," Programmable Interface Module (PIM) (UL)",0,390,null,null,"X","X","X","X","X"]
{"$rows_left_out":32}
{"sheet":"PORTABLES_PL","index":4,"n_rows":68,"n_cols":22,"rows_kept":68,"cut":false,"hidden":true,"merged":[[5,1,5,3],[5,14,5,16],[5,10,5,12]]}
[null,null,null,null,null,null,null,null,null,null,null,null,null,null,null,null,null,null,null,null,null,{"$f":"[3]Generators_PL!H1","v":"Residential Price List"}]
[null,null,null,null,null,null,null,null,null,null,null,null,null,null,null,null,null,null,null,null,null,{"$f":"Generators_PL!H2","v":"EFFECTIVE DATE: 05/01/2023"}]
[null,null,null,null,null,null,null,null,null,null,null,null,null,null,null,null,null,null,null,null,null,{"$f":"[3]Generators_PL!H3","v":"Pricing is in USD"}]
[]
["*denotes new or updated models"]
[null,"Certifications",null,null,null,null,null,null,null,null,"Size (in.)",null,null,null,"Plugs"]
["Specification #","EPA","CARB","CSA","Description","Rated\n(kW)","Running\n(kW)","Fuel\nTank\nSize\n(Gal)","GFCI","Weight","L","W","H","Low Oil\nShutdown","USB Plug","AC Plug","DC Plug","Pallet\nQty","Net Price","Available Quantity             (as of 10/20/22)","Special Exit Price                 (no additional multipliers/ discounts applies)","SRP                     "]
["PORTABLE GENSETS: 50-State ARB/EPA"]
[]
["PA-eGen18iS-3001","x","x","x","Portables Inverter 1800W Solar Charge ",1.8,1.44,"N/A","Y",116,22,18,26,"N/A",2,2,2,8,{"$f":"IF(ISERROR(VLOOKUP($J10,[3]INPUTS!$H:$I,2,FALSE)),INDEX('[3]CURRENT PRICING'!$A:$U,MATCH($A10,'[3]CURRENT PRICING'!$B:$B,0),MATCH([3]Generators_PL!$H$1,'[3]CURRENT PRICING'!$11:$11,0)),VLOOKUP($J10,[3]INPUTS!$H:$I,2,FALSE))","v":944.32500000000005},{"$f":"VLOOKUP($A10,'[3]CURRENT PRICING'!$B:$F,3,FALSE)","v":1399},{"$f":"VLOOKUP($A10,'[3]CURRENT PRICING'!$B:$F,4,FALSE)","v":1329},{"$f":"VLOOKUP($A10,'[3]CURRENT PRICING'!$B:$F,5,FALSE)","v":1199}]
{"$rows_left_out":59}
{"sheet":"ATS_PL","index":5,"n_rows":88,"n_cols":18,"rows_kept":88,"cut":false,"hidden":false,"merged":[[2,1,2,2]]}
[null,null,null,null,null,null,null,null,null,null,null,null,null,null,null,null,null,{"$f":"Generators_PL!H1","v":"Residential Price List"}]
[null,null,null,null,null,null,null,null,null,null,null,null,null,null,null,null,null,{"$f":"Generators_PL!H2","v":"EFFECTIVE DATE: 05/01/2023"}]
[null,null,null,null,null,null,null,null,null,null,null,null,null,null,null,null,null,{"$f":"Generators_PL!H3","v":"Pricing is in USD"}]
[null,null,null,null,null,null,null,null,null,null,null,null,null,null,null,{"$f":"Generators_PL!F4","v":0}]
["*denotes new or updated models"]
["Specification #","Amps","Phase","Voltage","Poles/Wire","Encl Type","Encl Material","Load Center","Service Entrance","UL","cUL","CSA","Combined Board w/Load Shed ","Compatible with Load Shed Kit","Net Price","List Price","MSRP","MAP"]
["RESIDENTIAL ATS PRICE LIST"]
[]
["RDT-CFNA-0100A-QS5",100,"1Ph","240V","2Pole/3Wire","NEMA 1","Steel","",null,"X",null,"X",null,"X",{"$f":"P9*$P$4","v":0},845,690,675]
["RDT-CFNA-0200A-QS5",200,"1Ph","240V","2Pole/3Wire","NEMA 1","Steel","",null,"X",null,"X",null,"X",0,1200,980,960]
{"$rows_left_out":79}
{"sheet":"ATS_PL_Canada","index":6,"n_rows":88,"n_cols":21,"rows_kept":88,"cut":false,"hidden":false,"merged":[[2,1,2,2],[4,14,4,17],[4,18,4,19],[1,5,1,10]]}
[null,null,null,null,null,null,null,null,null,null,null,null,null,null,null,null,null,null,null,{"$f":"Generators_PL!H1","v":"Residential Price List"}]
[null,null,null,null,null,"CANADA",null,null,null,null,null,null,null,null,null,null,null,null,null,{"$f":"Generators_PL!H2","v":"EFFECTIVE DATE: 05/01/2023"}]
[null,null,null,null,null,null,null,null,null,null,null,null,null,null,null,null,null,null,null,{"$f":"Generators_PL!F4","v":0}]
[]
["*denotes new or updated models",null,null,null,null,null,null,null,null,null,null,null,null,null,"USD",null,null,null,"CAD",null,1.35]
["Specification #","Amps","Phase","Voltage","Poles/Wire","Encl Type","Encl Material","Load Center","Service Entrance","UL","cUL","CSA","Combined Board w/Load Shed ","Compatible with Load Shed Kit","Net Price","List Price","MSRP","MAP","MSRP","MAP"]
["RESIDENTIAL ATS PRICE LIST"]
[]
["RDT-CFNA-0100A-QS5",100,"1Ph","240V","2Pole/3Wire","NEMA 1","Steel","",null,"X",null,"X",null,"X",{"$f":"P9*$T$3","v":0},{"$f":"ATS_PL!P9","v":845},{"$f":"ATS_PL!Q9","v":690},{"$f":"ATS_PL!R9","v":675},{"$f":"Q9*$U$5","v":931.50000000000011},911.25000000000011]
["RDT-CFNA-0200A-QS5",200,"1Ph","240V","2Pole/3Wire","NEMA 1","Steel","",null,"X",null,"X",null,"X",{"$f":"P10*$T$3","v":0},{"$f":"ATS_PL!P10","v":1200},{"$f":"ATS_PL!Q10","v":980},{"$f":"ATS_PL!R10","v":960},1323,1296]
{"$rows_left_out":79}
{"sheet":"ATS_PARTS_PL","index":7,"n_rows":38,"n_cols":11,"rows_kept":38,"cut":false,"hidden":false,"merged":[[2,2,2,3],[25,7,26,9]]}
[null,null,null,null,null,null,null,null,null,null,{"$f":"Generators_PL!H1","v":"Residential Price List"}]
[null,null,null,null,null,null,null,null,null,null,{"$f":"Generators_PL!H2","v":"EFFECTIVE DATE: 05/01/2023"}]
[null,null,null,null,null,null,null,null,null,null,{"$f":"Generators_PL!H3","v":"Pricing is in USD"}]
[null,null,null,null,null,null,null,null,{"$f":"Generators_PL!F4","v":0}]
[null,null,"Please click on the following link to access Accessory Kit Pricing",":AMP STOCK ORDERS"]
["OLD PART NUMBER (superseded by the New Part Number starting on 4/3/2023)","NEW PART NUMBER ","Description","RDT","RXT","Compatible w/ Contactor","Service Entrance","Net Price","Aftermarket Parts\nList Price","MSRP","MAP"]
["RESIDENTIAL ATS LOOSE ACCESSORIES PRICE LIST"]
[]
["GM84662-KP1-QS","GM84662-S1","Status Indicator Module",null,"X",null,null,{"$f":"I9*I$4","v":0},{"$f":"VLOOKUP(B9,'[4]AMP List Prices'!$A:$D,4,FALSE)","v":40}]
["GM84662-KP2-QS","GM84662-S2","Status Indicator Module, Load Control",null,"X",null,null,{"$f":"I10*I$4","v":0},{"$f":"VLOOKUP(B10,'[4]AMP List Prices'!$A:$D,4,FALSE)","v":55}]
{"$rows_left_out":29}
{"sheet":"PORTABLES PRICING ANALYSIS","index":8,"n_rows":14,"n_cols":19,"rows_kept":14,"cut":false,"hidden":true,"merged":[]}
[null,null,null,null,null,0.64,null,0.67332999999999998,null,0.65353000000000006,null,0.70587999999999995,null,0.63724999999999998,null,0.64705999999999997,null,0.69313999999999998]
["Model","COST","MAP","MSRP","LIST","DIST","% Margin","Wholesale - Silver","% Margin","Wholesale - Platinum","% Margin","Etail - Silver","% Margin","Etail - Platinum","% Margin","Etail - Gold","% Margin","Retail","% Margin"]
["PA-eGen18iS-3001",{"$f":"63333/100","v":633.33000000000004},{"$f":"VLOOKUP(A3,PORTABLES_PL!$A:$T,13,FALSE)","v":26},{"$f":"VLOOKUP(A3,PORTABLES_PL!$A:$S,12,FALSE)","v":18},{"$f":"VLOOKUP(A3,PORTABLES_PL!$A:$U,14,FALSE)","v":"N/A"},{"$f":"$E3*F$1","v":{"$error":"#VALUE!"}},{"$f":"(F3-B3)/F3","v":{"$error":"#VALUE!"}},{"$f":"$E3*H$1","v":{"$error":"#VALUE!"}},{"$f":"(H3-B3)/H3","v":{"$error":"#VALUE!"}},{"$f":"$E3*J$1","v":{"$error":"#VALUE!"}},{"$f":"(J3-B3)/J3","v":{"$error":"#VALUE!"}},{"$f":"$E3*L$1","v":{"$error":"#VALUE!"}},{"$f":"(L3-B3)/L3","v":{"$error":"#VALUE!"}},{"$f":"$E3*N$1","v":{"$error":"#VALUE!"}},{"$f":"(N3-B3)/N3","v":{"$error":"#VALUE!"}},{"$f":"$E3*P$1","v":{"$error":"#VALUE!"}},{"$f":"(P3-B3)/P3","v":{"$error":"#VALUE!"}},{"$f":"$E3*R$1","v":{"$error":"#VALUE!"}},{"$f":"(R3-B3)/R3","v":{"$error":"#VALUE!"}}]
["PA-GEN50-3003",{"$f":"50582.51/100","v":505.82510000000002},{"$f":"VLOOKUP(A4,PORTABLES_PL!$A:$T,13,FALSE)","v":24},{"$f":"VLOOKUP(A4,PORTABLES_PL!$A:$S,12,FALSE)","v":23},{"$f":"VLOOKUP(A4,PORTABLES_PL!$A:$U,14,FALSE)","v":"Y"},{"$error":"#VALUE!"},{"$f":"(F4-B4)/F4","v":{"$error":"#VALUE!"}},{"$error":"#VALUE!"},{"$f":"(H4-B4)/H4","v":{"$error":"#VALUE!"}},{"$error":"#VALUE!"},{"$f":"(J4-B4)/J4","v":{"$error":"#VALUE!"}},{"$error":"#VALUE!"},{"$f":"(L4-B4)/L4","v":{"$error":"#VALUE!"}},{"$error":"#VALUE!"},{"$f":"(N4-B4)/N4","v":{"$error":"#VALUE!"}},{"$error":"#VALUE!"},{"$f":"(P4-B4)/P4","v":{"$error":"#VALUE!"}},{"$error":"#VALUE!"},{"$f":"(R4-B4)/R4","v":{"$error":"#VALUE!"}}]
["PA-PRO64-3002",{"$f":"47306/100","v":473.06},{"$f":"VLOOKUP(A5,PORTABLES_PL!$A:$T,13,FALSE)","v":24},{"$f":"VLOOKUP(A5,PORTABLES_PL!$A:$S,12,FALSE)","v":23},{"$f":"VLOOKUP(A5,PORTABLES_PL!$A:$U,14,FALSE)","v":"Y"},{"$error":"#VALUE!"},{"$error":"#VALUE!"},{"$error":"#VALUE!"},{"$error":"#VALUE!"},{"$error":"#VALUE!"},{"$error":"#VALUE!"},{"$error":"#VALUE!"},{"$error":"#VALUE!"},{"$error":"#VALUE!"},{"$error":"#VALUE!"},{"$error":"#VALUE!"},{"$error":"#VALUE!"},{"$error":"#VALUE!"},{"$error":"#VALUE!"}]
["PA-PRO64E-3002",{"$f":"56483/100","v":564.83000000000004},{"$f":"VLOOKUP(A6,PORTABLES_PL!$A:$T,13,FALSE)","v":24},{"$f":"VLOOKUP(A6,PORTABLES_PL!$A:$S,12,FALSE)","v":23},{"$f":"VLOOKUP(A6,PORTABLES_PL!$A:$U,14,FALSE)","v":"Y"},{"$error":"#VALUE!"},{"$error":"#VALUE!"},{"$error":"#VALUE!"},{"$error":"#VALUE!"},{"$error":"#VALUE!"},{"$error":"#VALUE!"},{"$error":"#VALUE!"},{"$error":"#VALUE!"},{"$error":"#VALUE!"},{"$error":"#VALUE!"},{"$error":"#VALUE!"},{"$error":"#VALUE!"},{"$error":"#VALUE!"},{"$error":"#VALUE!"}]
["PA-PRO90-3002",{"$f":"57264/100","v":572.64},{"$f":"VLOOKUP(A7,PORTABLES_PL!$A:$T,13,FALSE)","v":24},{"$f":"VLOOKUP(A7,PORTABLES_PL!$A:$S,12,FALSE)","v":23},{"$f":"VLOOKUP(A7,PORTABLES_PL!$A:$U,14,FALSE)","v":"Y"},{"$error":"#VALUE!"},{"$error":"#VALUE!"},{"$error":"#VALUE!"},{"$error":"#VALUE!"},{"$error":"#VALUE!"},{"$error":"#VALUE!"},{"$error":"#VALUE!"},{"$error":"#VALUE!"},{"$error":"#VALUE!"},{"$error":"#VALUE!"},{"$error":"#VALUE!"},{"$error":"#VALUE!"},{"$error":"#VALUE!"},{"$error":"#VALUE!"}]
["PA-PRO90E-3002",{"$f":"64543/100","v":645.42999999999995},{"$f":"VLOOKUP(A8,PORTABLES_PL!$A:$T,13,FALSE)","v":24},{"$f":"VLOOKUP(A8,PORTABLES_PL!$A:$S,12,FALSE)","v":23},{"$f":"VLOOKUP(A8,PORTABLES_PL!$A:$U,14,FALSE)","v":"Y"},{"$error":"#VALUE!"},{"$error":"#VALUE!"},{"$error":"#VALUE!"},{"$error":"#VALUE!"},{"$error":"#VALUE!"},{"$error":"#VALUE!"},{"$error":"#VALUE!"},{"$error":"#VALUE!"},{"$error":"#VALUE!"},{"$error":"#VALUE!"},{"$error":"#VALUE!"},{"$error":"#VALUE!"},{"$error":"#VALUE!"},{"$error":"#VALUE!"}]
["PA-PRO123EFI-3001",{"$f":"267120/100","v":2671.2},{"$f":"VLOOKUP(A9,PORTABLES_PL!$A:$T,13,FALSE)","v":{"$error":"#N/A"}},{"$f":"VLOOKUP(A9,PORTABLES_PL!$A:$S,12,FALSE)","v":{"$error":"#N/A"}},{"$f":"VLOOKUP(A9,PORTABLES_PL!$A:$U,14,FALSE)","v":{"$error":"#N/A"}},{"$error":"#N/A"},{"$error":"#N/A"},{"$error":"#N/A"},{"$error":"#N/A"},{"$error":"#N/A"},{"$error":"#N/A"},{"$error":"#N/A"},{"$error":"#N/A"},{"$error":"#N/A"},{"$error":"#N/A"},{"$error":"#N/A"},{"$error":"#N/A"},{"$error":"#N/A"},{"$error":"#N/A"}]
["PA-GEN50-2003","N/A",{"$f":"VLOOKUP(A10,PORTABLES_PL!$A:$T,13,FALSE)","v":25},{"$f":"VLOOKUP(A10,PORTABLES_PL!$A:$S,12,FALSE)","v":24},{"$f":"VLOOKUP(A10,PORTABLES_PL!$A:$U,14,FALSE)","v":"Y"},{"$error":"#VALUE!"},null,{"$error":"#VALUE!"},null,{"$error":"#VALUE!"},null,{"$error":"#VALUE!"},null,{"$error":"#VALUE!"},null,{"$error":"#VALUE!"},null,{"$error":"#VALUE!"}]
{"$rows_left_out":5}
{"sheet":"PORTABLES_PARTS","index":9,"n_rows":23,"n_cols":9,"rows_kept":23,"cut":false,"hidden":true,"merged":[]}
[null,null,null,null,null,"Distribution"]
[null,null,null,null,null,"EFFECTIVE DATE: 4/20/2020"]
[]
[]
[]
["Specification #","Description","MSRP","MAP","List Price","Net Price"]
["PORTABLE GENSETS: ACCESSORIES"]
[]
["17 755 60-S","Tri-Fuel Regulator Kit (PRO64 models)",null,null,null,null,null,null,{"$f":"$F$1&A9","v":"Distribution17 755 60-S"}]
["17 337 10-S","Natural Gas Fuel Optimizer Kit  (PRO64 models)",null,null,null,null,null,null,"Distribution17 337 10-S"]
{"$rows_left_out":13}